FailedConsole Output

Started by an SCM change
Building on master in workspace /home/tomcat/.jenkins/jobs/oxCas/workspace
 > git rev-parse --is-inside-work-tree # timeout=10
Fetching changes from the remote Git repository
 > git config remote.origin.url https://github.com/GluuFederation/oxCas # timeout=10
Fetching upstream changes from https://github.com/GluuFederation/oxCas
 > git --version # timeout=10
 > git fetch --tags --progress https://github.com/GluuFederation/oxCas +refs/heads/*:refs/remotes/origin/*
 > git rev-parse refs/remotes/origin/master^{commit} # timeout=10
 > git rev-parse refs/remotes/origin/origin/master^{commit} # timeout=10
Checking out Revision 74f4f1ed84690fcdaf689d4d5acbdfbb8980bd42 (refs/remotes/origin/master)
 > git config core.sparsecheckout # timeout=10
 > git checkout -f 74f4f1ed84690fcdaf689d4d5acbdfbb8980bd42
Commit message: "Version 4.0.0"
 > git rev-list --no-walk 32f9bbbb1f5eb57a78734482c51e73967e962948 # timeout=10
[workspace] $ /home/tomcat/.jenkins/tools/hudson.tasks.Maven_MavenInstallation/maven_3.3.9/bin/mvn -DVERSION_NAME=master clean install
[INFO] Scanning for projects...
[INFO]                                                                         
[INFO] ------------------------------------------------------------------------
[INFO] Building OX CAS 4.0.0-SNAPSHOT
[INFO] ------------------------------------------------------------------------
[INFO] 
[INFO] --- maven-clean-plugin:2.5:clean (default-clean) @ oxcas ---
[INFO] Deleting /home/tomcat/.jenkins/jobs/oxCas/workspace/target
[INFO] 
[INFO] --- buildnumber-maven-plugin:1.1:create (default) @ oxcas ---
[INFO] Checking for local modifications: skipped.
[INFO] Updating project files from SCM: skipped.
[INFO] Executing: /bin/sh -c cd /home/tomcat/.jenkins/jobs/oxCas/workspace && git rev-parse --verify HEAD
[INFO] Working directory: /home/tomcat/.jenkins/jobs/oxCas/workspace
[INFO] Storing buildNumber: 74f4f1ed84690fcdaf689d4d5acbdfbb8980bd42 at timestamp: 1530552085103
[INFO] Executing: /bin/sh -c cd /home/tomcat/.jenkins/jobs/oxCas/workspace && git rev-parse --verify HEAD
[INFO] Working directory: /home/tomcat/.jenkins/jobs/oxCas/workspace
[INFO] Storing buildScmBranch: UNKNOWN
[INFO] 
[INFO] --- maven-antrun-plugin:1.6:run (prepare) @ oxcas ---
[INFO] Executing tasks

main:
    [unzip] Expanding: /home/tomcat/.jenkins/jobs/oxCas/workspace/src/main/patches.zip into /home/tomcat/.jenkins/jobs/oxCas/workspace/target/patches
[INFO] Executed tasks
[INFO] 
[INFO] --- download-maven-plugin:1.2.1:wget (download-dist) @ oxcas ---
[INFO] Got from cache: /var/www/html/maven/.cache/maven-download-plugin/v4.0.2.zip
[INFO] 
[INFO] --- maven-patch-plugin:1.2:apply (gluu-patch) @ oxcas ---
[INFO] Applying patch: 01.license.patch
[INFO] Applying patch: 02.ldap-server-support.patch
[INFO] Applying patch: 03.memcached-support.patch
[INFO] Applying patch: 04.saml-support.patch
[INFO] Applying patch: 05.improve_logging.patch
[INFO] Applying patch: 10.cas-properties.patch
[INFO] Applying patch: 11.ox-versions.patch
[INFO] Applying patch: 12.gluu-repository.patch
[INFO] Applying patch: 20.ldap.authentication.patch
[INFO] Applying patch: 30.openid-auth-client-properties.patch
[INFO] Applying patch: 31.openid-auth-client-module.patch
[INFO] Applying patch: 32.openid-auth-client-configuration.patch
[INFO] Applying patch: 35.allow-ox-default-authenticator.patch
[INFO] Applying patch: 50.ad-properties.patch
[INFO] Applying patch: 51.ad-module.patch
[INFO] Applying patch: 52.ad-configuration.patch
[INFO] Applying patch: 60.openid-default-authentication.patch
[INFO] Applying patch: 90.sync-with-ox-version.patch
[INFO] 
[INFO] --- maven-invoker-plugin:1.9:run (default) @ oxcas ---
[WARNING] Filtering of parent/child POMs is not supported without cloning the projects
[INFO] Building: pom.xml
[INFO] [INFO] Scanning for projects...
[INFO] [WARNING] 
[INFO] [WARNING] Some problems were encountered while building the effective model for org.xdi:ox-cas-server-webapp:war:4.0.0-SNAPSHOT
[INFO] [WARNING] 'version' contains an expression but should be a constant. @ org.xdi:ox-cas-server-webapp:${oxcas.version}, /home/tomcat/.jenkins/jobs/oxCas/workspace/target/cas-4.0.2/cas-server-webapp/interpolated-pom.xml, line 29, column 12
[INFO] [WARNING] 
[INFO] [WARNING] It is highly recommended to fix these problems because they threaten the stability of your build.
[INFO] [WARNING] 
[INFO] [WARNING] For this reason, future Maven versions might no longer support building such malformed projects.
[INFO] [WARNING] 
[INFO] [INFO]                                                                         
[INFO] [INFO] ------------------------------------------------------------------------
[INFO] [INFO] Building OX Gluu CAS Web Application 4.0.0-SNAPSHOT
[INFO] [INFO] ------------------------------------------------------------------------
[INFO] [INFO] Downloading: http://developer.ja-sig.org/maven2/org/xdi/cas-openid-auth-client/4.0.0-SNAPSHOT/maven-metadata.xml
[INFO] [INFO] Downloading: http://repository.jboss.org/nexus/content/groups/public-jboss/org/xdi/cas-openid-auth-client/4.0.0-SNAPSHOT/maven-metadata.xml
[INFO] [INFO] Downloading: https://oss.sonatype.org/content/repositories/snapshots/org/xdi/cas-openid-auth-client/4.0.0-SNAPSHOT/maven-metadata.xml
[INFO] [INFO] Downloading: http://ox.gluu.org/maven/org/xdi/cas-openid-auth-client/4.0.0-SNAPSHOT/maven-metadata.xml
[INFO] [INFO] Downloading: http://developer.ja-sig.org/maven2/org/xdi/cas-openid-auth-client/4.0.0-SNAPSHOT/cas-openid-auth-client-4.0.0-SNAPSHOT.pom
[INFO] [INFO] Downloading: http://repository.jboss.org/nexus/content/groups/public-jboss/org/xdi/cas-openid-auth-client/4.0.0-SNAPSHOT/cas-openid-auth-client-4.0.0-SNAPSHOT.pom
[INFO] [INFO] Downloading: http://ox.gluu.org/maven/org/xdi/cas-openid-auth-client/4.0.0-SNAPSHOT/cas-openid-auth-client-4.0.0-SNAPSHOT.pom
[INFO] [INFO] Downloading: https://oss.sonatype.org/content/repositories/snapshots/org/xdi/cas-openid-auth-client/4.0.0-SNAPSHOT/cas-openid-auth-client-4.0.0-SNAPSHOT.pom
[INFO] [WARNING] The POM for org.xdi:cas-openid-auth-client:jar:4.0.0-SNAPSHOT is missing, no dependency information available
[INFO] [INFO] Downloading: http://developer.ja-sig.org/maven2/org/xdi/openid-auth-client/4.0.0-SNAPSHOT/maven-metadata.xml
[INFO] [INFO] Downloading: http://repository.jboss.org/nexus/content/groups/public-jboss/org/xdi/openid-auth-client/4.0.0-SNAPSHOT/maven-metadata.xml
[INFO] [INFO] Downloading: https://oss.sonatype.org/content/repositories/snapshots/org/xdi/openid-auth-client/4.0.0-SNAPSHOT/maven-metadata.xml
[INFO] [INFO] Downloading: http://developer.ja-sig.org/maven2/org/xdi/openid-auth-client/4.0.0-SNAPSHOT/openid-auth-client-4.0.0-SNAPSHOT.pom
[INFO] [INFO] Downloading: https://oss.sonatype.org/content/repositories/snapshots/org/xdi/openid-auth-client/4.0.0-SNAPSHOT/openid-auth-client-4.0.0-SNAPSHOT.pom
[INFO] [WARNING] The POM for org.xdi:openid-auth-client:jar:4.0.0-SNAPSHOT is missing, no dependency information available
[INFO] [INFO] Downloading: http://developer.ja-sig.org/maven2/org/xdi/cas-openid-auth-client/4.0.0-SNAPSHOT/cas-openid-auth-client-4.0.0-SNAPSHOT.jar
[INFO] [INFO] Downloading: http://developer.ja-sig.org/maven2/org/xdi/openid-auth-client/4.0.0-SNAPSHOT/openid-auth-client-4.0.0-SNAPSHOT.jar
[INFO] [INFO] Downloading: http://repository.jboss.org/nexus/content/groups/public-jboss/org/xdi/cas-openid-auth-client/4.0.0-SNAPSHOT/cas-openid-auth-client-4.0.0-SNAPSHOT.jar
[INFO] [INFO] Downloading: http://ox.gluu.org/maven/org/xdi/cas-openid-auth-client/4.0.0-SNAPSHOT/cas-openid-auth-client-4.0.0-SNAPSHOT.jar
[INFO] [INFO] Downloading: https://oss.sonatype.org/content/repositories/snapshots/org/xdi/cas-openid-auth-client/4.0.0-SNAPSHOT/cas-openid-auth-client-4.0.0-SNAPSHOT.jar
[INFO] [INFO] Downloading: https://oss.sonatype.org/content/repositories/snapshots/org/xdi/openid-auth-client/4.0.0-SNAPSHOT/openid-auth-client-4.0.0-SNAPSHOT.jar
[INFO] [INFO] ------------------------------------------------------------------------
[INFO] [INFO] BUILD FAILURE
[INFO] [INFO] ------------------------------------------------------------------------
[INFO] [INFO] Total time: 7.659 s
[INFO] [INFO] Finished at: 2018-07-02T13:21:43-04:00
[INFO] [INFO] Final Memory: 13M/142M
[INFO] [INFO] ------------------------------------------------------------------------
[INFO] [ERROR] Failed to execute goal on project ox-cas-server-webapp: Could not resolve dependencies for project org.xdi:ox-cas-server-webapp:war:4.0.0-SNAPSHOT: The following artifacts could not be resolved: org.xdi:cas-openid-auth-client:jar:4.0.0-SNAPSHOT, org.xdi:openid-auth-client:jar:4.0.0-SNAPSHOT: Could not find artifact org.xdi:cas-openid-auth-client:jar:4.0.0-SNAPSHOT in jasig-repository (http://developer.ja-sig.org/maven2) -> [Help 1]
[INFO] [ERROR] 
[INFO] [ERROR] To see the full stack trace of the errors, re-run Maven with the -e switch.
[INFO] [ERROR] Re-run Maven using the -X switch to enable full debug logging.
[INFO] [ERROR] 
[INFO] [ERROR] For more information about the errors and possible solutions, please read the following articles:
[INFO] [ERROR] [Help 1] http://cwiki.apache.org/confluence/display/MAVEN/DependencyResolutionException
[INFO] ..FAILED (11.1 s)
[INFO]   The build exited with code 1. See /home/tomcat/.jenkins/jobs/oxCas/workspace/target/cas-4.0.2/cas-server-webapp/build.log for details.
[INFO] -------------------------------------------------
[INFO] Build Summary:
[INFO]   Passed: 0, Failed: 1, Errors: 0, Skipped: 0
[INFO] -------------------------------------------------
[ERROR] The following builds failed:
[ERROR] *  pom.xml
[INFO] -------------------------------------------------
[INFO] ------------------------------------------------------------------------
[INFO] BUILD FAILURE
[INFO] ------------------------------------------------------------------------
[INFO] Total time: 26.684 s
[INFO] Finished at: 2018-07-02T13:21:43-04:00
[INFO] Final Memory: 14M/168M
[INFO] ------------------------------------------------------------------------
[ERROR] Failed to execute goal org.apache.maven.plugins:maven-invoker-plugin:1.9:run (default) on project oxcas: 1 build failed. See console output above for details. -> [Help 1]
[ERROR] 
[ERROR] To see the full stack trace of the errors, re-run Maven with the -e switch.
[ERROR] Re-run Maven using the -X switch to enable full debug logging.
[ERROR] 
[ERROR] For more information about the errors and possible solutions, please read the following articles:
[ERROR] [Help 1] http://cwiki.apache.org/confluence/display/MAVEN/MojoFailureException
Build step 'Invoke top-level Maven targets' marked build as failure
Not sending mail to unregistered user Yuriy.Movchan@gmail.com
Sending e-mails to: support@gluu.org
Finished: FAILURE