FailedConsole Output

Started by an SCM change
Running as SYSTEM
Building on master in workspace /home/jenkins/.jenkins/jobs/oxAuth_4.3.0_LDAP/workspace
The recommended git tool is: NONE
No credentials specified
 > git rev-parse --is-inside-work-tree # timeout=10
Fetching changes from the remote Git repository
 > git config remote.origin.url https://github.com/GluuFederation/oxAuth # timeout=10
Fetching upstream changes from https://github.com/GluuFederation/oxAuth
 > git --version # timeout=10
 > git --version # 'git version 1.8.3.1'
 > git fetch --tags --progress https://github.com/GluuFederation/oxAuth +refs/heads/*:refs/remotes/origin/* # timeout=10
 > git rev-parse refs/remotes/origin/version_4.3.0^{commit} # timeout=10
 > git rev-parse refs/remotes/origin/origin/version_4.3.0^{commit} # timeout=10
Checking out Revision 24b854bf881fb7f41b5b5635170446f4b6998902 (refs/remotes/origin/version_4.3.0)
 > git config core.sparsecheckout # timeout=10
 > git checkout -f 24b854bf881fb7f41b5b5635170446f4b6998902 # timeout=10
Commit message: "Version 4.3.0.Final"
 > git rev-list --no-walk b1f9655320496ed9ac601a4da3a2e47b2645534a # timeout=10
Run condition [Boolean condition] enabling prebuild for step [Trigger/call builds on other projects]
Run condition [Current build status] enabling prebuild for step [BuilderChain]
[workspace] $ /bin/bash /opt/jetty/temp/jenkins3684254741128401510.sh
Cloning into 'oxHudsonProfiles'...
[workspace] $ /home/jenkins/.jenkins/tools/hudson.tasks.Maven_MavenInstallation/maven_3.3.9/bin/mvn -DDEPLOY_BUILD=true -DVERSION_NAME=version_4.3.0 -DPROFILE_NAME=ce-dev5.gluu.org -DDEVELOPMENT_BUILD=false -DMAVEN_SKIP_TESTS=false -Dpython.import.site=false -DPYTHON_HOME=/opt/jython -Dcfg=ce-dev5.gluu.org -Dmaven.test.skip=false -Ddevelopment-build=false clean compile test-compile install javadoc:javadoc site
[INFO] Scanning for projects...
Downloading: https://repository.jboss.org/nexus/content/groups/public-jboss/org/gluu/gluu-core-bom/4.3.0.Final/gluu-core-bom-4.3.0.Final.pom

Downloading: https://ox.gluu.org/maven/org/gluu/gluu-core-bom/4.3.0.Final/gluu-core-bom-4.3.0.Final.pom
4/22 KB   
8/22 KB   
12/22 KB   
16/22 KB   
20/22 KB   
22/22 KB   
[WARNING] Could not validate integrity of download from https://ox.gluu.org/maven/org/gluu/gluu-core-bom/4.3.0.Final/gluu-core-bom-4.3.0.Final.pom: Checksum validation failed, no checksums available
[WARNING] Checksum validation failed, no checksums available for https://ox.gluu.org/maven/org/gluu/gluu-core-bom/4.3.0.Final/gluu-core-bom-4.3.0.Final.pom
           
Downloaded: https://ox.gluu.org/maven/org/gluu/gluu-core-bom/4.3.0.Final/gluu-core-bom-4.3.0.Final.pom (22 KB at 149.8 KB/sec)
[INFO] ------------------------------------------------------------------------
[INFO] Reactor Build Order:
[INFO] 
[INFO] oxAuth
[INFO] oxAuth Model
[INFO] Persistence model
[INFO] oxAuth Client
[INFO] oxauth-static
[INFO] oxAuth Common
[INFO] oxAuth Server
[INFO]                                                                         
[INFO] ------------------------------------------------------------------------
[INFO] Building oxAuth 4.3.0.Final
[INFO] ------------------------------------------------------------------------
[INFO] 
[INFO] --- maven-clean-plugin:2.5:clean (default-clean) @ oxauth ---
[INFO] Deleting /home/jenkins/.jenkins/jobs/oxAuth_4.3.0_LDAP/workspace/target
[INFO] 
[INFO] --- maven-install-plugin:2.3.1:install (default-install) @ oxauth ---
[INFO] Installing /home/jenkins/.jenkins/jobs/oxAuth_4.3.0_LDAP/workspace/pom.xml to /var/www/html/maven/org/gluu/oxauth/4.3.0.Final/oxauth-4.3.0.Final.pom
[INFO] 
[INFO] >>> maven-javadoc-plugin:3.0.1:javadoc (default-cli) > generate-sources @ oxauth >>>
[INFO] 
[INFO] <<< maven-javadoc-plugin:3.0.1:javadoc (default-cli) < generate-sources @ oxauth <<<
[INFO] 
[INFO] --- maven-javadoc-plugin:3.0.1:javadoc (default-cli) @ oxauth ---
[INFO] 
[INFO] --- maven-site-plugin:2.1.1:site (default-site) @ oxauth ---
Downloading: https://repo2.maven.org/maven2/org/bouncycastle/org/apache/maven/skins/maven-default-skin/maven-metadata.xml
Downloading: https://ox.gluu.org/maven/org/apache/maven/skins/maven-default-skin/maven-metadata.xml
Downloading: https://repository.jboss.org/nexus/content/groups/public-jboss/org/apache/maven/skins/maven-default-skin/maven-metadata.xml
Downloading: https://repo1.maven.org/maven2/org/apache/maven/skins/maven-default-skin/maven-metadata.xml
           
Downloading: https://repo.maven.apache.org/maven2/org/apache/maven/skins/maven-default-skin/maven-metadata.xml
           
428/428 B   
428/428 B   428/428 B   
                        
Downloaded: https://repo.maven.apache.org/maven2/org/apache/maven/skins/maven-default-skin/maven-metadata.xml (428 B at 2.4 KB/sec)
                        
Downloaded: https://repo1.maven.org/maven2/org/apache/maven/skins/maven-default-skin/maven-metadata.xml (428 B at 1.5 KB/sec)
                        
[WARNING] Could not transfer metadata org.apache.maven.skins:maven-default-skin/maven-metadata.xml from/to bouncycastle (https://repo2.maven.org/maven2/org/bouncycastle): repo2.maven.org: Name or service not known
[INFO]                                                                         
[INFO] ------------------------------------------------------------------------
[INFO] Building oxAuth Model 4.3.0.Final
[INFO] ------------------------------------------------------------------------
Downloading: https://repository.jboss.org/nexus/content/groups/public-jboss/org/gluu/oxeleven-client/4.3.0.Final/oxeleven-client-4.3.0.Final.pom
                        
Downloading: https://ox.gluu.org/maven/org/gluu/oxeleven-client/4.3.0.Final/oxeleven-client-4.3.0.Final.pom
                        
Downloading: https://repo2.maven.org/maven2/org/bouncycastle/org/gluu/oxeleven-client/4.3.0.Final/oxeleven-client-4.3.0.Final.pom
                        
Downloading: https://repo1.maven.org/maven2/org/gluu/oxeleven-client/4.3.0.Final/oxeleven-client-4.3.0.Final.pom
                        
Downloading: https://repo.maven.apache.org/maven2/org/gluu/oxeleven-client/4.3.0.Final/oxeleven-client-4.3.0.Final.pom
                        
Downloading: https://repository.jboss.org/nexus/content/groups/public-jboss/org/gluu/oxeleven-model/4.3.0.Final/oxeleven-model-4.3.0.Final.pom
                        
Downloading: https://ox.gluu.org/maven/org/gluu/oxeleven-model/4.3.0.Final/oxeleven-model-4.3.0.Final.pom
                        
Downloading: https://repo2.maven.org/maven2/org/bouncycastle/org/gluu/oxeleven-model/4.3.0.Final/oxeleven-model-4.3.0.Final.pom
                        
Downloading: https://repo1.maven.org/maven2/org/gluu/oxeleven-model/4.3.0.Final/oxeleven-model-4.3.0.Final.pom
                        
Downloading: https://repo.maven.apache.org/maven2/org/gluu/oxeleven-model/4.3.0.Final/oxeleven-model-4.3.0.Final.pom
                        
Downloading: https://ox.gluu.org/maven/org/gluu/gluu-orm-annotation/4.3.0.Final/gluu-orm-annotation-4.3.0.Final.pom
                        
Downloading: https://repo2.maven.org/maven2/org/bouncycastle/org/gluu/gluu-orm-annotation/4.3.0.Final/gluu-orm-annotation-4.3.0.Final.pom
                        
Downloading: https://repo.maven.apache.org/maven2/org/gluu/gluu-orm-annotation/4.3.0.Final/gluu-orm-annotation-4.3.0.Final.pom
                        
Downloading: https://ox.gluu.org/maven/org/gluu/oxcore-util/4.3.0.Final/oxcore-util-4.3.0.Final.pom
                        
Downloading: https://repo2.maven.org/maven2/org/bouncycastle/org/gluu/oxcore-util/4.3.0.Final/oxcore-util-4.3.0.Final.pom
                        
Downloading: https://repo.maven.apache.org/maven2/org/gluu/oxcore-util/4.3.0.Final/oxcore-util-4.3.0.Final.pom
                        
Downloading: https://repository.jboss.org/nexus/content/groups/public-jboss/org/gluu/oxcore-model/4.3.0.Final/oxcore-model-4.3.0.Final.pom
                        
Downloading: https://ox.gluu.org/maven/org/gluu/oxcore-model/4.3.0.Final/oxcore-model-4.3.0.Final.pom
                        
Downloading: https://repo2.maven.org/maven2/org/bouncycastle/org/gluu/oxcore-model/4.3.0.Final/oxcore-model-4.3.0.Final.pom
                        
Downloading: https://repo1.maven.org/maven2/org/gluu/oxcore-model/4.3.0.Final/oxcore-model-4.3.0.Final.pom
                        
Downloading: https://repo.maven.apache.org/maven2/org/gluu/oxcore-model/4.3.0.Final/oxcore-model-4.3.0.Final.pom
                        
[INFO] ------------------------------------------------------------------------
[INFO] Reactor Summary:
[INFO] 
[INFO] oxAuth ............................................. SUCCESS [  3.326 s]
[INFO] oxAuth Model ....................................... FAILURE [  1.875 s]
[INFO] Persistence model .................................. SKIPPED
[INFO] oxAuth Client ...................................... SKIPPED
[INFO] oxauth-static ...................................... SKIPPED
[INFO] oxAuth Common ...................................... SKIPPED
[INFO] oxAuth Server ...................................... SKIPPED
[INFO] ------------------------------------------------------------------------
[INFO] BUILD FAILURE
[INFO] ------------------------------------------------------------------------
[INFO] Total time: 8.065 s
[INFO] Finished at: 2021-09-20T11:57:26+00:00
[INFO] Final Memory: 27M/94M
[INFO] ------------------------------------------------------------------------
[ERROR] Failed to execute goal on project oxauth-model: Could not resolve dependencies for project org.gluu:oxauth-model:jar:4.3.0.Final: Failed to collect dependencies at org.gluu:oxeleven-client:jar:4.3.0.Final: Failed to read artifact descriptor for org.gluu:oxeleven-client:jar:4.3.0.Final: Could not transfer artifact org.gluu:oxeleven-client:pom:4.3.0.Final from/to bouncycastle (https://repo2.maven.org/maven2/org/bouncycastle): repo2.maven.org: Unknown host repo2.maven.org -> [Help 1]
[ERROR] 
[ERROR] To see the full stack trace of the errors, re-run Maven with the -e switch.
[ERROR] Re-run Maven using the -X switch to enable full debug logging.
[ERROR] 
[ERROR] For more information about the errors and possible solutions, please read the following articles:
[ERROR] [Help 1] http://cwiki.apache.org/confluence/display/MAVEN/DependencyResolutionException
[ERROR] 
[ERROR] After correcting the problems, you can resume the build with the command
[ERROR]   mvn <goals> -rf :oxauth-model
Build step 'Invoke top-level Maven targets' marked build as failure
Publishing Javadoc
TestNG Reports Processing: START
Looking for TestNG results report in workspace using pattern: **/testng-results.xml
testng-results.xml was last modified before this build started. Ignoring it.
testng-results.xml was last modified before this build started. Ignoring it.
Saving reports...
Found matching files but did not find any TestNG results.
Not sending mail to unregistered user Yuriy.Movchan@gmail.com
Sending e-mails to: support@gluu.org madhu@gluu.org
ERROR: Couldn't connect to host, port: webmail.gluu.org, 465; timeout 60000
com.sun.mail.util.MailConnectException: Couldn't connect to host, port: webmail.gluu.org, 465; timeout 60000;
  nested exception is:
	java.net.SocketTimeoutException: connect timed out
	at com.sun.mail.smtp.SMTPTransport.openServer(SMTPTransport.java:2210)
	at com.sun.mail.smtp.SMTPTransport.protocolConnect(SMTPTransport.java:722)
	at javax.mail.Service.connect(Service.java:310)
	at javax.mail.Service.connect(Service.java:169)
	at javax.mail.Service.connect(Service.java:118)
	at javax.mail.Transport.send0(Transport.java:188)
	at javax.mail.Transport.send(Transport.java:118)
	at hudson.tasks.MailSender.run(MailSender.java:130)
	at hudson.tasks.Mailer.perform(Mailer.java:176)
	at hudson.tasks.Mailer.perform(Mailer.java:139)
	at hudson.tasks.BuildStepMonitor$1.perform(BuildStepMonitor.java:20)
	at hudson.model.AbstractBuild$AbstractBuildExecution.perform(AbstractBuild.java:741)
	at hudson.model.AbstractBuild$AbstractBuildExecution.performAllBuildSteps(AbstractBuild.java:690)
	at hudson.model.Build$BuildExecution.post2(Build.java:186)
	at hudson.model.AbstractBuild$AbstractBuildExecution.post(AbstractBuild.java:635)
	at hudson.model.Run.execute(Run.java:1905)
	at hudson.model.FreeStyleBuild.run(FreeStyleBuild.java:43)
	at hudson.model.ResourceController.execute(ResourceController.java:97)
	at hudson.model.Executor.run(Executor.java:428)
Caused by: java.net.SocketTimeoutException: connect timed out
	at java.net.PlainSocketImpl.socketConnect(Native Method)
	at java.net.AbstractPlainSocketImpl.doConnect(AbstractPlainSocketImpl.java:350)
	at java.net.AbstractPlainSocketImpl.connectToAddress(AbstractPlainSocketImpl.java:206)
	at java.net.AbstractPlainSocketImpl.connect(AbstractPlainSocketImpl.java:188)
	at java.net.SocksSocketImpl.connect(SocksSocketImpl.java:392)
	at java.net.Socket.connect(Socket.java:589)
	at com.sun.mail.util.SocketFetcher.createSocket(SocketFetcher.java:333)
	at com.sun.mail.util.SocketFetcher.getSocket(SocketFetcher.java:193)
	at com.sun.mail.smtp.SMTPTransport.openServer(SMTPTransport.java:2160)
	... 18 more
[Boolean condition] checking [true] against [^(1|y|yes|t|true|on|run)$] (origin token: $DEPLOY_BUILD)
Run condition [Boolean condition] enabling perform for step [Builder to mark whether executed]
Finished: FAILURE