FailedConsole Output

Started by user Yuriy Zabrovarnyy
Building in workspace /home/tomcat/.jenkins/jobs/oxAuth-install/workspace
Cloning the remote Git repository
Cloning repository https://github.com/GluuFederation/oxAuth
 > git init /home/tomcat/.jenkins/jobs/oxAuth-install/workspace # timeout=10
Fetching upstream changes from https://github.com/GluuFederation/oxAuth
 > git --version # timeout=10
 > git -c core.askpass=true fetch --tags --progress https://github.com/GluuFederation/oxAuth +refs/heads/*:refs/remotes/origin/*
 > git config remote.origin.url https://github.com/GluuFederation/oxAuth # timeout=10
 > git config --add remote.origin.fetch +refs/heads/*:refs/remotes/origin/* # timeout=10
 > git config remote.origin.url https://github.com/GluuFederation/oxAuth # timeout=10
Fetching upstream changes from https://github.com/GluuFederation/oxAuth
 > git -c core.askpass=true fetch --tags --progress https://github.com/GluuFederation/oxAuth +refs/heads/*:refs/remotes/origin/*
 > git rev-parse refs/remotes/origin/master^{commit} # timeout=10
 > git rev-parse refs/remotes/origin/origin/master^{commit} # timeout=10
Checking out Revision 3ee5ceff0424dfd6f1dd1f4fb2d4421d5763d90a (refs/remotes/origin/master)
 > git config core.sparsecheckout # timeout=10
 > git checkout -f 3ee5ceff0424dfd6f1dd1f4fb2d4421d5763d90a
First time build. Skipping changelog.
[workspace] $ /bin/bash /opt/tomcat/temp/hudson4878567307482377508.sh
Cloning into 'oxHudsonProfiles'...
[workspace] $ /home/tomcat/.jenkins/tools/hudson.tasks.Maven_MavenInstallation/maven_3.3.9/bin/mvn -DVERSION_NAME=master -Dpython.import.site=false -DPYTHON_HOME=/opt/jython -Dmaven.test.skip=true -Dcfg=$PROFILE_NAME -Ddisable-seam-debug=true clean compile install
[INFO] Scanning for projects...
[INFO] ------------------------------------------------------------------------
[INFO] Reactor Build Order:
[INFO] 
[INFO] oxAuth
[INFO] oxAuth Model
[INFO] oxAuth Client
[INFO] oxAuthStatic
[INFO] oxAuth Server
[INFO] oxAuth RP
[INFO]                                                                         
[INFO] ------------------------------------------------------------------------
[INFO] Building oxAuth 3.0.3-SNAPSHOT
[INFO] ------------------------------------------------------------------------
[INFO] 
[INFO] --- maven-clean-plugin:2.5:clean (default-clean) @ oxauth ---
[INFO] 
[INFO] --- maven-install-plugin:2.3.1:install (default-install) @ oxauth ---
[INFO] Installing /home/tomcat/.jenkins/jobs/oxAuth-install/workspace/pom.xml to /var/www/html/maven/org/xdi/oxauth/3.0.3-SNAPSHOT/oxauth-3.0.3-SNAPSHOT.pom
[INFO]                                                                         
[INFO] ------------------------------------------------------------------------
[INFO] Building oxAuth Model 3.0.3-SNAPSHOT
[INFO] ------------------------------------------------------------------------
[INFO] 
[INFO] --- maven-clean-plugin:2.5:clean (default-clean) @ oxauth-model ---
[INFO] 
[INFO] --- maven-resources-plugin:2.6:resources (default-resources) @ oxauth-model ---
[INFO] Using 'UTF-8' encoding to copy filtered resources.
[INFO] skip non existing resourceDirectory /home/tomcat/.jenkins/jobs/oxAuth-install/workspace/Model/src/main/resources
[INFO] 
[INFO] --- maven-compiler-plugin:2.3.2:compile (default-compile) @ oxauth-model ---
[INFO] Compiling 152 source files to /home/tomcat/.jenkins/jobs/oxAuth-install/workspace/Model/target/classes
[INFO] 
[INFO] --- maven-resources-plugin:2.6:resources (default-resources) @ oxauth-model ---
[INFO] Using 'UTF-8' encoding to copy filtered resources.
[INFO] skip non existing resourceDirectory /home/tomcat/.jenkins/jobs/oxAuth-install/workspace/Model/src/main/resources
[INFO] 
[INFO] --- maven-compiler-plugin:2.3.2:compile (default-compile) @ oxauth-model ---
[INFO] Nothing to compile - all classes are up to date
[INFO] 
[INFO] --- maven-resources-plugin:2.6:testResources (default-testResources) @ oxauth-model ---
[INFO] Not copying test resources
[INFO] 
[INFO] --- maven-compiler-plugin:2.3.2:testCompile (default-testCompile) @ oxauth-model ---
[INFO] Not compiling test sources
[INFO] 
[INFO] --- maven-surefire-plugin:2.12:test (default-test) @ oxauth-model ---
[INFO] Tests are skipped.
[INFO] 
[INFO] --- maven-jar-plugin:2.4:jar (default-jar) @ oxauth-model ---
[INFO] Building jar: /home/tomcat/.jenkins/jobs/oxAuth-install/workspace/Model/target/oxauth-model.jar
[INFO] 
[INFO] --- maven-jar-plugin:2.4:test-jar (default) @ oxauth-model ---
[INFO] Skipping packaging of the test-jar
[INFO] 
[INFO] >>> maven-source-plugin:2.1.2:jar (attach-sources) > generate-sources @ oxauth-model >>>
[INFO] 
[INFO] <<< maven-source-plugin:2.1.2:jar (attach-sources) < generate-sources @ oxauth-model <<<
[INFO] 
[INFO] --- maven-source-plugin:2.1.2:jar (attach-sources) @ oxauth-model ---
[INFO] Building jar: /home/tomcat/.jenkins/jobs/oxAuth-install/workspace/Model/target/oxauth-model-sources.jar
[INFO] 
[INFO] --- maven-install-plugin:2.3.1:install (default-install) @ oxauth-model ---
[INFO] Installing /home/tomcat/.jenkins/jobs/oxAuth-install/workspace/Model/target/oxauth-model.jar to /var/www/html/maven/org/xdi/oxauth-model/3.0.3-SNAPSHOT/oxauth-model-3.0.3-SNAPSHOT.jar
[INFO] Installing /home/tomcat/.jenkins/jobs/oxAuth-install/workspace/Model/pom.xml to /var/www/html/maven/org/xdi/oxauth-model/3.0.3-SNAPSHOT/oxauth-model-3.0.3-SNAPSHOT.pom
[INFO] Installing /home/tomcat/.jenkins/jobs/oxAuth-install/workspace/Model/target/oxauth-model-sources.jar to /var/www/html/maven/org/xdi/oxauth-model/3.0.3-SNAPSHOT/oxauth-model-3.0.3-SNAPSHOT-sources.jar
[INFO]                                                                         
[INFO] ------------------------------------------------------------------------
[INFO] Building oxAuth Client 3.0.3-SNAPSHOT
[INFO] ------------------------------------------------------------------------
[INFO] 
[INFO] --- maven-clean-plugin:2.5:clean (default-clean) @ oxauth-client ---
[INFO] 
[INFO] --- maven-resources-plugin:2.6:resources (default-resources) @ oxauth-client ---
[INFO] ------------------------------------------------------------------------
[INFO] Reactor Summary:
[INFO] 
[INFO] oxAuth ............................................. SUCCESS [  0.495 s]
[INFO] oxAuth Model ....................................... SUCCESS [  7.881 s]
[INFO] oxAuth Client ...................................... FAILURE [  0.416 s]
[INFO] oxAuthStatic ....................................... SKIPPED
[INFO] oxAuth Server ...................................... SKIPPED
[INFO] oxAuth RP .......................................... SKIPPED
[INFO] ------------------------------------------------------------------------
[INFO] BUILD FAILURE
[INFO] ------------------------------------------------------------------------
[INFO] Total time: 9.268 s
[INFO] Finished at: 2016-02-22T04:59:25-05:00
[INFO] Final Memory: 27M/301M
[INFO] ------------------------------------------------------------------------
[ERROR] Failed to execute goal org.apache.maven.plugins:maven-resources-plugin:2.6:resources (default-resources) on project oxauth-client: Error loading property file '/home/tomcat/.jenkins/jobs/oxAuth-install/workspace/Client/profiles/$PROFILE_NAME/config-oxauth-test-data.properties' -> [Help 1]
[ERROR] 
[ERROR] To see the full stack trace of the errors, re-run Maven with the -e switch.
[ERROR] Re-run Maven using the -X switch to enable full debug logging.
[ERROR] 
[ERROR] For more information about the errors and possible solutions, please read the following articles:
[ERROR] [Help 1] http://cwiki.apache.org/confluence/display/MAVEN/MojoExecutionException
[ERROR] 
[ERROR] After correcting the problems, you can resume the build with the command
[ERROR]   mvn <goals> -rf :oxauth-client
Build step 'Invoke top-level Maven targets' marked build as failure
Finished: FAILURE