FailedConsole Output

Skipping 26 KB.. Full Log
/opendj/ldap/InternalConnectionFactory.java:[46,19] org.forgerock.opendj.ldap.ServerConnectionFactory in org.forgerock.opendj.ldap has been deprecated
[WARNING] /home/tomcat/.jenkins/jobs/gluu-wrends-3.5/workspace/opendj-core/src/main/java/org/forgerock/opendj/ldap/InternalConnectionFactory.java:[49,37] org.forgerock.opendj.ldap.ServerConnectionFactory in org.forgerock.opendj.ldap has been deprecated
[WARNING] /home/tomcat/.jenkins/jobs/gluu-wrends-3.5/workspace/opendj-core/src/main/java/org/forgerock/opendj/ldap/InternalConnectionFactory.java:[62,15] org.forgerock.opendj.ldap.ServerConnection in org.forgerock.opendj.ldap has been deprecated
[WARNING] /home/tomcat/.jenkins/jobs/gluu-wrends-3.5/workspace/opendj-core/src/main/java/org/forgerock/opendj/ldap/InternalConnectionFactory.java:[68,15] org.forgerock.opendj.ldap.ServerConnection in org.forgerock.opendj.ldap has been deprecated
[WARNING] /home/tomcat/.jenkins/jobs/gluu-wrends-3.5/workspace/opendj-core/src/main/java/org/forgerock/opendj/ldap/AttributeFilter.java:[339,29] isPlaceHolder() in org.forgerock.opendj.ldap.schema.ObjectClass has been deprecated
[WARNING] /home/tomcat/.jenkins/jobs/gluu-wrends-3.5/workspace/opendj-core/src/main/java/org/forgerock/opendj/ldap/InternalConnection.java:[51,19] org.forgerock.opendj.ldap.ServerConnection in org.forgerock.opendj.ldap has been deprecated
[WARNING] /home/tomcat/.jenkins/jobs/gluu-wrends-3.5/workspace/opendj-core/src/main/java/org/forgerock/opendj/ldap/InternalConnection.java:[61,30] org.forgerock.opendj.ldap.ServerConnection in org.forgerock.opendj.ldap has been deprecated
[INFO] 
[INFO] --- maven-enforcer-plugin:1.4:enforce (enforce-plugin-versions) @ opendj-core ---
[INFO] 
[INFO] --- maven-enforcer-plugin:1.4:enforce (enforce-java-version) @ opendj-core ---
[INFO] 
[INFO] --- maven-enforcer-plugin:1.4:enforce (enforce-maven-version) @ opendj-core ---
[INFO] 
[INFO] --- buildnumber-maven-plugin:1.4:create (generate-buildnumber) @ opendj-core ---
[INFO] Executing: /bin/sh -c cd '/home/tomcat/.jenkins/jobs/gluu-wrends-3.5/workspace/opendj-core' && 'git' 'rev-parse' '--verify' 'HEAD'
[INFO] Working directory: /home/tomcat/.jenkins/jobs/gluu-wrends-3.5/workspace/opendj-core
[INFO] Storing buildNumber: d19595a6af5a5f7b549d2216bbf0b3897d4c770c at timestamp: 1548181607955
[WARNING] Cannot get the branch information from the git repository: 
Detecting the current branch failed: fatal: ref HEAD is not a symbolic ref

[INFO] Executing: /bin/sh -c cd '/home/tomcat/.jenkins/jobs/gluu-wrends-3.5/workspace/opendj-core' && 'git' 'rev-parse' '--verify' 'HEAD'
[INFO] Working directory: /home/tomcat/.jenkins/jobs/gluu-wrends-3.5/workspace/opendj-core
[INFO] Storing buildScmBranch: UNKNOWN
[INFO] 
[INFO] --- buildnumber-maven-plugin:1.4:create (generate-timestamp) @ opendj-core ---
[INFO] Storing buildNumber: 20190122132647 at timestamp: 1548181607988
[WARNING] Cannot get the branch information from the git repository: 
Detecting the current branch failed: fatal: ref HEAD is not a symbolic ref

[INFO] Executing: /bin/sh -c cd '/home/tomcat/.jenkins/jobs/gluu-wrends-3.5/workspace/opendj-core' && 'git' 'rev-parse' '--verify' 'HEAD'
[INFO] Working directory: /home/tomcat/.jenkins/jobs/gluu-wrends-3.5/workspace/opendj-core
[INFO] Storing buildScmBranch: UNKNOWN
[INFO] 
[INFO] --- i18n-maven-plugin:1.4.2:generate-messages (default) @ opendj-core ---
[INFO] Adding source directory: /home/tomcat/.jenkins/jobs/gluu-wrends-3.5/workspace/opendj-core/target/generated-sources/messages
[INFO] CoreMessages.java is up to date
[INFO] KeystoreMessages.java is up to date
[INFO] 
[INFO] --- maven-remote-resources-plugin:1.5:process (default) @ opendj-core ---
[INFO] 
[INFO] --- maven-resources-plugin:2.7:resources (default-resources) @ opendj-core ---
[INFO] Using 'UTF-8' encoding to copy filtered resources.
[INFO] Copying 18 resources
[INFO] Copying 1 resource
[INFO] Copying 1 resource
[INFO] 
[INFO] --- maven-compiler-plugin:3.3:compile (default-compile) @ opendj-core ---
[INFO] Changes detected - recompiling the module!
[INFO] Compiling 492 source files to /home/tomcat/.jenkins/jobs/gluu-wrends-3.5/workspace/opendj-core/target/classes
[WARNING] bootstrap class path not set in conjunction with -source 1.7
[WARNING] /home/tomcat/.jenkins/jobs/gluu-wrends-3.5/workspace/opendj-core/src/main/java/com/forgerock/reactive/ServerConnectionFactoryAdapter.java:[36,33] org.forgerock.opendj.ldap.ServerConnection in org.forgerock.opendj.ldap has been deprecated
[WARNING] /home/tomcat/.jenkins/jobs/gluu-wrends-3.5/workspace/opendj-core/src/main/java/com/forgerock/reactive/ServerConnectionFactoryAdapter.java:[37,33] org.forgerock.opendj.ldap.ServerConnectionFactory in org.forgerock.opendj.ldap has been deprecated
[WARNING] /home/tomcat/.jenkins/jobs/gluu-wrends-3.5/workspace/opendj-core/src/main/java/org/forgerock/opendj/ldap/RequestHandlerFactoryAdapter.java:[63,56] org.forgerock.opendj.ldap.ServerConnectionFactory in org.forgerock.opendj.ldap has been deprecated
[WARNING] /home/tomcat/.jenkins/jobs/gluu-wrends-3.5/workspace/opendj-core/src/main/java/org/forgerock/opendj/ldap/RequestHandlerFactoryAdapter.java:[404,64] org.forgerock.opendj.ldap.ServerConnection in org.forgerock.opendj.ldap has been deprecated
[WARNING] /home/tomcat/.jenkins/jobs/gluu-wrends-3.5/workspace/opendj-core/src/main/java/org/forgerock/opendj/ldap/RequestHandlerFactoryAdapter.java:[659,12] org.forgerock.opendj.ldap.ServerConnection in org.forgerock.opendj.ldap has been deprecated
[WARNING] /home/tomcat/.jenkins/jobs/gluu-wrends-3.5/workspace/opendj-core/src/main/java/org/forgerock/opendj/ldap/RequestHandlerFactoryAdapter.java:[679,12] org.forgerock.opendj.ldap.ServerConnection in org.forgerock.opendj.ldap has been deprecated
[WARNING] /home/tomcat/.jenkins/jobs/gluu-wrends-3.5/workspace/opendj-core/src/main/java/org/forgerock/opendj/ldap/Connections.java:[304,58] org.forgerock.opendj.ldap.ServerConnection in org.forgerock.opendj.ldap has been deprecated
[WARNING] /home/tomcat/.jenkins/jobs/gluu-wrends-3.5/workspace/opendj-core/src/main/java/org/forgerock/opendj/ldap/Connections.java:[400,19] org.forgerock.opendj.ldap.ServerConnectionFactory in org.forgerock.opendj.ldap has been deprecated
[WARNING] /home/tomcat/.jenkins/jobs/gluu-wrends-3.5/workspace/opendj-core/src/main/java/org/forgerock/opendj/ldap/Connections.java:[925,23] org.forgerock.opendj.ldap.ServerConnectionFactory in org.forgerock.opendj.ldap has been deprecated
[WARNING] /home/tomcat/.jenkins/jobs/gluu-wrends-3.5/workspace/opendj-core/src/main/java/org/forgerock/opendj/ldap/Connections.java:[960,23] org.forgerock.opendj.ldap.ServerConnectionFactory in org.forgerock.opendj.ldap has been deprecated
[WARNING] /home/tomcat/.jenkins/jobs/gluu-wrends-3.5/workspace/opendj-core/src/main/java/org/forgerock/opendj/ldap/InternalConnectionFactory.java:[46,19] org.forgerock.opendj.ldap.ServerConnectionFactory in org.forgerock.opendj.ldap has been deprecated
[WARNING] /home/tomcat/.jenkins/jobs/gluu-wrends-3.5/workspace/opendj-core/src/main/java/org/forgerock/opendj/ldap/InternalConnectionFactory.java:[49,37] org.forgerock.opendj.ldap.ServerConnectionFactory in org.forgerock.opendj.ldap has been deprecated
[WARNING] /home/tomcat/.jenkins/jobs/gluu-wrends-3.5/workspace/opendj-core/src/main/java/org/forgerock/opendj/ldap/InternalConnectionFactory.java:[62,15] org.forgerock.opendj.ldap.ServerConnection in org.forgerock.opendj.ldap has been deprecated
[WARNING] /home/tomcat/.jenkins/jobs/gluu-wrends-3.5/workspace/opendj-core/src/main/java/org/forgerock/opendj/ldap/InternalConnectionFactory.java:[68,15] org.forgerock.opendj.ldap.ServerConnection in org.forgerock.opendj.ldap has been deprecated
[WARNING] /home/tomcat/.jenkins/jobs/gluu-wrends-3.5/workspace/opendj-core/src/main/java/org/forgerock/opendj/ldap/AttributeFilter.java:[339,29] isPlaceHolder() in org.forgerock.opendj.ldap.schema.ObjectClass has been deprecated
[WARNING] /home/tomcat/.jenkins/jobs/gluu-wrends-3.5/workspace/opendj-core/src/main/java/org/forgerock/opendj/ldap/InternalConnection.java:[51,19] org.forgerock.opendj.ldap.ServerConnection in org.forgerock.opendj.ldap has been deprecated
[WARNING] /home/tomcat/.jenkins/jobs/gluu-wrends-3.5/workspace/opendj-core/src/main/java/org/forgerock/opendj/ldap/InternalConnection.java:[61,30] org.forgerock.opendj.ldap.ServerConnection in org.forgerock.opendj.ldap has been deprecated
[INFO] 
[INFO] --- maven-resources-plugin:2.7:testResources (default-testResources) @ opendj-core ---
[INFO] Not copying test resources
[INFO] 
[INFO] --- maven-compiler-plugin:3.3:testCompile (default-testCompile) @ opendj-core ---
[INFO] Not compiling test sources
[INFO] 
[INFO] --- maven-surefire-plugin:2.18.1:test (default-test) @ opendj-core ---
[INFO] Tests are skipped.
[INFO] 
[INFO] --- maven-bundle-plugin:2.3.7:bundle (default-bundle) @ opendj-core ---
[INFO] 
[INFO] --- maven-javadoc-plugin:2.9:jar (default) @ opendj-core ---
[INFO] 
6 warnings
[WARNING] Javadoc Warnings
[WARNING] /home/tomcat/.jenkins/jobs/gluu-wrends-3.5/workspace/opendj-core/src/main/java/org/forgerock/opendj/ldap/spi/LdapMessages.java:47: warning - Tag @link: reference not found:
[WARNING] /home/tomcat/.jenkins/jobs/gluu-wrends-3.5/workspace/opendj-core/src/main/java/org/forgerock/opendj/ldap/spi/LdapMessages.java:47: warning - Tag @link: reference not found:
[WARNING] /home/tomcat/.jenkins/jobs/gluu-wrends-3.5/workspace/opendj-core/src/main/java/org/forgerock/opendj/ldap/spi/LdapMessages.java:47: warning - Tag @link: reference not found:
[WARNING] /home/tomcat/.jenkins/jobs/gluu-wrends-3.5/workspace/opendj-core/src/main/java/org/forgerock/opendj/ldap/spi/LdapMessages.java:47: warning - Tag @link: reference not found:
[WARNING] /home/tomcat/.jenkins/jobs/gluu-wrends-3.5/workspace/opendj-core/src/main/java/org/forgerock/opendj/ldap/spi/LdapMessages.java:47: warning - Tag @link: reference not found:
[WARNING] /home/tomcat/.jenkins/jobs/gluu-wrends-3.5/workspace/opendj-core/src/main/java/org/forgerock/opendj/ldap/spi/LdapMessages.java:47: warning - Tag @link: reference not found:
[INFO] Building jar: /home/tomcat/.jenkins/jobs/gluu-wrends-3.5/workspace/opendj-core/target/opendj-core-4.0.0-M3-javadoc.jar
[INFO] 
[INFO] >>> maven-source-plugin:2.4:jar (default) > generate-sources @ opendj-core >>>
[INFO] 
[INFO] --- maven-enforcer-plugin:1.4:enforce (enforce-plugin-versions) @ opendj-core ---
[INFO] 
[INFO] --- maven-enforcer-plugin:1.4:enforce (enforce-java-version) @ opendj-core ---
[INFO] 
[INFO] --- maven-enforcer-plugin:1.4:enforce (enforce-maven-version) @ opendj-core ---
[INFO] 
[INFO] --- buildnumber-maven-plugin:1.4:create (generate-buildnumber) @ opendj-core ---
[INFO] Executing: /bin/sh -c cd '/home/tomcat/.jenkins/jobs/gluu-wrends-3.5/workspace/opendj-core' && 'git' 'rev-parse' '--verify' 'HEAD'
[INFO] Working directory: /home/tomcat/.jenkins/jobs/gluu-wrends-3.5/workspace/opendj-core
[INFO] Storing buildNumber: d19595a6af5a5f7b549d2216bbf0b3897d4c770c at timestamp: 1548181629612
[WARNING] Cannot get the branch information from the git repository: 
Detecting the current branch failed: fatal: ref HEAD is not a symbolic ref

[INFO] Executing: /bin/sh -c cd '/home/tomcat/.jenkins/jobs/gluu-wrends-3.5/workspace/opendj-core' && 'git' 'rev-parse' '--verify' 'HEAD'
[INFO] Working directory: /home/tomcat/.jenkins/jobs/gluu-wrends-3.5/workspace/opendj-core
[INFO] Storing buildScmBranch: UNKNOWN
[INFO] 
[INFO] --- buildnumber-maven-plugin:1.4:create (generate-timestamp) @ opendj-core ---
[INFO] Storing buildNumber: 20190122132709 at timestamp: 1548181629629
[WARNING] Cannot get the branch information from the git repository: 
Detecting the current branch failed: fatal: ref HEAD is not a symbolic ref

[INFO] Executing: /bin/sh -c cd '/home/tomcat/.jenkins/jobs/gluu-wrends-3.5/workspace/opendj-core' && 'git' 'rev-parse' '--verify' 'HEAD'
[INFO] Working directory: /home/tomcat/.jenkins/jobs/gluu-wrends-3.5/workspace/opendj-core
[INFO] Storing buildScmBranch: UNKNOWN
[INFO] 
[INFO] --- i18n-maven-plugin:1.4.2:generate-messages (default) @ opendj-core ---
[INFO] Adding source directory: /home/tomcat/.jenkins/jobs/gluu-wrends-3.5/workspace/opendj-core/target/generated-sources/messages
[INFO] CoreMessages.java is up to date
[INFO] KeystoreMessages.java is up to date
[INFO] 
[INFO] <<< maven-source-plugin:2.4:jar (default) < generate-sources @ opendj-core <<<
[INFO] 
[INFO] --- maven-source-plugin:2.4:jar (default) @ opendj-core ---
[INFO] Building jar: /home/tomcat/.jenkins/jobs/gluu-wrends-3.5/workspace/opendj-core/target/opendj-core-4.0.0-M3-sources.jar
[INFO] 
[INFO] --- maven-jar-plugin:2.6:test-jar (default) @ opendj-core ---
[INFO] Skipping packaging of the test-jar
[INFO] 
[INFO] --- pgpverify-maven-plugin:1.3.0-wren3:check (default) @ opendj-core ---
Downloading: https://wrensecurity.jfrog.io/wrensecurity/releases/org/forgerock/commons/i18n-slf4j/1.4.2/i18n-slf4j-1.4.2.jar.asc
473/473 B   
[WARNING] Could not validate integrity of download from https://wrensecurity.jfrog.io/wrensecurity/releases/org/forgerock/commons/i18n-slf4j/1.4.2/i18n-slf4j-1.4.2.jar.asc: Checksum validation failed, no checksums available
[WARNING] Checksum validation failed, no checksums available for https://wrensecurity.jfrog.io/wrensecurity/releases/org/forgerock/commons/i18n-slf4j/1.4.2/i18n-slf4j-1.4.2.jar.asc
            
Downloaded: https://wrensecurity.jfrog.io/wrensecurity/releases/org/forgerock/commons/i18n-slf4j/1.4.2/i18n-slf4j-1.4.2.jar.asc (473 B at 11.0 KB/sec)
Downloading: https://wrensecurity.jfrog.io/wrensecurity/releases/org/forgerock/forgerock-build-tools/1.0.2/forgerock-build-tools-1.0.2.jar.asc
473/473 B   
[WARNING] Could not validate integrity of download from https://wrensecurity.jfrog.io/wrensecurity/releases/org/forgerock/forgerock-build-tools/1.0.2/forgerock-build-tools-1.0.2.jar.asc: Checksum validation failed, no checksums available
[WARNING] Checksum validation failed, no checksums available for https://wrensecurity.jfrog.io/wrensecurity/releases/org/forgerock/forgerock-build-tools/1.0.2/forgerock-build-tools-1.0.2.jar.asc
            
Downloaded: https://wrensecurity.jfrog.io/wrensecurity/releases/org/forgerock/forgerock-build-tools/1.0.2/forgerock-build-tools-1.0.2.jar.asc (473 B at 15.4 KB/sec)
Downloading: https://wrensecurity.jfrog.io/wrensecurity/releases/org/forgerock/forgerock-build-tools/1.0.2/forgerock-build-tools-1.0.2.pom.asc
473/473 B   
[WARNING] Could not validate integrity of download from https://wrensecurity.jfrog.io/wrensecurity/releases/org/forgerock/forgerock-build-tools/1.0.2/forgerock-build-tools-1.0.2.pom.asc: Checksum validation failed, no checksums available
[WARNING] Checksum validation failed, no checksums available for https://wrensecurity.jfrog.io/wrensecurity/releases/org/forgerock/forgerock-build-tools/1.0.2/forgerock-build-tools-1.0.2.pom.asc
            
Downloaded: https://wrensecurity.jfrog.io/wrensecurity/releases/org/forgerock/forgerock-build-tools/1.0.2/forgerock-build-tools-1.0.2.pom.asc (473 B at 13.6 KB/sec)
Downloading: https://wrensecurity.jfrog.io/wrensecurity/releases/org/forgerock/commons/i18n-slf4j/1.4.2/i18n-slf4j-1.4.2.pom.asc
473/473 B   
[WARNING] Could not validate integrity of download from https://wrensecurity.jfrog.io/wrensecurity/releases/org/forgerock/commons/i18n-slf4j/1.4.2/i18n-slf4j-1.4.2.pom.asc: Checksum validation failed, no checksums available
[WARNING] Checksum validation failed, no checksums available for https://wrensecurity.jfrog.io/wrensecurity/releases/org/forgerock/commons/i18n-slf4j/1.4.2/i18n-slf4j-1.4.2.pom.asc
            
Downloaded: https://wrensecurity.jfrog.io/wrensecurity/releases/org/forgerock/commons/i18n-slf4j/1.4.2/i18n-slf4j-1.4.2.pom.asc (473 B at 14.4 KB/sec)
[INFO] com.github.stephenc.jcip:jcip-annotations:jar:1.0-1 PGP Signature OK
       KeyId: 0xC7CA19B7B620D787 UserIds: [Stephen Connolly <stephenc@apache.org>]
[INFO] org.testng:testng:jar:6.9.10 PGP Signature OK
       KeyId: 0x9440C8D6DECAFA12 UserIds: [Cedric Beust <cedric@beust.com>]
[INFO] commons-beanutils:commons-beanutils-core:pom:1.8.3 PGP Signature OK
       KeyId: 0x1861C322C56014B2 UserIds: [Niall Pemberton (Code signing) <niallp@apache.org>]
[INFO] org.slf4j:slf4j-jdk14:pom:1.7.21 PGP Signature OK
       KeyId: 0x2C7B12F2A511E325 UserIds: [Ceki Gulcu <ceki@qos.ch>]
[INFO] antlr:antlr:pom:2.7.7 PGP Signature OK
       KeyId: 0xAA781E12D7F749B5 UserIds: [Wren Security (Signing key for third-party artifacts approved, but not produced by, the Wren Security Project) <info@wrensecurity.org>]
[INFO] org.easytesting:fest-util:jar:1.1.6 PGP Signature OK
       KeyId: 0x1768F3F2B1F96385 UserIds: [Alex Ruiz (Colita) <alex.ruiz.05@gmail.com>]
[INFO] org.easytesting:fest-util:pom:1.1.6 PGP Signature OK
       KeyId: 0x1768F3F2B1F96385 UserIds: [Alex Ruiz (Colita) <alex.ruiz.05@gmail.com>]
[INFO] org.testng:testng:pom:6.9.10 PGP Signature OK
       KeyId: 0x9440C8D6DECAFA12 UserIds: [Cedric Beust <cedric@beust.com>]
[INFO] com.github.stephenc.jcip:jcip-annotations:pom:1.0-1 PGP Signature OK
       KeyId: 0xC7CA19B7B620D787 UserIds: [Stephen Connolly <stephenc@apache.org>]
[INFO] org.beanshell:bsh:jar:2.0b4 PGP Signature OK
       KeyId: 0xAA781E12D7F749B5 UserIds: [Wren Security (Signing key for third-party artifacts approved, but not produced by, the Wren Security Project) <info@wrensecurity.org>]
[INFO] com.beust:jcommander:pom:1.48 PGP Signature OK
       KeyId: 0x930C5B1EA41B1AA1 UserIds: [Cedric Beust <cedric@beust.com>]
[INFO] com.beust:jcommander:jar:1.48 PGP Signature OK
       KeyId: 0x930C5B1EA41B1AA1 UserIds: [Cedric Beust <cedric@beust.com>]
[INFO] org.beanshell:bsh:pom:2.0b4 PGP Signature OK
       KeyId: 0xAA781E12D7F749B5 UserIds: [Wren Security (Signing key for third-party artifacts approved, but not produced by, the Wren Security Project) <info@wrensecurity.org>]
[INFO] com.google.collections:google-collections:jar:1.0 PGP Signature OK
       KeyId: 0xAA781E12D7F749B5 UserIds: [Wren Security (Signing key for third-party artifacts approved, but not produced by, the Wren Security Project) <info@wrensecurity.org>]
[INFO] org.forgerock.commons:i18n-core:jar:1.4.2 PGP Signature OK
       KeyId: 0xE17DF45C081F89B UserIds: [Wren Security (Official signing key of the Wren Security project) <info@wrensecurity.org>]
[INFO] antlr:antlr:jar:2.7.7 PGP Signature OK
       KeyId: 0xAA781E12D7F749B5 UserIds: [Wren Security (Signing key for third-party artifacts approved, but not produced by, the Wren Security Project) <info@wrensecurity.org>]
[INFO] commons-beanutils:commons-beanutils-core:jar:1.8.3 PGP Signature OK
       KeyId: 0x1861C322C56014B2 UserIds: [Niall Pemberton (Code signing) <niallp@apache.org>]
[INFO] org.slf4j:slf4j-jdk14:jar:1.7.21 PGP Signature OK
       KeyId: 0x2C7B12F2A511E325 UserIds: [Ceki Gulcu <ceki@qos.ch>]
[INFO] org.reactivestreams:reactive-streams:pom:1.0.0 PGP Signature OK
       KeyId: 0x2383163BC40844FD UserIds: [Roland Kuhn <rk@rkuhn.info>, Roland Kuhn <rkuhn@ph.tum.de>, Roland Kuhn <roland@rkuhn.info>, Roland Kuhn <roland.kuhn@gmx.net>, Roland Kuhn <rkuhn@e18.physik.tu-muenchen.de>, Roland Kuhn <roland.kuhn@physik.tu-muenchen.de>]
[INFO] io.reactivex.rxjava2:rxjava:jar:2.0.0 PGP Signature OK
       KeyId: 0x94B291AEF984A085 UserIds: [ReactiveX Admin <reactivex-admin@googlegroup.com>]
[INFO] commons-cli:commons-cli:jar:1.2 PGP Signature OK
       KeyId: 0x1241BC872C5E4EC0 UserIds: [Henri Yandell (For signing ASF releases) <bayard@apache.org>]
[INFO] org.slf4j:slf4j-api:pom:1.7.21 PGP Signature OK
       KeyId: 0x2C7B12F2A511E325 UserIds: [Ceki Gulcu <ceki@qos.ch>]
[INFO] commons-cli:commons-cli:pom:1.2 PGP Signature OK
       KeyId: 0x1241BC872C5E4EC0 UserIds: [Henri Yandell (For signing ASF releases) <bayard@apache.org>]
[INFO] org.forgerock:forgerock-build-tools:pom:1.0.2 PGP Signature OK
       KeyId: 0xE17DF45C081F89B UserIds: [Wren Security (Official signing key of the Wren Security project) <info@wrensecurity.org>]
[INFO] io.reactivex.rxjava2:rxjava:pom:2.0.0 PGP Signature OK
       KeyId: 0x94B291AEF984A085 UserIds: [ReactiveX Admin <reactivex-admin@googlegroup.com>]
[INFO] commons-logging:commons-logging:pom:1.1.1 PGP Signature OK
       KeyId: 0x33CD6733AF5EC452 UserIds: [Dennis Lundberg (CODE SIGNING KEY) <dennisl@apache.org>]
[INFO] org.mockito:mockito-all:pom:1.10.19 PGP Signature OK
       KeyId: 0xA1B4460D8BA7B9AF UserIds: [Mockito (http://mockito.org) <mockito.pl@gmail.com>]
[INFO] org.slf4j:slf4j-api:jar:1.7.21 PGP Signature OK
       KeyId: 0x2C7B12F2A511E325 UserIds: [Ceki Gulcu <ceki@qos.ch>]
[INFO] org.forgerock.commons:forgerock-util:jar:21.0.0-alpha-17 PGP Signature OK
       KeyId: 0xAA781E12D7F749B5 UserIds: [Wren Security (Signing key for third-party artifacts approved, but not produced by, the Wren Security Project) <info@wrensecurity.org>]
[INFO] org.forgerock.commons:forgerock-util:pom:21.0.0-alpha-17 PGP Signature OK
       KeyId: 0xAA781E12D7F749B5 UserIds: [Wren Security (Signing key for third-party artifacts approved, but not produced by, the Wren Security Project) <info@wrensecurity.org>]
[INFO] org.reactivestreams:reactive-streams:jar:1.0.0 PGP Signature OK
       KeyId: 0x2383163BC40844FD UserIds: [Roland Kuhn <rk@rkuhn.info>, Roland Kuhn <rkuhn@ph.tum.de>, Roland Kuhn <roland@rkuhn.info>, Roland Kuhn <roland.kuhn@gmx.net>, Roland Kuhn <rkuhn@e18.physik.tu-muenchen.de>, Roland Kuhn <roland.kuhn@physik.tu-muenchen.de>]
[INFO] commons-logging:commons-logging:jar:1.1.1 PGP Signature OK
       KeyId: 0x33CD6733AF5EC452 UserIds: [Dennis Lundberg (CODE SIGNING KEY) <dennisl@apache.org>]
[INFO] org.forgerock.commons:i18n-core:pom:1.4.2 PGP Signature OK
       KeyId: 0xE17DF45C081F89B UserIds: [Wren Security (Official signing key of the Wren Security project) <info@wrensecurity.org>]
[INFO] org.forgerock:forgerock-build-tools:jar:1.0.2 PGP Signature OK
       KeyId: 0xE17DF45C081F89B UserIds: [Wren Security (Official signing key of the Wren Security project) <info@wrensecurity.org>]
[INFO] com.google.collections:google-collections:pom:1.0 PGP Signature OK
       KeyId: 0xAA781E12D7F749B5 UserIds: [Wren Security (Signing key for third-party artifacts approved, but not produced by, the Wren Security Project) <info@wrensecurity.org>]
[INFO] com.puppycrawl.tools:checkstyle:jar:5.5 PGP Signature OK
       KeyId: 0xFB0A30BB62A271FE UserIds: [Oliver Burn (Checkstyle Project) <oburn@users.sourceforge.net>]
[INFO] org.mockito:mockito-all:jar:1.10.19 PGP Signature OK
       KeyId: 0xA1B4460D8BA7B9AF UserIds: [Mockito (http://mockito.org) <mockito.pl@gmail.com>]
[INFO] com.puppycrawl.tools:checkstyle:pom:5.5 PGP Signature OK
       KeyId: 0xFB0A30BB62A271FE UserIds: [Oliver Burn (Checkstyle Project) <oburn@users.sourceforge.net>]
[INFO] org.forgerock.commons:i18n-slf4j:jar:1.4.2 PGP Signature OK
       KeyId: 0xE17DF45C081F89B UserIds: [Wren Security (Official signing key of the Wren Security project) <info@wrensecurity.org>]
[INFO] org.easytesting:fest-assert:pom:1.4 PGP Signature OK
       KeyId: 0x1768F3F2B1F96385 UserIds: [Alex Ruiz (Colita) <alex.ruiz.05@gmail.com>]
[INFO] org.forgerock.commons:i18n-slf4j:pom:1.4.2 PGP Signature OK
       KeyId: 0xE17DF45C081F89B UserIds: [Wren Security (Official signing key of the Wren Security project) <info@wrensecurity.org>]
[INFO] org.assertj:assertj-core:pom:2.4.1 PGP Signature OK
       KeyId: 0xE2B3D84202B812D9 UserIds: [Joel Costigliola <joel.costigliola@gmail.com>]
[INFO] org.easytesting:fest-assert:jar:1.4 PGP Signature OK
       KeyId: 0x1768F3F2B1F96385 UserIds: [Alex Ruiz (Colita) <alex.ruiz.05@gmail.com>]
[INFO] org.assertj:assertj-core:jar:2.4.1 PGP Signature OK
       KeyId: 0xE2B3D84202B812D9 UserIds: [Joel Costigliola <joel.costigliola@gmail.com>]
[INFO] 
[INFO] >>> clirr-maven-plugin:2.6.1:check (mvn verify) > compile @ opendj-core >>>
[INFO] 
[INFO] --- maven-enforcer-plugin:1.4:enforce (enforce-plugin-versions) @ opendj-core ---
[INFO] 
[INFO] --- maven-enforcer-plugin:1.4:enforce (enforce-java-version) @ opendj-core ---
[INFO] 
[INFO] --- maven-enforcer-plugin:1.4:enforce (enforce-maven-version) @ opendj-core ---
[INFO] 
[INFO] --- buildnumber-maven-plugin:1.4:create (generate-buildnumber) @ opendj-core ---
[INFO] Executing: /bin/sh -c cd '/home/tomcat/.jenkins/jobs/gluu-wrends-3.5/workspace/opendj-core' && 'git' 'rev-parse' '--verify' 'HEAD'
[INFO] Working directory: /home/tomcat/.jenkins/jobs/gluu-wrends-3.5/workspace/opendj-core
[INFO] Storing buildNumber: d19595a6af5a5f7b549d2216bbf0b3897d4c770c at timestamp: 1548181631992
[WARNING] Cannot get the branch information from the git repository: 
Detecting the current branch failed: fatal: ref HEAD is not a symbolic ref

[INFO] Executing: /bin/sh -c cd '/home/tomcat/.jenkins/jobs/gluu-wrends-3.5/workspace/opendj-core' && 'git' 'rev-parse' '--verify' 'HEAD'
[INFO] Working directory: /home/tomcat/.jenkins/jobs/gluu-wrends-3.5/workspace/opendj-core
[INFO] Storing buildScmBranch: UNKNOWN
[INFO] 
[INFO] --- buildnumber-maven-plugin:1.4:create (generate-timestamp) @ opendj-core ---
[INFO] Storing buildNumber: 20190122132712 at timestamp: 1548181632007
[WARNING] Cannot get the branch information from the git repository: 
Detecting the current branch failed: fatal: ref HEAD is not a symbolic ref

[INFO] Executing: /bin/sh -c cd '/home/tomcat/.jenkins/jobs/gluu-wrends-3.5/workspace/opendj-core' && 'git' 'rev-parse' '--verify' 'HEAD'
[INFO] Working directory: /home/tomcat/.jenkins/jobs/gluu-wrends-3.5/workspace/opendj-core
[INFO] Storing buildScmBranch: UNKNOWN
[INFO] 
[INFO] --- i18n-maven-plugin:1.4.2:generate-messages (default) @ opendj-core ---
[INFO] Adding source directory: /home/tomcat/.jenkins/jobs/gluu-wrends-3.5/workspace/opendj-core/target/generated-sources/messages
[INFO] CoreMessages.java is up to date
[INFO] KeystoreMessages.java is up to date
[INFO] 
[INFO] --- maven-remote-resources-plugin:1.5:process (default) @ opendj-core ---
[INFO] 
[INFO] --- maven-resources-plugin:2.7:resources (default-resources) @ opendj-core ---
[INFO] Using 'UTF-8' encoding to copy filtered resources.
[INFO] Copying 18 resources
[INFO] Copying 1 resource
[INFO] Copying 1 resource
[INFO] Copying 1 resource
[INFO] 
[INFO] --- maven-compiler-plugin:3.3:compile (default-compile) @ opendj-core ---
[INFO] Changes detected - recompiling the module!
[INFO] Compiling 492 source files to /home/tomcat/.jenkins/jobs/gluu-wrends-3.5/workspace/opendj-core/target/classes
[WARNING] bootstrap class path not set in conjunction with -source 1.7
[WARNING] /home/tomcat/.jenkins/jobs/gluu-wrends-3.5/workspace/opendj-core/src/main/java/com/forgerock/reactive/ServerConnectionFactoryAdapter.java:[36,33] org.forgerock.opendj.ldap.ServerConnection in org.forgerock.opendj.ldap has been deprecated
[WARNING] /home/tomcat/.jenkins/jobs/gluu-wrends-3.5/workspace/opendj-core/src/main/java/com/forgerock/reactive/ServerConnectionFactoryAdapter.java:[37,33] org.forgerock.opendj.ldap.ServerConnectionFactory in org.forgerock.opendj.ldap has been deprecated
[WARNING] /home/tomcat/.jenkins/jobs/gluu-wrends-3.5/workspace/opendj-core/src/main/java/org/forgerock/opendj/ldap/RequestHandlerFactoryAdapter.java:[63,56] org.forgerock.opendj.ldap.ServerConnectionFactory in org.forgerock.opendj.ldap has been deprecated
[WARNING] /home/tomcat/.jenkins/jobs/gluu-wrends-3.5/workspace/opendj-core/src/main/java/org/forgerock/opendj/ldap/RequestHandlerFactoryAdapter.java:[404,64] org.forgerock.opendj.ldap.ServerConnection in org.forgerock.opendj.ldap has been deprecated
[WARNING] /home/tomcat/.jenkins/jobs/gluu-wrends-3.5/workspace/opendj-core/src/main/java/org/forgerock/opendj/ldap/RequestHandlerFactoryAdapter.java:[659,12] org.forgerock.opendj.ldap.ServerConnection in org.forgerock.opendj.ldap has been deprecated
[WARNING] /home/tomcat/.jenkins/jobs/gluu-wrends-3.5/workspace/opendj-core/src/main/java/org/forgerock/opendj/ldap/RequestHandlerFactoryAdapter.java:[679,12] org.forgerock.opendj.ldap.ServerConnection in org.forgerock.opendj.ldap has been deprecated
[WARNING] /home/tomcat/.jenkins/jobs/gluu-wrends-3.5/workspace/opendj-core/src/main/java/org/forgerock/opendj/ldap/Connections.java:[304,58] org.forgerock.opendj.ldap.ServerConnection in org.forgerock.opendj.ldap has been deprecated
[WARNING] /home/tomcat/.jenkins/jobs/gluu-wrends-3.5/workspace/opendj-core/src/main/java/org/forgerock/opendj/ldap/Connections.java:[400,19] org.forgerock.opendj.ldap.ServerConnectionFactory in org.forgerock.opendj.ldap has been deprecated
[WARNING] /home/tomcat/.jenkins/jobs/gluu-wrends-3.5/workspace/opendj-core/src/main/java/org/forgerock/opendj/ldap/Connections.java:[925,23] org.forgerock.opendj.ldap.ServerConnectionFactory in org.forgerock.opendj.ldap has been deprecated
[WARNING] /home/tomcat/.jenkins/jobs/gluu-wrends-3.5/workspace/opendj-core/src/main/java/org/forgerock/opendj/ldap/Connections.java:[960,23] org.forgerock.opendj.ldap.ServerConnectionFactory in org.forgerock.opendj.ldap has been deprecated
[WARNING] /home/tomcat/.jenkins/jobs/gluu-wrends-3.5/workspace/opendj-core/src/main/java/org/forgerock/opendj/ldap/InternalConnectionFactory.java:[46,19] org.forgerock.opendj.ldap.ServerConnectionFactory in org.forgerock.opendj.ldap has been deprecated
[WARNING] /home/tomcat/.jenkins/jobs/gluu-wrends-3.5/workspace/opendj-core/src/main/java/org/forgerock/opendj/ldap/InternalConnectionFactory.java:[49,37] org.forgerock.opendj.ldap.ServerConnectionFactory in org.forgerock.opendj.ldap has been deprecated
[WARNING] /home/tomcat/.jenkins/jobs/gluu-wrends-3.5/workspace/opendj-core/src/main/java/org/forgerock/opendj/ldap/InternalConnectionFactory.java:[62,15] org.forgerock.opendj.ldap.ServerConnection in org.forgerock.opendj.ldap has been deprecated
[WARNING] /home/tomcat/.jenkins/jobs/gluu-wrends-3.5/workspace/opendj-core/src/main/java/org/forgerock/opendj/ldap/InternalConnectionFactory.java:[68,15] org.forgerock.opendj.ldap.ServerConnection in org.forgerock.opendj.ldap has been deprecated
[WARNING] /home/tomcat/.jenkins/jobs/gluu-wrends-3.5/workspace/opendj-core/src/main/java/org/forgerock/opendj/ldap/AttributeFilter.java:[339,29] isPlaceHolder() in org.forgerock.opendj.ldap.schema.ObjectClass has been deprecated
[WARNING] /home/tomcat/.jenkins/jobs/gluu-wrends-3.5/workspace/opendj-core/src/main/java/org/forgerock/opendj/ldap/InternalConnection.java:[51,19] org.forgerock.opendj.ldap.ServerConnection in org.forgerock.opendj.ldap has been deprecated
[WARNING] /home/tomcat/.jenkins/jobs/gluu-wrends-3.5/workspace/opendj-core/src/main/java/org/forgerock/opendj/ldap/InternalConnection.java:[61,30] org.forgerock.opendj.ldap.ServerConnection in org.forgerock.opendj.ldap has been deprecated
[INFO] 
[INFO] <<< clirr-maven-plugin:2.6.1:check (mvn verify) < compile @ opendj-core <<<
[INFO] 
[INFO] --- clirr-maven-plugin:2.6.1:check (mvn verify) @ opendj-core ---
Downloading: https://wrensecurity.jfrog.io/wrensecurity/releases/org/forgerock/opendj/opendj-core/3.0.0/opendj-core-3.0.0.jar
1/1433 KB   
3/1433 KB   
4/1433 KB   
5/1433 KB   
7/1433 KB   
8/1433 KB   
9/1433 KB   
11/1433 KB   
12/1433 KB   
13/1433 KB   
15/1433 KB   
16/1433 KB   
18/1433 KB   
19/1433 KB   
20/1433 KB   
22/1433 KB   
23/1433 KB   
24/1433 KB   
26/1433 KB   
27/1433 KB   
29/1433 KB   
30/1433 KB   
31/1433 KB   
33/1433 KB   
34/1433 KB   
35/1433 KB   
37/1433 KB   
38/1433 KB   
39/1433 KB   
41/1433 KB   
42/1433 KB   
44/1433 KB   
45/1433 KB   
46/1433 KB   
48/1433 KB   
49/1433 KB   
50/1433 KB   
52/1433 KB   
53/1433 KB   
54/1433 KB   
56/1433 KB   
57/1433 KB   
59/1433 KB   
60/1433 KB   
61/1433 KB   
63/1433 KB   
64/1433 KB   
65/1433 KB   
67/1433 KB   
68/1433 KB   
70/1433 KB   
71/1433 KB   
72/1433 KB   
74/1433 KB   
75/1433 KB   
76/1433 KB   
78/1433 KB   
79/1433 KB   
80/1433 KB   
82/1433 KB   
83/1433 KB   
85/1433 KB   
86/1433 KB   
87/1433 KB   
89/1433 KB   
90/1433 KB   
91/1433 KB   
93/1433 KB   
94/1433 KB   
95/1433 KB   
97/1433 KB   
98/1433 KB   
100/1433 KB   
101/1433 KB   
102/1433 KB   
104/1433 KB   
105/1433 KB   
106/1433 KB   
108/1433 KB   
109/1433 KB   
111/1433 KB   
112/1433 KB   
113/1433 KB   
115/1433 KB   
116/1433 KB   
117/1433 KB   
119/1433 KB   
120/1433 KB   
121/1433 KB   
123/1433 KB   
124/1433 KB   
126/1433 KB   
127/1433 KB   
128/1433 KB   
130/1433 KB   
131/1433 KB   
132/1433 KB   
134/1433 KB   
135/1433 KB   
137/1433 KB   
138/1433 KB   
139/1433 KB   
141/1433 KB   
142/1433 KB   
143/1433 KB   
145/1433 KB   
146/1433 KB   
147/1433 KB   
149/1433 KB   
150/1433 KB   
152/1433 KB   
153/1433 KB   
154/1433 KB   
156/1433 KB   
157/1433 KB   
158/1433 KB   
160/1433 KB   
161/1433 KB   
162/1433 KB   
164/1433 KB   
165/1433 KB   
167/1433 KB   
168/1433 KB   
169/1433 KB   
171/1433 KB   
172/1433 KB   
173/1433 KB   
175/1433 KB   
176/1433 KB   
178/1433 KB   
179/1433 KB   
180/1433 KB   
182/1433 KB   
183/1433 KB   
184/1433 KB   
186/1433 KB   
187/1433 KB   
188/1433 KB   
190/1433 KB   
191/1433 KB   
193/1433 KB   
194/1433 KB   
195/1433 KB   
197/1433 KB   
198/1433 KB   
199/1433 KB   
201/1433 KB   
202/1433 KB   
204/1433 KB   
205/1433 KB   
206/1433 KB   
208/1433 KB   
209/1433 KB   
210/1433 KB   
212/1433 KB   
213/1433 KB   
214/1433 KB   
216/1433 KB   
217/1433 KB   
219/1433 KB   
220/1433 KB   
221/1433 KB   
223/1433 KB   
224/1433 KB   
225/1433 KB   
227/1433 KB   
228/1433 KB   
229/1433 KB   
231/1433 KB   
232/1433 KB   
234/1433 KB   
235/1433 KB   
236/1433 KB   
238/1433 KB   
239/1433 KB   
240/1433 KB   
242/1433 KB   
243/1433 KB   
245/1433 KB   
246/1433 KB   
247/1433 KB   
249/1433 KB   
250/1433 KB   
251/1433 KB   
253/1433 KB   
254/1433 KB   
255/1433 KB   
257/1433 KB   
258/1433 KB   
260/1433 KB   
261/1433 KB   
262/1433 KB   
264/1433 KB   
265/1433 KB   
266/1433 KB   
268/1433 KB   
269/1433 KB   
270/1433 KB   
272/1433 KB   
273/1433 KB   
275/1433 KB   
276/1433 KB   
277/1433 KB   
279/1433 KB   
280/1433 KB   
281/1433 KB   
283/1433 KB   
284/1433 KB   
286/1433 KB   
287/1433 KB   
288/1433 KB   
290/1433 KB   
291/1433 KB   
292/1433 KB   
294/1433 KB   
295/1433 KB   
296/1433 KB   
298/1433 KB   
299/1433 KB   
301/1433 KB   
302/1433 KB   
303/1433 KB   
305/1433 KB   
306/1433 KB   
307/1433 KB   
309/1433 KB   
310/1433 KB   
312/1433 KB   
313/1433 KB   
314/1433 KB   
316/1433 KB   
317/1433 KB   
318/1433 KB   
320/1433 KB   
321/1433 KB   
322/1433 KB   
324/1433 KB   
325/1433 KB   
327/1433 KB   
328/1433 KB   
329/1433 KB   
331/1433 KB   
332/1433 KB   
333/1433 KB   
335/1433 KB   
336/1433 KB   
337/1433 KB   
339/1433 KB   
340/1433 KB   
342/1433 KB   
343/1433 KB   
344/1433 KB   
346/1433 KB   
347/1433 KB   
348/1433 KB   
350/1433 KB   
351/1433 KB   
353/1433 KB   
354/1433 KB   
355/1433 KB   
357/1433 KB   
358/1433 KB   
359/1433 KB   
361/1433 KB   
362/1433 KB   
363/1433 KB   
365/1433 KB   
366/1433 KB   
368/1433 KB   
369/1433 KB   
370/1433 KB   
372/1433 KB   
373/1433 KB   
374/1433 KB   
376/1433 KB   
377/1433 KB   
379/1433 KB   
380/1433 KB   
381/1433 KB   
383/1433 KB   
384/1433 KB   
385/1433 KB   
387/1433 KB   
388/1433 KB   
389/1433 KB   
391/1433 KB   
392/1433 KB   
394/1433 KB   
395/1433 KB   
396/1433 KB   
398/1433 KB   
399/1433 KB   
400/1433 KB   
402/1433 KB   
403/1433 KB   
404/1433 KB   
406/1433 KB   
407/1433 KB   
409/1433 KB   
410/1433 KB   
411/1433 KB   
413/1433 KB   
414/1433 KB   
415/1433 KB   
417/1433 KB   
418/1433 KB   
420/1433 KB   
421/1433 KB   
422/1433 KB   
424/1433 KB   
425/1433 KB   
426/1433 KB   
428/1433 KB   
429/1433 KB   
430/1433 KB   
432/1433 KB   
433/1433 KB   
435/1433 KB   
436/1433 KB   
437/1433 KB   
439/1433 KB   
440/1433 KB   
441/1433 KB   
443/1433 KB   
444/1433 KB   
445/1433 KB   
447/1433 KB   
448/1433 KB   
450/1433 KB   
451/1433 KB   
452/1433 KB   
454/1433 KB   
455/1433 KB   
456/1433 KB   
458/1433 KB   
459/1433 KB   
461/1433 KB   
462/1433 KB   
463/1433 KB   
465/1433 KB   
466/1433 KB   
467/1433 KB   
469/1433 KB   
470/1433 KB   
471/1433 KB   
473/1433 KB   
474/1433 KB   
476/1433 KB   
477/1433 KB   
478/1433 KB   
480/1433 KB   
481/1433 KB   
482/1433 KB   
484/1433 KB   
485/1433 KB   
487/1433 KB   
488/1433 KB   
489/1433 KB   
491/1433 KB   
492/1433 KB   
493/1433 KB   
495/1433 KB   
496/1433 KB   
497/1433 KB   
499/1433 KB   
500/1433 KB   
502/1433 KB   
503/1433 KB   
504/1433 KB   
506/1433 KB   
507/1433 KB   
508/1433 KB   
510/1433 KB   
511/1433 KB   
512/1433 KB   
514/1433 KB   
515/1433 KB   
517/1433 KB   
518/1433 KB   
519/1433 KB   
521/1433 KB   
522/1433 KB   
523/1433 KB   
525/1433 KB   
526/1433 KB   
528/1433 KB   
529/1433 KB   
530/1433 KB   
532/1433 KB   
533/1433 KB   
534/1433 KB   
536/1433 KB   
537/1433 KB   
538/1433 KB   
540/1433 KB   
541/1433 KB   
543/1433 KB   
544/1433 KB   
545/1433 KB   
547/1433 KB   
548/1433 KB   
549/1433 KB   
551/1433 KB   
552/1433 KB   
554/1433 KB   
555/1433 KB   
556/1433 KB   
558/1433 KB   
559/1433 KB   
560/1433 KB   
562/1433 KB   
563/1433 KB   
564/1433 KB   
566/1433 KB   
567/1433 KB   
569/1433 KB   
570/1433 KB   
571/1433 KB   
573/1433 KB   
574/1433 KB   
575/1433 KB   
577/1433 KB   
578/1433 KB   
579/1433 KB   
581/1433 KB   
582/1433 KB   
584/1433 KB   
585/1433 KB   
586/1433 KB   
588/1433 KB   
589/1433 KB   
590/1433 KB   
592/1433 KB   
593/1433 KB   
595/1433 KB   
596/1433 KB   
597/1433 KB   
599/1433 KB   
600/1433 KB   
601/1433 KB   
603/1433 KB   
604/1433 KB   
605/1433 KB   
607/1433 KB   
608/1433 KB   
610/1433 KB   
611/1433 KB   
612/1433 KB   
614/1433 KB   
615/1433 KB   
616/1433 KB   
618/1433 KB   
619/1433 KB   
620/1433 KB   
622/1433 KB   
623/1433 KB   
625/1433 KB   
626/1433 KB   
627/1433 KB   
629/1433 KB   
630/1433 KB   
631/1433 KB   
633/1433 KB   
634/1433 KB   
636/1433 KB   
637/1433 KB   
638/1433 KB   
640/1433 KB   
641/1433 KB   
642/1433 KB   
644/1433 KB   
645/1433 KB   
646/1433 KB   
648/1433 KB   
649/1433 KB   
651/1433 KB   
652/1433 KB   
653/1433 KB   
655/1433 KB   
656/1433 KB   
657/1433 KB   
659/1433 KB   
660/1433 KB   
662/1433 KB   
663/1433 KB   
664/1433 KB   
666/1433 KB   
667/1433 KB   
668/1433 KB   
670/1433 KB   
671/1433 KB   
672/1433 KB   
674/1433 KB   
675/1433 KB   
677/1433 KB   
678/1433 KB   
679/1433 KB   
681/1433 KB   
682/1433 KB   
683/1433 KB   
685/1433 KB   
686/1433 KB   
687/1433 KB   
689/1433 KB   
690/1433 KB   
692/1433 KB   
693/1433 KB   
694/1433 KB   
696/1433 KB   
697/1433 KB   
698/1433 KB   
700/1433 KB   
701/1433 KB   
703/1433 KB   
704/1433 KB   
705/1433 KB   
707/1433 KB   
708/1433 KB   
709/1433 KB   
711/1433 KB   
712/1433 KB   
713/1433 KB   
715/1433 KB   
716/1433 KB   
718/1433 KB   
719/1433 KB   
720/1433 KB   
722/1433 KB   
723/1433 KB   
724/1433 KB   
726/1433 KB   
727/1433 KB   
729/1433 KB   
730/1433 KB   
731/1433 KB   
733/1433 KB   
734/1433 KB   
735/1433 KB   
737/1433 KB   
738/1433 KB   
739/1433 KB   
741/1433 KB   
742/1433 KB   
744/1433 KB   
745/1433 KB   
746/1433 KB   
748/1433 KB   
749/1433 KB   
750/1433 KB   
752/1433 KB   
753/1433 KB   
754/1433 KB   
756/1433 KB   
757/1433 KB   
759/1433 KB   
760/1433 KB   
761/1433 KB   
763/1433 KB   
764/1433 KB   
765/1433 KB   
767/1433 KB   
768/1433 KB   
770/1433 KB   
771/1433 KB   
772/1433 KB   
774/1433 KB   
775/1433 KB   
776/1433 KB   
778/1433 KB   
779/1433 KB   
780/1433 KB   
782/1433 KB   
783/1433 KB   
785/1433 KB   
786/1433 KB   
787/1433 KB   
789/1433 KB   
790/1433 KB   
791/1433 KB   
793/1433 KB   
794/1433 KB   
795/1433 KB   
797/1433 KB   
798/1433 KB   
800/1433 KB   
801/1433 KB   
802/1433 KB   
804/1433 KB   
805/1433 KB   
806/1433 KB   
808/1433 KB   
809/1433 KB   
811/1433 KB   
812/1433 KB   
813/1433 KB   
815/1433 KB   
816/1433 KB   
817/1433 KB   
819/1433 KB   
820/1433 KB   
821/1433 KB   
823/1433 KB   
824/1433 KB   
826/1433 KB   
827/1433 KB   
828/1433 KB   
830/1433 KB   
831/1433 KB   
832/1433 KB   
834/1433 KB   
835/1433 KB   
837/1433 KB   
838/1433 KB   
839/1433 KB   
841/1433 KB   
842/1433 KB   
843/1433 KB   
845/1433 KB   
846/1433 KB   
847/1433 KB   
849/1433 KB   
850/1433 KB   
852/1433 KB   
853/1433 KB   
854/1433 KB   
856/1433 KB   
857/1433 KB   
858/1433 KB   
860/1433 KB   
861/1433 KB   
862/1433 KB   
864/1433 KB   
865/1433 KB   
867/1433 KB   
868/1433 KB   
869/1433 KB   
871/1433 KB   
872/1433 KB   
873/1433 KB   
875/1433 KB   
876/1433 KB   
878/1433 KB   
879/1433 KB   
880/1433 KB   
882/1433 KB   
883/1433 KB   
884/1433 KB   
886/1433 KB   
887/1433 KB   
888/1433 KB   
890/1433 KB   
891/1433 KB   
893/1433 KB   
894/1433 KB   
895/1433 KB   
897/1433 KB   
898/1433 KB   
899/1433 KB   
901/1433 KB   
902/1433 KB   
904/1433 KB   
905/1433 KB   
906/1433 KB   
908/1433 KB   
909/1433 KB   
910/1433 KB   
912/1433 KB   
913/1433 KB   
914/1433 KB   
916/1433 KB   
917/1433 KB   
919/1433 KB   
920/1433 KB   
921/1433 KB   
923/1433 KB   
924/1433 KB   
925/1433 KB   
927/1433 KB   
928/1433 KB   
929/1433 KB   
931/1433 KB   
932/1433 KB   
934/1433 KB   
935/1433 KB   
936/1433 KB   
938/1433 KB   
939/1433 KB   
940/1433 KB   
942/1433 KB   
943/1433 KB   
945/1433 KB   
946/1433 KB   
947/1433 KB   
949/1433 KB   
950/1433 KB   
951/1433 KB   
953/1433 KB   
954/1433 KB   
955/1433 KB   
957/1433 KB   
958/1433 KB   
960/1433 KB   
961/1433 KB   
962/1433 KB   
964/1433 KB   
965/1433 KB   
966/1433 KB   
968/1433 KB   
969/1433 KB   
970/1433 KB   
972/1433 KB   
973/1433 KB   
975/1433 KB   
976/1433 KB   
977/1433 KB   
979/1433 KB   
980/1433 KB   
981/1433 KB   
983/1433 KB   
984/1433 KB   
986/1433 KB   
987/1433 KB   
988/1433 KB   
990/1433 KB   
991/1433 KB   
992/1433 KB   
994/1433 KB   
995/1433 KB   
996/1433 KB   
998/1433 KB   
999/1433 KB   
1001/1433 KB   
1002/1433 KB   
1003/1433 KB   
1005/1433 KB   
1006/1433 KB   
1007/1433 KB   
1009/1433 KB   
1010/1433 KB   
1012/1433 KB   
1013/1433 KB   
1014/1433 KB   
1016/1433 KB   
1017/1433 KB   
1018/1433 KB   
1020/1433 KB   
1021/1433 KB   
1022/1433 KB   
1024/1433 KB   
1025/1433 KB   
1027/1433 KB   
1028/1433 KB   
1029/1433 KB   
1031/1433 KB   
1032/1433 KB   
1033/1433 KB   
1035/1433 KB   
1036/1433 KB   
1037/1433 KB   
1039/1433 KB   
1040/1433 KB   
1042/1433 KB   
1043/1433 KB   
1044/1433 KB   
1046/1433 KB   
1047/1433 KB   
1048/1433 KB   
1050/1433 KB   
1051/1433 KB   
1053/1433 KB   
1054/1433 KB   
1055/1433 KB   
1057/1433 KB   
1058/1433 KB   
1059/1433 KB   
1061/1433 KB   
1062/1433 KB   
1063/1433 KB   
1065/1433 KB   
1066/1433 KB   
1068/1433 KB   
1069/1433 KB   
1070/1433 KB   
1072/1433 KB   
1073/1433 KB   
1074/1433 KB   
1076/1433 KB   
1077/1433 KB   
1079/1433 KB   
1080/1433 KB   
1081/1433 KB   
1083/1433 KB   
1084/1433 KB   
1085/1433 KB   
1087/1433 KB   
1088/1433 KB   
1089/1433 KB   
1091/1433 KB   
1092/1433 KB   
1094/1433 KB   
1095/1433 KB   
1096/1433 KB   
1098/1433 KB   
1099/1433 KB   
1100/1433 KB   
1102/1433 KB   
1103/1433 KB   
1104/1433 KB   
1106/1433 KB   
1107/1433 KB   
1109/1433 KB   
1110/1433 KB   
1111/1433 KB   
1113/1433 KB   
1114/1433 KB   
1115/1433 KB   
1117/1433 KB   
1118/1433 KB   
1120/1433 KB   
1121/1433 KB   
1122/1433 KB   
1124/1433 KB   
1125/1433 KB   
1126/1433 KB   
1128/1433 KB   
1129/1433 KB   
1130/1433 KB   
1132/1433 KB   
1133/1433 KB   
1135/1433 KB   
1136/1433 KB   
1137/1433 KB   
1139/1433 KB   
1140/1433 KB   
1141/1433 KB   
1143/1433 KB   
1144/1433 KB   
1145/1433 KB   
1147/1433 KB   
1148/1433 KB   
1150/1433 KB   
1151/1433 KB   
1152/1433 KB   
1154/1433 KB   
1155/1433 KB   
1156/1433 KB   
1158/1433 KB   
1159/1433 KB   
1161/1433 KB   
1162/1433 KB   
1163/1433 KB   
1165/1433 KB   
1166/1433 KB   
1167/1433 KB   
1169/1433 KB   
1170/1433 KB   
1171/1433 KB   
1173/1433 KB   
1174/1433 KB   
1176/1433 KB   
1177/1433 KB   
1178/1433 KB   
1180/1433 KB   
1181/1433 KB   
1182/1433 KB   
1184/1433 KB   
1185/1433 KB   
1187/1433 KB   
1188/1433 KB   
1189/1433 KB   
1191/1433 KB   
1192/1433 KB   
1193/1433 KB   
1195/1433 KB   
1196/1433 KB   
1197/1433 KB   
1199/1433 KB   
1200/1433 KB   
1202/1433 KB   
1203/1433 KB   
1204/1433 KB   
1206/1433 KB   
1207/1433 KB   
1208/1433 KB   
1210/1433 KB   
1211/1433 KB   
1212/1433 KB   
1214/1433 KB   
1215/1433 KB   
1217/1433 KB   
1218/1433 KB   
1219/1433 KB   
1221/1433 KB   
1222/1433 KB   
1223/1433 KB   
1225/1433 KB   
1226/1433 KB   
1228/1433 KB   
1229/1433 KB   
1230/1433 KB   
1232/1433 KB   
1233/1433 KB   
1234/1433 KB   
1236/1433 KB   
1237/1433 KB   
1238/1433 KB   
1240/1433 KB   
1241/1433 KB   
1243/1433 KB   
1244/1433 KB   
1245/1433 KB   
1247/1433 KB   
1248/1433 KB   
1249/1433 KB   
1251/1433 KB   
1252/1433 KB   
1254/1433 KB   
1255/1433 KB   
1256/1433 KB   
1258/1433 KB   
1259/1433 KB   
1260/1433 KB   
1262/1433 KB   
1263/1433 KB   
1264/1433 KB   
1266/1433 KB   
1267/1433 KB   
1269/1433 KB   
1270/1433 KB   
1271/1433 KB   
1273/1433 KB   
1274/1433 KB   
1275/1433 KB   
1277/1433 KB   
1278/1433 KB   
1279/1433 KB   
1281/1433 KB   
1282/1433 KB   
1284/1433 KB   
1285/1433 KB   
1286/1433 KB   
1288/1433 KB   
1289/1433 KB   
1290/1433 KB   
1292/1433 KB   
1293/1433 KB   
1295/1433 KB   
1296/1433 KB   
1297/1433 KB   
1299/1433 KB   
1300/1433 KB   
1301/1433 KB   
1303/1433 KB   
1304/1433 KB   
1305/1433 KB   
1307/1433 KB   
1308/1433 KB   
1310/1433 KB   
1311/1433 KB   
1312/1433 KB   
1314/1433 KB   
1315/1433 KB   
1316/1433 KB   
1318/1433 KB   
1319/1433 KB   
1320/1433 KB   
1322/1433 KB   
1323/1433 KB   
1325/1433 KB   
1326/1433 KB   
1327/1433 KB   
1329/1433 KB   
1330/1433 KB   
1331/1433 KB   
1333/1433 KB   
1334/1433 KB   
1336/1433 KB   
1337/1433 KB   
1338/1433 KB   
1340/1433 KB   
1341/1433 KB   
1342/1433 KB   
1344/1433 KB   
1345/1433 KB   
1346/1433 KB   
1348/1433 KB   
1349/1433 KB   
1351/1433 KB   
1352/1433 KB   
1353/1433 KB   
1355/1433 KB   
1356/1433 KB   
1357/1433 KB   
1359/1433 KB   
1360/1433 KB   
1362/1433 KB   
1363/1433 KB   
1364/1433 KB   
1366/1433 KB   
1367/1433 KB   
1368/1433 KB   
1370/1433 KB   
1371/1433 KB   
1372/1433 KB   
1374/1433 KB   
1375/1433 KB   
1377/1433 KB   
1378/1433 KB   
1379/1433 KB   
1381/1433 KB   
1382/1433 KB   
1383/1433 KB   
1385/1433 KB   
1386/1433 KB   
1387/1433 KB   
1389/1433 KB   
1390/1433 KB   
1392/1433 KB   
1393/1433 KB   
1394/1433 KB   
1396/1433 KB   
1397/1433 KB   
1398/1433 KB   
1400/1433 KB   
1401/1433 KB   
1403/1433 KB   
1404/1433 KB   
1405/1433 KB   
1407/1433 KB   
1408/1433 KB   
1409/1433 KB   
1411/1433 KB   
1412/1433 KB   
1413/1433 KB   
1415/1433 KB   
1416/1433 KB   
1418/1433 KB   
1419/1433 KB   
1420/1433 KB   
1422/1433 KB   
1423/1433 KB   
1424/1433 KB   
1426/1433 KB   
1427/1433 KB   
1429/1433 KB   
1430/1433 KB   
1431/1433 KB   
1433/1433 KB   
1433/1433 KB   
               
Downloaded: https://wrensecurity.jfrog.io/wrensecurity/releases/org/forgerock/opendj/opendj-core/3.0.0/opendj-core-3.0.0.jar (1433 KB at 3618.4 KB/sec)
Downloading: https://wrensecurity.jfrog.io/wrensecurity/releases/org/forgerock/opendj/opendj-core/3.0.0/opendj-core-3.0.0.pom
1/13 KB        
3/13 KB   
4/13 KB   
5/13 KB   
7/13 KB   
8/13 KB   
9/13 KB   
11/13 KB   
12/13 KB   
13/13 KB   
           
Downloaded: https://wrensecurity.jfrog.io/wrensecurity/releases/org/forgerock/opendj/opendj-core/3.0.0/opendj-core-3.0.0.pom (13 KB at 185.5 KB/sec)
Downloading: https://wrensecurity.jfrog.io/wrensecurity/releases/org/forgerock/opendj/opendj-sdk-parent/3.0.0/opendj-sdk-parent-3.0.0.pom
1/16 KB    
3/16 KB   
4/16 KB   
5/16 KB   
7/16 KB   
8/16 KB   
9/16 KB   
11/16 KB   
12/16 KB   
14/16 KB   
15/16 KB   
16/16 KB   
           
Downloaded: https://wrensecurity.jfrog.io/wrensecurity/releases/org/forgerock/opendj/opendj-sdk-parent/3.0.0/opendj-sdk-parent-3.0.0.pom (16 KB at 237.3 KB/sec)
Downloading: https://wrensecurity.jfrog.io/wrensecurity/releases/org/forgerock/opendj/opendj-sdk-bom/3.0.0/opendj-sdk-bom-3.0.0.pom
1/7 KB     
3/7 KB   
4/7 KB   
5/7 KB   
7/7 KB   
7/7 KB   
         
Downloaded: https://wrensecurity.jfrog.io/wrensecurity/releases/org/forgerock/opendj/opendj-sdk-bom/3.0.0/opendj-sdk-bom-3.0.0.pom (7 KB at 105.1 KB/sec)
Downloading: https://wrensecurity.jfrog.io/wrensecurity/releases/org/forgerock/forgerock-parent/2.0.3/forgerock-parent-2.0.3.pom
         
Downloaded: https://wrensecurity.jfrog.io/wrensecurity/releases/org/forgerock/forgerock-parent/2.0.3/forgerock-parent-2.0.3.pom (0 B at 0.0 KB/sec)
Downloading: https://wrensecurity.jfrog.io/wrensecurity/releases/org/forgerock/commons/i18n-core/1.4.3/i18n-core-1.4.3.pom
1/3 KB   
3/3 KB   
3/3 KB   
         
Downloaded: https://wrensecurity.jfrog.io/wrensecurity/releases/org/forgerock/commons/i18n-core/1.4.3/i18n-core-1.4.3.pom (3 KB at 40.4 KB/sec)
Downloading: https://wrensecurity.jfrog.io/wrensecurity/releases/org/forgerock/commons/i18n-framework/1.4.3/i18n-framework-1.4.3.pom
1/5 KB   
3/5 KB   
4/5 KB   
5/5 KB   
         
Downloaded: https://wrensecurity.jfrog.io/wrensecurity/releases/org/forgerock/commons/i18n-framework/1.4.3/i18n-framework-1.4.3.pom (5 KB at 69.2 KB/sec)
Downloading: https://wrensecurity.jfrog.io/wrensecurity/releases/org/forgerock/forgerock-parent/1.2.1/forgerock-parent-1.2.1.pom
         
Downloaded: https://wrensecurity.jfrog.io/wrensecurity/releases/org/forgerock/forgerock-parent/1.2.1/forgerock-parent-1.2.1.pom (0 B at 0.0 KB/sec)
Downloading: https://wrensecurity.jfrog.io/wrensecurity/releases/org/forgerock/commons/forgerock-util/3.0.2/forgerock-util-3.0.2.pom
         
Downloaded: https://wrensecurity.jfrog.io/wrensecurity/releases/org/forgerock/commons/forgerock-util/3.0.2/forgerock-util-3.0.2.pom (0 B at 0.0 KB/sec)
Downloading: https://wrensecurity.jfrog.io/wrensecurity/releases/org/forgerock/commons/forgerock-utilities/3.0.2/forgerock-utilities-3.0.2.pom
         
Downloaded: https://wrensecurity.jfrog.io/wrensecurity/releases/org/forgerock/commons/forgerock-utilities/3.0.2/forgerock-utilities-3.0.2.pom (0 B at 0.0 KB/sec)
Downloading: https://wrensecurity.jfrog.io/wrensecurity/releases/org/forgerock/commons/i18n-slf4j/1.4.3/i18n-slf4j-1.4.3.pom
1/4 KB   
3/4 KB   
4/4 KB   
4/4 KB   
         
Downloaded: https://wrensecurity.jfrog.io/wrensecurity/releases/org/forgerock/commons/i18n-slf4j/1.4.3/i18n-slf4j-1.4.3.pom (4 KB at 53.9 KB/sec)
Downloading: https://wrensecurity.jfrog.io/wrensecurity/releases/org/forgerock/commons/forgerock-util/3.0.2/forgerock-util-3.0.2.jar
Downloading: https://wrensecurity.jfrog.io/wrensecurity/releases/org/forgerock/commons/i18n-core/1.4.3/i18n-core-1.4.3.jar
Downloading: https://wrensecurity.jfrog.io/wrensecurity/releases/org/forgerock/commons/i18n-slf4j/1.4.3/i18n-slf4j-1.4.3.jar
1/17 KB   
3/17 KB   
4/17 KB   
5/17 KB   
7/17 KB   
8/17 KB   
9/17 KB   
11/17 KB   
12/17 KB   
13/17 KB   
15/17 KB   
16/17 KB   
17/17 KB   
           
Downloaded: https://wrensecurity.jfrog.io/wrensecurity/releases/org/forgerock/commons/i18n-slf4j/1.4.3/i18n-slf4j-1.4.3.jar (17 KB at 237.3 KB/sec)
           
Downloaded: https://wrensecurity.jfrog.io/wrensecurity/releases/org/forgerock/commons/forgerock-util/3.0.2/forgerock-util-3.0.2.jar (0 B at 0.0 KB/sec)
1/26 KB    
3/26 KB   
4/26 KB   
5/26 KB   
7/26 KB   
8/26 KB   
9/26 KB   
11/26 KB   
12/26 KB   
13/26 KB   
15/26 KB   
16/26 KB   
18/26 KB   
19/26 KB   
20/26 KB   
22/26 KB   
23/26 KB   
24/26 KB   
26/26 KB   
26/26 KB   
           
Downloaded: https://wrensecurity.jfrog.io/wrensecurity/releases/org/forgerock/commons/i18n-core/1.4.3/i18n-core-1.4.3.jar (26 KB at 72.4 KB/sec)
[INFO] Succeeded with 0 errors; 0 warnings; and 0 other changes.
[INFO] 
[INFO] --- maven-install-plugin:2.5.2:install (default-install) @ opendj-core ---
[INFO] Installing /home/tomcat/.jenkins/jobs/gluu-wrends-3.5/workspace/opendj-core/target/opendj-core-4.0.0-M3.jar to /var/www/html/maven/org/forgerock/opendj/opendj-core/4.0.0-M3/opendj-core-4.0.0-M3.jar
[INFO] Installing /home/tomcat/.jenkins/jobs/gluu-wrends-3.5/workspace/opendj-core/pom.xml to /var/www/html/maven/org/forgerock/opendj/opendj-core/4.0.0-M3/opendj-core-4.0.0-M3.pom
[INFO] Installing /home/tomcat/.jenkins/jobs/gluu-wrends-3.5/workspace/opendj-core/target/opendj-core-4.0.0-M3-javadoc.jar to /var/www/html/maven/org/forgerock/opendj/opendj-core/4.0.0-M3/opendj-core-4.0.0-M3-javadoc.jar
[INFO] Installing /home/tomcat/.jenkins/jobs/gluu-wrends-3.5/workspace/opendj-core/target/opendj-core-4.0.0-M3-sources.jar to /var/www/html/maven/org/forgerock/opendj/opendj-core/4.0.0-M3/opendj-core-4.0.0-M3-sources.jar
[INFO] 
[INFO] --- maven-bundle-plugin:2.3.7:install (default-install) @ opendj-core ---
[INFO] Installing org/forgerock/opendj/opendj-core/4.0.0-M3/opendj-core-4.0.0-M3.jar
[INFO] Writing OBR metadata
[INFO]                                                                         
[INFO] ------------------------------------------------------------------------
[INFO] Building Wren:DS Doc Helper Maven Plugin 4.0.0-M3
[INFO] ------------------------------------------------------------------------
Downloading: https://wrensecurity.jfrog.io/wrensecurity/releases/org/freemarker/freemarker/2.3.24-incubating/freemarker-2.3.24-incubating.pom
1/4 KB     
2/4 KB   
4/4 KB   
4/4 KB   
         
Downloaded: https://wrensecurity.jfrog.io/wrensecurity/releases/org/freemarker/freemarker/2.3.24-incubating/freemarker-2.3.24-incubating.pom (4 KB at 15.5 KB/sec)
Downloading: https://wrensecurity.jfrog.io/wrensecurity/releases/org/freemarker/freemarker/2.3.24-incubating/freemarker-2.3.24-incubating.jar
1/1438 KB   
2/1438 KB   
4/1438 KB   
5/1438 KB   
7/1438 KB   
8/1438 KB   
9/1438 KB   
11/1438 KB   
12/1438 KB   
13/1438 KB   
15/1438 KB   
16/1438 KB   
18/1438 KB   
19/1438 KB   
20/1438 KB   
22/1438 KB   
23/1438 KB   
24/1438 KB   
26/1438 KB   
27/1438 KB   
28/1438 KB   
30/1438 KB   
31/1438 KB   
33/1438 KB   
34/1438 KB   
35/1438 KB   
37/1438 KB   
38/1438 KB   
39/1438 KB   
41/1438 KB   
42/1438 KB   
44/1438 KB   
45/1438 KB   
46/1438 KB   
48/1438 KB   
49/1438 KB   
50/1438 KB   
52/1438 KB   
53/1438 KB   
54/1438 KB   
56/1438 KB   
57/1438 KB   
59/1438 KB   
60/1438 KB   
61/1438 KB   
63/1438 KB   
64/1438 KB   
65/1438 KB   
67/1438 KB   
68/1438 KB   
69/1438 KB   
71/1438 KB   
72/1438 KB   
74/1438 KB   
75/1438 KB   
76/1438 KB   
78/1438 KB   
79/1438 KB   
80/1438 KB   
82/1438 KB   
83/1438 KB   
85/1438 KB   
86/1438 KB   
87/1438 KB   
89/1438 KB   
90/1438 KB   
91/1438 KB   
93/1438 KB   
94/1438 KB   
95/1438 KB   
97/1438 KB   
98/1438 KB   
100/1438 KB   
101/1438 KB   
102/1438 KB   
104/1438 KB   
105/1438 KB   
106/1438 KB   
108/1438 KB   
109/1438 KB   
111/1438 KB   
112/1438 KB   
113/1438 KB   
115/1438 KB   
116/1438 KB   
117/1438 KB   
119/1438 KB   
120/1438 KB   
121/1438 KB   
123/1438 KB   
124/1438 KB   
126/1438 KB   
127/1438 KB   
128/1438 KB   
130/1438 KB   
131/1438 KB   
132/1438 KB   
134/1438 KB   
135/1438 KB   
136/1438 KB   
138/1438 KB   
139/1438 KB   
141/1438 KB   
142/1438 KB   
143/1438 KB   
145/1438 KB   
146/1438 KB   
147/1438 KB   
149/1438 KB   
150/1438 KB   
152/1438 KB   
153/1438 KB   
154/1438 KB   
156/1438 KB   
157/1438 KB   
158/1438 KB   
160/1438 KB   
161/1438 KB   
162/1438 KB   
164/1438 KB   
165/1438 KB   
167/1438 KB   
168/1438 KB   
169/1438 KB   
171/1438 KB   
172/1438 KB   
173/1438 KB   
175/1438 KB   
176/1438 KB   
177/1438 KB   
179/1438 KB   
180/1438 KB   
182/1438 KB   
183/1438 KB   
184/1438 KB   
186/1438 KB   
187/1438 KB   
188/1438 KB   
190/1438 KB   
191/1438 KB   
193/1438 KB   
194/1438 KB   
195/1438 KB   
197/1438 KB   
198/1438 KB   
199/1438 KB   
201/1438 KB   
202/1438 KB   
203/1438 KB   
205/1438 KB   
206/1438 KB   
208/1438 KB   
209/1438 KB   
210/1438 KB   
212/1438 KB   
213/1438 KB   
214/1438 KB   
216/1438 KB   
217/1438 KB   
219/1438 KB   
220/1438 KB   
221/1438 KB   
223/1438 KB   
224/1438 KB   
225/1438 KB   
227/1438 KB   
228/1438 KB   
229/1438 KB   
231/1438 KB   
232/1438 KB   
234/1438 KB   
235/1438 KB   
236/1438 KB   
238/1438 KB   
239/1438 KB   
240/1438 KB   
242/1438 KB   
243/1438 KB   
244/1438 KB   
246/1438 KB   
247/1438 KB   
249/1438 KB   
250/1438 KB   
251/1438 KB   
253/1438 KB   
254/1438 KB   
255/1438 KB   
257/1438 KB   
258/1438 KB   
260/1438 KB   
261/1438 KB   
262/1438 KB   
264/1438 KB   
265/1438 KB   
266/1438 KB   
268/1438 KB   
269/1438 KB   
270/1438 KB   
272/1438 KB   
273/1438 KB   
275/1438 KB   
276/1438 KB   
277/1438 KB   
279/1438 KB   
280/1438 KB   
281/1438 KB   
283/1438 KB   
284/1438 KB   
286/1438 KB   
287/1438 KB   
288/1438 KB   
290/1438 KB   
291/1438 KB   
292/1438 KB   
294/1438 KB   
295/1438 KB   
296/1438 KB   
298/1438 KB   
299/1438 KB   
301/1438 KB   
302/1438 KB   
303/1438 KB   
305/1438 KB   
306/1438 KB   
307/1438 KB   
309/1438 KB   
310/1438 KB   
311/1438 KB   
313/1438 KB   
314/1438 KB   
316/1438 KB   
317/1438 KB   
318/1438 KB   
320/1438 KB   
321/1438 KB   
322/1438 KB   
324/1438 KB   
325/1438 KB   
327/1438 KB   
328/1438 KB   
329/1438 KB   
331/1438 KB   
332/1438 KB   
333/1438 KB   
335/1438 KB   
336/1438 KB   
337/1438 KB   
339/1438 KB   
340/1438 KB   
342/1438 KB   
343/1438 KB   
344/1438 KB   
346/1438 KB   
347/1438 KB   
348/1438 KB   
350/1438 KB   
351/1438 KB   
352/1438 KB   
354/1438 KB   
355/1438 KB   
357/1438 KB   
358/1438 KB   
359/1438 KB   
361/1438 KB   
362/1438 KB   
363/1438 KB   
365/1438 KB   
366/1438 KB   
368/1438 KB   
369/1438 KB   
370/1438 KB   
372/1438 KB   
373/1438 KB   
374/1438 KB   
376/1438 KB   
377/1438 KB   
378/1438 KB   
380/1438 KB   
381/1438 KB   
383/1438 KB   
384/1438 KB   
385/1438 KB   
387/1438 KB   
388/1438 KB   
389/1438 KB   
391/1438 KB   
392/1438 KB   
394/1438 KB   
395/1438 KB   
396/1438 KB   
398/1438 KB   
399/1438 KB   
400/1438 KB   
402/1438 KB   
403/1438 KB   
404/1438 KB   
406/1438 KB   
407/1438 KB   
409/1438 KB   
410/1438 KB   
411/1438 KB   
413/1438 KB   
414/1438 KB   
415/1438 KB   
417/1438 KB   
418/1438 KB   
419/1438 KB   
421/1438 KB   
422/1438 KB   
424/1438 KB   
425/1438 KB   
426/1438 KB   
428/1438 KB   
429/1438 KB   
430/1438 KB   
432/1438 KB   
433/1438 KB   
435/1438 KB   
436/1438 KB   
437/1438 KB   
439/1438 KB   
440/1438 KB   
441/1438 KB   
443/1438 KB   
444/1438 KB   
445/1438 KB   
447/1438 KB   
448/1438 KB   
450/1438 KB   
451/1438 KB   
452/1438 KB   
454/1438 KB   
455/1438 KB   
456/1438 KB   
458/1438 KB   
459/1438 KB   
461/1438 KB   
462/1438 KB   
463/1438 KB   
465/1438 KB   
466/1438 KB   
467/1438 KB   
469/1438 KB   
470/1438 KB   
471/1438 KB   
473/1438 KB   
474/1438 KB   
476/1438 KB   
477/1438 KB   
478/1438 KB   
480/1438 KB   
481/1438 KB   
482/1438 KB   
484/1438 KB   
485/1438 KB   
486/1438 KB   
488/1438 KB   
489/1438 KB   
491/1438 KB   
492/1438 KB   
493/1438 KB   
495/1438 KB   
496/1438 KB   
497/1438 KB   
499/1438 KB   
500/1438 KB   
502/1438 KB   
503/1438 KB   
504/1438 KB   
506/1438 KB   
507/1438 KB   
508/1438 KB   
510/1438 KB   
511/1438 KB   
512/1438 KB   
514/1438 KB   
515/1438 KB   
517/1438 KB   
518/1438 KB   
519/1438 KB   
521/1438 KB   
522/1438 KB   
523/1438 KB   
525/1438 KB   
526/1438 KB   
527/1438 KB   
529/1438 KB   
530/1438 KB   
532/1438 KB   
533/1438 KB   
534/1438 KB   
536/1438 KB   
537/1438 KB   
538/1438 KB   
540/1438 KB   
541/1438 KB   
543/1438 KB   
544/1438 KB   
545/1438 KB   
547/1438 KB   
548/1438 KB   
549/1438 KB   
551/1438 KB   
552/1438 KB   
553/1438 KB   
555/1438 KB   
556/1438 KB   
558/1438 KB   
559/1438 KB   
560/1438 KB   
562/1438 KB   
563/1438 KB   
564/1438 KB   
566/1438 KB   
567/1438 KB   
569/1438 KB   
570/1438 KB   
571/1438 KB   
573/1438 KB   
574/1438 KB   
575/1438 KB   
577/1438 KB   
578/1438 KB   
579/1438 KB   
581/1438 KB   
582/1438 KB   
584/1438 KB   
585/1438 KB   
586/1438 KB   
588/1438 KB   
589/1438 KB   
590/1438 KB   
592/1438 KB   
593/1438 KB   
594/1438 KB   
596/1438 KB   
597/1438 KB   
599/1438 KB   
600/1438 KB   
601/1438 KB   
603/1438 KB   
604/1438 KB   
605/1438 KB   
607/1438 KB   
608/1438 KB   
610/1438 KB   
611/1438 KB   
612/1438 KB   
614/1438 KB   
615/1438 KB   
616/1438 KB   
618/1438 KB   
619/1438 KB   
620/1438 KB   
622/1438 KB   
623/1438 KB   
625/1438 KB   
626/1438 KB   
627/1438 KB   
629/1438 KB   
630/1438 KB   
631/1438 KB   
633/1438 KB   
634/1438 KB   
636/1438 KB   
637/1438 KB   
638/1438 KB   
640/1438 KB   
641/1438 KB   
642/1438 KB   
644/1438 KB   
645/1438 KB   
646/1438 KB   
648/1438 KB   
649/1438 KB   
651/1438 KB   
652/1438 KB   
653/1438 KB   
655/1438 KB   
656/1438 KB   
657/1438 KB   
659/1438 KB   
660/1438 KB   
661/1438 KB   
663/1438 KB   
664/1438 KB   
666/1438 KB   
667/1438 KB   
668/1438 KB   
670/1438 KB   
671/1438 KB   
672/1438 KB   
674/1438 KB   
675/1438 KB   
677/1438 KB   
678/1438 KB   
679/1438 KB   
681/1438 KB   
682/1438 KB   
683/1438 KB   
685/1438 KB   
686/1438 KB   
687/1438 KB   
689/1438 KB   
690/1438 KB   
692/1438 KB   
693/1438 KB   
694/1438 KB   
696/1438 KB   
697/1438 KB   
698/1438 KB   
700/1438 KB   
701/1438 KB   
702/1438 KB   
704/1438 KB   
705/1438 KB   
707/1438 KB   
708/1438 KB   
709/1438 KB   
711/1438 KB   
712/1438 KB   
713/1438 KB   
715/1438 KB   
716/1438 KB   
718/1438 KB   
719/1438 KB   
720/1438 KB   
722/1438 KB   
723/1438 KB   
724/1438 KB   
726/1438 KB   
727/1438 KB   
728/1438 KB   
730/1438 KB   
731/1438 KB   
733/1438 KB   
734/1438 KB   
735/1438 KB   
737/1438 KB   
738/1438 KB   
739/1438 KB   
741/1438 KB   
742/1438 KB   
744/1438 KB   
745/1438 KB   
746/1438 KB   
748/1438 KB   
749/1438 KB   
750/1438 KB   
752/1438 KB   
753/1438 KB   
754/1438 KB   
756/1438 KB   
757/1438 KB   
759/1438 KB   
760/1438 KB   
761/1438 KB   
763/1438 KB   
764/1438 KB   
765/1438 KB   
767/1438 KB   
768/1438 KB   
769/1438 KB   
771/1438 KB   
772/1438 KB   
774/1438 KB   
775/1438 KB   
776/1438 KB   
778/1438 KB   
779/1438 KB   
780/1438 KB   
782/1438 KB   
783/1438 KB   
785/1438 KB   
786/1438 KB   
787/1438 KB   
789/1438 KB   
790/1438 KB   
791/1438 KB   
793/1438 KB   
794/1438 KB   
795/1438 KB   
797/1438 KB   
798/1438 KB   
800/1438 KB   
801/1438 KB   
802/1438 KB   
804/1438 KB   
805/1438 KB   
806/1438 KB   
808/1438 KB   
809/1438 KB   
811/1438 KB   
812/1438 KB   
813/1438 KB   
815/1438 KB   
816/1438 KB   
817/1438 KB   
819/1438 KB   
820/1438 KB   
821/1438 KB   
823/1438 KB   
824/1438 KB   
826/1438 KB   
827/1438 KB   
828/1438 KB   
830/1438 KB   
831/1438 KB   
832/1438 KB   
834/1438 KB   
835/1438 KB   
836/1438 KB   
838/1438 KB   
839/1438 KB   
841/1438 KB   
842/1438 KB   
843/1438 KB   
845/1438 KB   
846/1438 KB   
847/1438 KB   
849/1438 KB   
850/1438 KB   
852/1438 KB   
853/1438 KB   
854/1438 KB   
856/1438 KB   
857/1438 KB   
858/1438 KB   
860/1438 KB   
861/1438 KB   
862/1438 KB   
864/1438 KB   
865/1438 KB   
867/1438 KB   
868/1438 KB   
869/1438 KB   
871/1438 KB   
872/1438 KB   
873/1438 KB   
875/1438 KB   
876/1438 KB   
877/1438 KB   
879/1438 KB   
880/1438 KB   
882/1438 KB   
883/1438 KB   
884/1438 KB   
886/1438 KB   
887/1438 KB   
888/1438 KB   
890/1438 KB   
891/1438 KB   
893/1438 KB   
894/1438 KB   
895/1438 KB   
897/1438 KB   
898/1438 KB   
899/1438 KB   
901/1438 KB   
902/1438 KB   
903/1438 KB   
905/1438 KB   
906/1438 KB   
908/1438 KB   
909/1438 KB   
910/1438 KB   
912/1438 KB   
913/1438 KB   
914/1438 KB   
916/1438 KB   
917/1438 KB   
919/1438 KB   
920/1438 KB   
921/1438 KB   
923/1438 KB   
924/1438 KB   
925/1438 KB   
927/1438 KB   
928/1438 KB   
929/1438 KB   
931/1438 KB   
932/1438 KB   
934/1438 KB   
935/1438 KB   
936/1438 KB   
938/1438 KB   
939/1438 KB   
940/1438 KB   
942/1438 KB   
943/1438 KB   
944/1438 KB   
946/1438 KB   
947/1438 KB   
949/1438 KB   
950/1438 KB   
951/1438 KB   
953/1438 KB   
954/1438 KB   
955/1438 KB   
957/1438 KB   
958/1438 KB   
960/1438 KB   
961/1438 KB   
962/1438 KB   
964/1438 KB   
965/1438 KB   
966/1438 KB   
968/1438 KB   
969/1438 KB   
970/1438 KB   
972/1438 KB   
973/1438 KB   
975/1438 KB   
976/1438 KB   
977/1438 KB   
979/1438 KB   
980/1438 KB   
981/1438 KB   
983/1438 KB   
984/1438 KB   
986/1438 KB   
987/1438 KB   
988/1438 KB   
990/1438 KB   
991/1438 KB   
992/1438 KB   
994/1438 KB   
995/1438 KB   
996/1438 KB   
998/1438 KB   
999/1438 KB   
1001/1438 KB   
1002/1438 KB   
1003/1438 KB   
1005/1438 KB   
1006/1438 KB   
1007/1438 KB   
1009/1438 KB   
1010/1438 KB   
1011/1438 KB   
1013/1438 KB   
1014/1438 KB   
1016/1438 KB   
1017/1438 KB   
1018/1438 KB   
1020/1438 KB   
1021/1438 KB   
1022/1438 KB   
1024/1438 KB   
1025/1438 KB   
1027/1438 KB   
1028/1438 KB   
1029/1438 KB   
1031/1438 KB   
1032/1438 KB   
1033/1438 KB   
1035/1438 KB   
1036/1438 KB   
1037/1438 KB   
1039/1438 KB   
1040/1438 KB   
1042/1438 KB   
1043/1438 KB   
1044/1438 KB   
1046/1438 KB   
1047/1438 KB   
1048/1438 KB   
1050/1438 KB   
1051/1438 KB   
1052/1438 KB   
1054/1438 KB   
1055/1438 KB   
1057/1438 KB   
1058/1438 KB   
1059/1438 KB   
1061/1438 KB   
1062/1438 KB   
1063/1438 KB   
1065/1438 KB   
1066/1438 KB   
1068/1438 KB   
1069/1438 KB   
1070/1438 KB   
1072/1438 KB   
1073/1438 KB   
1074/1438 KB   
1076/1438 KB   
1077/1438 KB   
1078/1438 KB   
1080/1438 KB   
1081/1438 KB   
1083/1438 KB   
1084/1438 KB   
1085/1438 KB   
1087/1438 KB   
1088/1438 KB   
1089/1438 KB   
1091/1438 KB   
1092/1438 KB   
1094/1438 KB   
1095/1438 KB   
1096/1438 KB   
1098/1438 KB   
1099/1438 KB   
1100/1438 KB   
1102/1438 KB   
1103/1438 KB   
1104/1438 KB   
1106/1438 KB   
1107/1438 KB   
1109/1438 KB   
1110/1438 KB   
1111/1438 KB   
1113/1438 KB   
1114/1438 KB   
1115/1438 KB   
1117/1438 KB   
1118/1438 KB   
1119/1438 KB   
1121/1438 KB   
1122/1438 KB   
1124/1438 KB   
1125/1438 KB   
1126/1438 KB   
1128/1438 KB   
1129/1438 KB   
1130/1438 KB   
1132/1438 KB   
1133/1438 KB   
1135/1438 KB   
1136/1438 KB   
1137/1438 KB   
1139/1438 KB   
1140/1438 KB   
1141/1438 KB   
1143/1438 KB   
1144/1438 KB   
1145/1438 KB   
1147/1438 KB   
1148/1438 KB   
1150/1438 KB   
1151/1438 KB   
1152/1438 KB   
1154/1438 KB   
1155/1438 KB   
1156/1438 KB   
1158/1438 KB   
1159/1438 KB   
1161/1438 KB   
1162/1438 KB   
1163/1438 KB   
1165/1438 KB   
1166/1438 KB   
1167/1438 KB   
1169/1438 KB   
1170/1438 KB   
1171/1438 KB   
1173/1438 KB   
1174/1438 KB   
1176/1438 KB   
1177/1438 KB   
1178/1438 KB   
1180/1438 KB   
1181/1438 KB   
1182/1438 KB   
1184/1438 KB   
1185/1438 KB   
1186/1438 KB   
1188/1438 KB   
1189/1438 KB   
1191/1438 KB   
1192/1438 KB   
1193/1438 KB   
1195/1438 KB   
1196/1438 KB   
1197/1438 KB   
1199/1438 KB   
1200/1438 KB   
1202/1438 KB   
1203/1438 KB   
1204/1438 KB   
1206/1438 KB   
1207/1438 KB   
1208/1438 KB   
1210/1438 KB   
1211/1438 KB   
1212/1438 KB   
1214/1438 KB   
1215/1438 KB   
1217/1438 KB   
1218/1438 KB   
1219/1438 KB   
1221/1438 KB   
1222/1438 KB   
1223/1438 KB   
1225/1438 KB   
1226/1438 KB   
1227/1438 KB   
1229/1438 KB   
1230/1438 KB   
1232/1438 KB   
1233/1438 KB   
1234/1438 KB   
1236/1438 KB   
1237/1438 KB   
1238/1438 KB   
1240/1438 KB   
1241/1438 KB   
1243/1438 KB   
1244/1438 KB   
1245/1438 KB   
1247/1438 KB   
1248/1438 KB   
1249/1438 KB   
1251/1438 KB   
1252/1438 KB   
1253/1438 KB   
1255/1438 KB   
1256/1438 KB   
1258/1438 KB   
1259/1438 KB   
1260/1438 KB   
1262/1438 KB   
1263/1438 KB   
1264/1438 KB   
1266/1438 KB   
1267/1438 KB   
1269/1438 KB   
1270/1438 KB   
1271/1438 KB   
1273/1438 KB   
1274/1438 KB   
1275/1438 KB   
1277/1438 KB   
1278/1438 KB   
1279/1438 KB   
1281/1438 KB   
1282/1438 KB   
1284/1438 KB   
1285/1438 KB   
1286/1438 KB   
1288/1438 KB   
1289/1438 KB   
1290/1438 KB   
1292/1438 KB   
1293/1438 KB   
1294/1438 KB   
1296/1438 KB   
1297/1438 KB   
1299/1438 KB   
1300/1438 KB   
1301/1438 KB   
1303/1438 KB   
1304/1438 KB   
1305/1438 KB   
1307/1438 KB   
1308/1438 KB   
1310/1438 KB   
1311/1438 KB   
1312/1438 KB   
1314/1438 KB   
1315/1438 KB   
1316/1438 KB   
1318/1438 KB   
1319/1438 KB   
1320/1438 KB   
1322/1438 KB   
1323/1438 KB   
1325/1438 KB   
1326/1438 KB   
1327/1438 KB   
1329/1438 KB   
1330/1438 KB   
1331/1438 KB   
1333/1438 KB   
1334/1438 KB   
1336/1438 KB   
1337/1438 KB   
1338/1438 KB   
1340/1438 KB   
1341/1438 KB   
1342/1438 KB   
1344/1438 KB   
1345/1438 KB   
1346/1438 KB   
1348/1438 KB   
1349/1438 KB   
1351/1438 KB   
1352/1438 KB   
1353/1438 KB   
1355/1438 KB   
1356/1438 KB   
1357/1438 KB   
1359/1438 KB   
1360/1438 KB   
1361/1438 KB   
1363/1438 KB   
1364/1438 KB   
1366/1438 KB   
1367/1438 KB   
1368/1438 KB   
1370/1438 KB   
1371/1438 KB   
1372/1438 KB   
1374/1438 KB   
1375/1438 KB   
1377/1438 KB   
1378/1438 KB   
1379/1438 KB   
1381/1438 KB   
1382/1438 KB   
1383/1438 KB   
1385/1438 KB   
1386/1438 KB   
1387/1438 KB   
1389/1438 KB   
1390/1438 KB   
1392/1438 KB   
1393/1438 KB   
1394/1438 KB   
1396/1438 KB   
1397/1438 KB   
1398/1438 KB   
1400/1438 KB   
1401/1438 KB   
1402/1438 KB   
1404/1438 KB   
1405/1438 KB   
1407/1438 KB   
1408/1438 KB   
1409/1438 KB   
1411/1438 KB   
1412/1438 KB   
1413/1438 KB   
1415/1438 KB   
1416/1438 KB   
1418/1438 KB   
1419/1438 KB   
1420/1438 KB   
1422/1438 KB   
1423/1438 KB   
1424/1438 KB   
1426/1438 KB   
1427/1438 KB   
1428/1438 KB   
1430/1438 KB   
1431/1438 KB   
1433/1438 KB   
1434/1438 KB   
1435/1438 KB   
1437/1438 KB   
1438/1438 KB   
1438/1438 KB   
               
Downloaded: https://wrensecurity.jfrog.io/wrensecurity/releases/org/freemarker/freemarker/2.3.24-incubating/freemarker-2.3.24-incubating.jar (1438 KB at 2964.6 KB/sec)
[INFO] 
[INFO] --- maven-clean-plugin:2.6.1:clean (default-clean) @ opendj-doc-maven-plugin ---
[INFO] 
[INFO] --- maven-enforcer-plugin:1.4:enforce (enforce-plugin-versions) @ opendj-doc-maven-plugin ---
[INFO] 
[INFO] --- maven-enforcer-plugin:1.4:enforce (enforce-java-version) @ opendj-doc-maven-plugin ---
[INFO] 
[INFO] --- maven-enforcer-plugin:1.4:enforce (enforce-maven-version) @ opendj-doc-maven-plugin ---
[INFO] 
[INFO] --- i18n-maven-plugin:1.4.2:generate-messages (default) @ opendj-doc-maven-plugin ---
[INFO] Created message output directory: /home/tomcat/.jenkins/jobs/gluu-wrends-3.5/workspace/opendj-doc-maven-plugin/target/generated-sources/messages
[INFO] Adding source directory: /home/tomcat/.jenkins/jobs/gluu-wrends-3.5/workspace/opendj-doc-maven-plugin/target/generated-sources/messages
[INFO] Generating DocsMessages.java from docs.properties
[INFO] 
[INFO] --- maven-remote-resources-plugin:1.5:process (default) @ opendj-doc-maven-plugin ---
[INFO] 
[INFO] --- maven-resources-plugin:2.7:resources (default-resources) @ opendj-doc-maven-plugin ---
[INFO] Using 'UTF-8' encoding to copy filtered resources.
[INFO] Copying 11 resources
[INFO] Copying 1 resource
[INFO] 
[INFO] --- maven-compiler-plugin:3.3:compile (default-compile) @ opendj-doc-maven-plugin ---
[INFO] Changes detected - recompiling the module!
[INFO] Compiling 10 source files to /home/tomcat/.jenkins/jobs/gluu-wrends-3.5/workspace/opendj-doc-maven-plugin/target/classes
[WARNING] bootstrap class path not set in conjunction with -source 1.7
[INFO] 
[INFO] --- maven-enforcer-plugin:1.4:enforce (enforce-plugin-versions) @ opendj-doc-maven-plugin ---
[INFO] 
[INFO] --- maven-enforcer-plugin:1.4:enforce (enforce-java-version) @ opendj-doc-maven-plugin ---
[INFO] 
[INFO] --- maven-enforcer-plugin:1.4:enforce (enforce-maven-version) @ opendj-doc-maven-plugin ---
[INFO] 
[INFO] --- i18n-maven-plugin:1.4.2:generate-messages (default) @ opendj-doc-maven-plugin ---
[INFO] Adding source directory: /home/tomcat/.jenkins/jobs/gluu-wrends-3.5/workspace/opendj-doc-maven-plugin/target/generated-sources/messages
[INFO] DocsMessages.java is up to date
[INFO] 
[INFO] --- maven-remote-resources-plugin:1.5:process (default) @ opendj-doc-maven-plugin ---
[INFO] 
[INFO] --- maven-resources-plugin:2.7:resources (default-resources) @ opendj-doc-maven-plugin ---
[INFO] Using 'UTF-8' encoding to copy filtered resources.
[INFO] Copying 11 resources
[INFO] Copying 1 resource
[INFO] Copying 1 resource
[INFO] 
[INFO] --- maven-compiler-plugin:3.3:compile (default-compile) @ opendj-doc-maven-plugin ---
[INFO] Changes detected - recompiling the module!
[INFO] Compiling 10 source files to /home/tomcat/.jenkins/jobs/gluu-wrends-3.5/workspace/opendj-doc-maven-plugin/target/classes
[WARNING] bootstrap class path not set in conjunction with -source 1.7
[INFO] 
[INFO] --- maven-plugin-plugin:3.2:descriptor (default-descriptor) @ opendj-doc-maven-plugin ---
[INFO] Using 'UTF-8' encoding to read mojo metadata.
[INFO] Applying mojo extractor for language: java
[INFO] Mojo extractor for language: java found 0 mojo descriptors.
[INFO] Applying mojo extractor for language: bsh
[INFO] Mojo extractor for language: bsh found 0 mojo descriptors.
[INFO] Applying mojo extractor for language: java-annotations
[INFO] Mojo extractor for language: java-annotations found 6 mojo descriptors.
[INFO] 
[INFO] --- maven-plugin-plugin:3.2:descriptor (mojo-descriptor) @ opendj-doc-maven-plugin ---
[INFO] Using 'UTF-8' encoding to read mojo metadata.
[INFO] Applying mojo extractor for language: java
[INFO] Mojo extractor for language: java found 0 mojo descriptors.
[INFO] Applying mojo extractor for language: bsh
[INFO] Mojo extractor for language: bsh found 0 mojo descriptors.
[INFO] Applying mojo extractor for language: java-annotations
[INFO] Mojo extractor for language: java-annotations found 6 mojo descriptors.
[INFO] 
[INFO] --- maven-resources-plugin:2.7:testResources (default-testResources) @ opendj-doc-maven-plugin ---
[INFO] Not copying test resources
[INFO] 
[INFO] --- maven-compiler-plugin:3.3:testCompile (default-testCompile) @ opendj-doc-maven-plugin ---
[INFO] Not compiling test sources
[INFO] 
[INFO] --- maven-surefire-plugin:2.18.1:test (default-test) @ opendj-doc-maven-plugin ---
[INFO] Tests are skipped.
[INFO] 
[INFO] --- maven-jar-plugin:2.6:jar (default-jar) @ opendj-doc-maven-plugin ---
[INFO] Building jar: /home/tomcat/.jenkins/jobs/gluu-wrends-3.5/workspace/opendj-doc-maven-plugin/target/opendj-doc-maven-plugin-4.0.0-M3.jar
[INFO] 
[INFO] --- maven-plugin-plugin:3.2:addPluginArtifactMetadata (default-addPluginArtifactMetadata) @ opendj-doc-maven-plugin ---
[INFO] 
[INFO] --- maven-javadoc-plugin:2.9:jar (default) @ opendj-doc-maven-plugin ---
[INFO] Building jar: /home/tomcat/.jenkins/jobs/gluu-wrends-3.5/workspace/opendj-doc-maven-plugin/target/opendj-doc-maven-plugin-4.0.0-M3-javadoc.jar
[INFO] 
[INFO] --- pgpverify-maven-plugin:1.3.0-wren3:check (default) @ opendj-doc-maven-plugin ---
Downloading: https://wrensecurity.jfrog.io/wrensecurity/releases/org/freemarker/freemarker/2.3.24-incubating/freemarker-2.3.24-incubating.jar.asc
499/499 B      
[WARNING] Could not validate integrity of download from https://wrensecurity.jfrog.io/wrensecurity/releases/org/freemarker/freemarker/2.3.24-incubating/freemarker-2.3.24-incubating.jar.asc: Checksum validation failed, no checksums available
[WARNING] Checksum validation failed, no checksums available for https://wrensecurity.jfrog.io/wrensecurity/releases/org/freemarker/freemarker/2.3.24-incubating/freemarker-2.3.24-incubating.jar.asc
            
Downloaded: https://wrensecurity.jfrog.io/wrensecurity/releases/org/freemarker/freemarker/2.3.24-incubating/freemarker-2.3.24-incubating.jar.asc (499 B at 2.9 KB/sec)
Downloading: https://wrensecurity.jfrog.io/wrensecurity/releases/org/twdata/maven/mojo-executor/2.2.0/mojo-executor-2.2.0.jar.asc
487/487 B   
[WARNING] Could not validate integrity of download from https://wrensecurity.jfrog.io/wrensecurity/releases/org/twdata/maven/mojo-executor/2.2.0/mojo-executor-2.2.0.jar.asc: Checksum validation failed, no checksums available
[WARNING] Checksum validation failed, no checksums available for https://wrensecurity.jfrog.io/wrensecurity/releases/org/twdata/maven/mojo-executor/2.2.0/mojo-executor-2.2.0.jar.asc
            
Downloaded: https://wrensecurity.jfrog.io/wrensecurity/releases/org/twdata/maven/mojo-executor/2.2.0/mojo-executor-2.2.0.jar.asc (487 B at 1.9 KB/sec)
Downloading: https://wrensecurity.jfrog.io/wrensecurity/releases/org/apache/maven/maven-core/3.0/maven-core-3.0.jar.asc
202/202 B   
[WARNING] Could not validate integrity of download from https://wrensecurity.jfrog.io/wrensecurity/releases/org/apache/maven/maven-core/3.0/maven-core-3.0.jar.asc: Checksum validation failed, no checksums available
[WARNING] Checksum validation failed, no checksums available for https://wrensecurity.jfrog.io/wrensecurity/releases/org/apache/maven/maven-core/3.0/maven-core-3.0.jar.asc
            
Downloaded: https://wrensecurity.jfrog.io/wrensecurity/releases/org/apache/maven/maven-core/3.0/maven-core-3.0.jar.asc (202 B at 0.3 KB/sec)
Downloading: https://wrensecurity.jfrog.io/wrensecurity/releases/org/apache/maven/maven-model/3.0/maven-model-3.0.jar.asc
202/202 B   
[WARNING] Could not validate integrity of download from https://wrensecurity.jfrog.io/wrensecurity/releases/org/apache/maven/maven-model/3.0/maven-model-3.0.jar.asc: Checksum validation failed, no checksums available
[WARNING] Checksum validation failed, no checksums available for https://wrensecurity.jfrog.io/wrensecurity/releases/org/apache/maven/maven-model/3.0/maven-model-3.0.jar.asc
            
Downloaded: https://wrensecurity.jfrog.io/wrensecurity/releases/org/apache/maven/maven-model/3.0/maven-model-3.0.jar.asc (202 B at 0.8 KB/sec)
Downloading: https://wrensecurity.jfrog.io/wrensecurity/releases/org/codehaus/plexus/plexus-utils/1.5.1/plexus-utils-1.5.1.jar.asc
473/473 B   
[WARNING] Could not validate integrity of download from https://wrensecurity.jfrog.io/wrensecurity/releases/org/codehaus/plexus/plexus-utils/1.5.1/plexus-utils-1.5.1.jar.asc: Checksum validation failed, no checksums available
[WARNING] Checksum validation failed, no checksums available for https://wrensecurity.jfrog.io/wrensecurity/releases/org/codehaus/plexus/plexus-utils/1.5.1/plexus-utils-1.5.1.jar.asc
            
Downloaded: https://wrensecurity.jfrog.io/wrensecurity/releases/org/codehaus/plexus/plexus-utils/1.5.1/plexus-utils-1.5.1.jar.asc (473 B at 2.3 KB/sec)
Downloading: https://wrensecurity.jfrog.io/wrensecurity/releases/org/apache/maven/maven-settings/3.0/maven-settings-3.0.jar.asc
202/202 B   
[WARNING] Could not validate integrity of download from https://wrensecurity.jfrog.io/wrensecurity/releases/org/apache/maven/maven-settings/3.0/maven-settings-3.0.jar.asc: Checksum validation failed, no checksums available
[WARNING] Checksum validation failed, no checksums available for https://wrensecurity.jfrog.io/wrensecurity/releases/org/apache/maven/maven-settings/3.0/maven-settings-3.0.jar.asc
            
Downloaded: https://wrensecurity.jfrog.io/wrensecurity/releases/org/apache/maven/maven-settings/3.0/maven-settings-3.0.jar.asc (202 B at 1.0 KB/sec)
Downloading: https://wrensecurity.jfrog.io/wrensecurity/releases/org/apache/maven/maven-settings-builder/3.0/maven-settings-builder-3.0.jar.asc
202/202 B   
[WARNING] Could not validate integrity of download from https://wrensecurity.jfrog.io/wrensecurity/releases/org/apache/maven/maven-settings-builder/3.0/maven-settings-builder-3.0.jar.asc: Checksum validation failed, no checksums available
[WARNING] Checksum validation failed, no checksums available for https://wrensecurity.jfrog.io/wrensecurity/releases/org/apache/maven/maven-settings-builder/3.0/maven-settings-builder-3.0.jar.asc
            
Downloaded: https://wrensecurity.jfrog.io/wrensecurity/releases/org/apache/maven/maven-settings-builder/3.0/maven-settings-builder-3.0.jar.asc (202 B at 0.9 KB/sec)
Downloading: https://wrensecurity.jfrog.io/wrensecurity/releases/org/codehaus/plexus/plexus-interpolation/1.14/plexus-interpolation-1.14.jar.asc
202/202 B   
[WARNING] Could not validate integrity of download from https://wrensecurity.jfrog.io/wrensecurity/releases/org/codehaus/plexus/plexus-interpolation/1.14/plexus-interpolation-1.14.jar.asc: Checksum validation failed, no checksums available
[WARNING] Checksum validation failed, no checksums available for https://wrensecurity.jfrog.io/wrensecurity/releases/org/codehaus/plexus/plexus-interpolation/1.14/plexus-interpolation-1.14.jar.asc
            
Downloaded: https://wrensecurity.jfrog.io/wrensecurity/releases/org/codehaus/plexus/plexus-interpolation/1.14/plexus-interpolation-1.14.jar.asc (202 B at 1.3 KB/sec)
Downloading: https://wrensecurity.jfrog.io/wrensecurity/releases/org/codehaus/plexus/plexus-component-annotations/1.5.5/plexus-component-annotations-1.5.5.jar.asc
202/202 B   
[WARNING] Could not validate integrity of download from https://wrensecurity.jfrog.io/wrensecurity/releases/org/codehaus/plexus/plexus-component-annotations/1.5.5/plexus-component-annotations-1.5.5.jar.asc: Checksum validation failed, no checksums available
[WARNING] Checksum validation failed, no checksums available for https://wrensecurity.jfrog.io/wrensecurity/releases/org/codehaus/plexus/plexus-component-annotations/1.5.5/plexus-component-annotations-1.5.5.jar.asc
            
Downloaded: https://wrensecurity.jfrog.io/wrensecurity/releases/org/codehaus/plexus/plexus-component-annotations/1.5.5/plexus-component-annotations-1.5.5.jar.asc (202 B at 1.8 KB/sec)
Downloading: https://wrensecurity.jfrog.io/wrensecurity/releases/org/sonatype/plexus/plexus-sec-dispatcher/1.3/plexus-sec-dispatcher-1.3.jar.asc
186/186 B   
[WARNING] Could not validate integrity of download from https://wrensecurity.jfrog.io/wrensecurity/releases/org/sonatype/plexus/plexus-sec-dispatcher/1.3/plexus-sec-dispatcher-1.3.jar.asc: Checksum validation failed, no checksums available
[WARNING] Checksum validation failed, no checksums available for https://wrensecurity.jfrog.io/wrensecurity/releases/org/sonatype/plexus/plexus-sec-dispatcher/1.3/plexus-sec-dispatcher-1.3.jar.asc
            
Downloaded: https://wrensecurity.jfrog.io/wrensecurity/releases/org/sonatype/plexus/plexus-sec-dispatcher/1.3/plexus-sec-dispatcher-1.3.jar.asc (186 B at 1.4 KB/sec)
Downloading: https://wrensecurity.jfrog.io/wrensecurity/releases/org/sonatype/plexus/plexus-cipher/1.4/plexus-cipher-1.4.jar.asc
186/186 B   
[WARNING] Could not validate integrity of download from https://wrensecurity.jfrog.io/wrensecurity/releases/org/sonatype/plexus/plexus-cipher/1.4/plexus-cipher-1.4.jar.asc: Checksum validation failed, no checksums available
[WARNING] Checksum validation failed, no checksums available for https://wrensecurity.jfrog.io/wrensecurity/releases/org/sonatype/plexus/plexus-cipher/1.4/plexus-cipher-1.4.jar.asc
            
Downloaded: https://wrensecurity.jfrog.io/wrensecurity/releases/org/sonatype/plexus/plexus-cipher/1.4/plexus-cipher-1.4.jar.asc (186 B at 0.7 KB/sec)
Downloading: https://wrensecurity.jfrog.io/wrensecurity/releases/org/apache/maven/maven-repository-metadata/3.0/maven-repository-metadata-3.0.jar.asc
202/202 B   
[WARNING] Could not validate integrity of download from https://wrensecurity.jfrog.io/wrensecurity/releases/org/apache/maven/maven-repository-metadata/3.0/maven-repository-metadata-3.0.jar.asc: Checksum validation failed, no checksums available
[WARNING] Checksum validation failed, no checksums available for https://wrensecurity.jfrog.io/wrensecurity/releases/org/apache/maven/maven-repository-metadata/3.0/maven-repository-metadata-3.0.jar.asc
            
Downloaded: https://wrensecurity.jfrog.io/wrensecurity/releases/org/apache/maven/maven-repository-metadata/3.0/maven-repository-metadata-3.0.jar.asc (202 B at 0.5 KB/sec)
Downloading: https://wrensecurity.jfrog.io/wrensecurity/releases/org/apache/maven/maven-artifact/3.0/maven-artifact-3.0.jar.asc
202/202 B   
[WARNING] Could not validate integrity of download from https://wrensecurity.jfrog.io/wrensecurity/releases/org/apache/maven/maven-artifact/3.0/maven-artifact-3.0.jar.asc: Checksum validation failed, no checksums available
[WARNING] Checksum validation failed, no checksums available for https://wrensecurity.jfrog.io/wrensecurity/releases/org/apache/maven/maven-artifact/3.0/maven-artifact-3.0.jar.asc
            
Downloaded: https://wrensecurity.jfrog.io/wrensecurity/releases/org/apache/maven/maven-artifact/3.0/maven-artifact-3.0.jar.asc (202 B at 1.4 KB/sec)
Downloading: https://wrensecurity.jfrog.io/wrensecurity/releases/org/apache/maven/maven-plugin-api/3.0/maven-plugin-api-3.0.jar.asc
202/202 B   
[WARNING] Could not validate integrity of download from https://wrensecurity.jfrog.io/wrensecurity/releases/org/apache/maven/maven-plugin-api/3.0/maven-plugin-api-3.0.jar.asc: Checksum validation failed, no checksums available
[WARNING] Checksum validation failed, no checksums available for https://wrensecurity.jfrog.io/wrensecurity/releases/org/apache/maven/maven-plugin-api/3.0/maven-plugin-api-3.0.jar.asc
            
Downloaded: https://wrensecurity.jfrog.io/wrensecurity/releases/org/apache/maven/maven-plugin-api/3.0/maven-plugin-api-3.0.jar.asc (202 B at 1.8 KB/sec)
Downloading: https://wrensecurity.jfrog.io/wrensecurity/releases/org/sonatype/sisu/sisu-inject-plexus/1.4.2/sisu-inject-plexus-1.4.2.jar.asc
194/194 B   
[WARNING] Could not validate integrity of download from https://wrensecurity.jfrog.io/wrensecurity/releases/org/sonatype/sisu/sisu-inject-plexus/1.4.2/sisu-inject-plexus-1.4.2.jar.asc: Checksum validation failed, no checksums available
[WARNING] Checksum validation failed, no checksums available for https://wrensecurity.jfrog.io/wrensecurity/releases/org/sonatype/sisu/sisu-inject-plexus/1.4.2/sisu-inject-plexus-1.4.2.jar.asc
            
Downloaded: https://wrensecurity.jfrog.io/wrensecurity/releases/org/sonatype/sisu/sisu-inject-plexus/1.4.2/sisu-inject-plexus-1.4.2.jar.asc (194 B at 0.9 KB/sec)
Downloading: https://wrensecurity.jfrog.io/wrensecurity/releases/org/codehaus/plexus/plexus-classworlds/2.2.3/plexus-classworlds-2.2.3.jar.asc
202/202 B   
[WARNING] Could not validate integrity of download from https://wrensecurity.jfrog.io/wrensecurity/releases/org/codehaus/plexus/plexus-classworlds/2.2.3/plexus-classworlds-2.2.3.jar.asc: Checksum validation failed, no checksums available
[WARNING] Checksum validation failed, no checksums available for https://wrensecurity.jfrog.io/wrensecurity/releases/org/codehaus/plexus/plexus-classworlds/2.2.3/plexus-classworlds-2.2.3.jar.asc
            
Downloaded: https://wrensecurity.jfrog.io/wrensecurity/releases/org/codehaus/plexus/plexus-classworlds/2.2.3/plexus-classworlds-2.2.3.jar.asc (202 B at 1.1 KB/sec)
Downloading: https://wrensecurity.jfrog.io/wrensecurity/releases/org/sonatype/sisu/sisu-inject-bean/1.4.2/sisu-inject-bean-1.4.2.jar.asc
194/194 B   
[WARNING] Could not validate integrity of download from https://wrensecurity.jfrog.io/wrensecurity/releases/org/sonatype/sisu/sisu-inject-bean/1.4.2/sisu-inject-bean-1.4.2.jar.asc: Checksum validation failed, no checksums available
[WARNING] Checksum validation failed, no checksums available for https://wrensecurity.jfrog.io/wrensecurity/releases/org/sonatype/sisu/sisu-inject-bean/1.4.2/sisu-inject-bean-1.4.2.jar.asc
            
Downloaded: https://wrensecurity.jfrog.io/wrensecurity/releases/org/sonatype/sisu/sisu-inject-bean/1.4.2/sisu-inject-bean-1.4.2.jar.asc (194 B at 1.2 KB/sec)
Downloading: https://wrensecurity.jfrog.io/wrensecurity/releases/org/sonatype/sisu/sisu-guice/2.1.7/sisu-guice-2.1.7-noaop.jar.asc
194/194 B   
[WARNING] Could not validate integrity of download from https://wrensecurity.jfrog.io/wrensecurity/releases/org/sonatype/sisu/sisu-guice/2.1.7/sisu-guice-2.1.7-noaop.jar.asc: Checksum validation failed, no checksums available
[WARNING] Checksum validation failed, no checksums available for https://wrensecurity.jfrog.io/wrensecurity/releases/org/sonatype/sisu/sisu-guice/2.1.7/sisu-guice-2.1.7-noaop.jar.asc
            
Downloaded: https://wrensecurity.jfrog.io/wrensecurity/releases/org/sonatype/sisu/sisu-guice/2.1.7/sisu-guice-2.1.7-noaop.jar.asc (194 B at 1.6 KB/sec)
Downloading: https://wrensecurity.jfrog.io/wrensecurity/releases/org/apache/maven/maven-model-builder/3.0/maven-model-builder-3.0.jar.asc
202/202 B   
[WARNING] Could not validate integrity of download from https://wrensecurity.jfrog.io/wrensecurity/releases/org/apache/maven/maven-model-builder/3.0/maven-model-builder-3.0.jar.asc: Checksum validation failed, no checksums available
[WARNING] Checksum validation failed, no checksums available for https://wrensecurity.jfrog.io/wrensecurity/releases/org/apache/maven/maven-model-builder/3.0/maven-model-builder-3.0.jar.asc
            
Downloaded: https://wrensecurity.jfrog.io/wrensecurity/releases/org/apache/maven/maven-model-builder/3.0/maven-model-builder-3.0.jar.asc (202 B at 1.0 KB/sec)
Downloading: https://wrensecurity.jfrog.io/wrensecurity/releases/org/apache/maven/maven-aether-provider/3.0/maven-aether-provider-3.0.jar.asc
202/202 B   
[WARNING] Could not validate integrity of download from https://wrensecurity.jfrog.io/wrensecurity/releases/org/apache/maven/maven-aether-provider/3.0/maven-aether-provider-3.0.jar.asc: Checksum validation failed, no checksums available
[WARNING] Checksum validation failed, no checksums available for https://wrensecurity.jfrog.io/wrensecurity/releases/org/apache/maven/maven-aether-provider/3.0/maven-aether-provider-3.0.jar.asc
            
Downloaded: https://wrensecurity.jfrog.io/wrensecurity/releases/org/apache/maven/maven-aether-provider/3.0/maven-aether-provider-3.0.jar.asc (202 B at 1.4 KB/sec)
Downloading: https://wrensecurity.jfrog.io/wrensecurity/releases/org/sonatype/aether/aether-api/1.7/aether-api-1.7.jar.asc
194/194 B   
[WARNING] Could not validate integrity of download from https://wrensecurity.jfrog.io/wrensecurity/releases/org/sonatype/aether/aether-api/1.7/aether-api-1.7.jar.asc: Checksum validation failed, no checksums available
[WARNING] Checksum validation failed, no checksums available for https://wrensecurity.jfrog.io/wrensecurity/releases/org/sonatype/aether/aether-api/1.7/aether-api-1.7.jar.asc
            
Downloaded: https://wrensecurity.jfrog.io/wrensecurity/releases/org/sonatype/aether/aether-api/1.7/aether-api-1.7.jar.asc (194 B at 0.8 KB/sec)
Downloading: https://wrensecurity.jfrog.io/wrensecurity/releases/org/sonatype/aether/aether-util/1.7/aether-util-1.7.jar.asc
194/194 B   
[WARNING] Could not validate integrity of download from https://wrensecurity.jfrog.io/wrensecurity/releases/org/sonatype/aether/aether-util/1.7/aether-util-1.7.jar.asc: Checksum validation failed, no checksums available
[WARNING] Checksum validation failed, no checksums available for https://wrensecurity.jfrog.io/wrensecurity/releases/org/sonatype/aether/aether-util/1.7/aether-util-1.7.jar.asc
            
Downloaded: https://wrensecurity.jfrog.io/wrensecurity/releases/org/sonatype/aether/aether-util/1.7/aether-util-1.7.jar.asc (194 B at 1.1 KB/sec)
Downloading: https://wrensecurity.jfrog.io/wrensecurity/releases/org/sonatype/aether/aether-impl/1.7/aether-impl-1.7.jar.asc
194/194 B   
[WARNING] Could not validate integrity of download from https://wrensecurity.jfrog.io/wrensecurity/releases/org/sonatype/aether/aether-impl/1.7/aether-impl-1.7.jar.asc: Checksum validation failed, no checksums available
[WARNING] Checksum validation failed, no checksums available for https://wrensecurity.jfrog.io/wrensecurity/releases/org/sonatype/aether/aether-impl/1.7/aether-impl-1.7.jar.asc
            
Downloaded: https://wrensecurity.jfrog.io/wrensecurity/releases/org/sonatype/aether/aether-impl/1.7/aether-impl-1.7.jar.asc (194 B at 1.7 KB/sec)
Downloading: https://wrensecurity.jfrog.io/wrensecurity/releases/org/sonatype/aether/aether-spi/1.7/aether-spi-1.7.jar.asc
194/194 B   
[WARNING] Could not validate integrity of download from https://wrensecurity.jfrog.io/wrensecurity/releases/org/sonatype/aether/aether-spi/1.7/aether-spi-1.7.jar.asc: Checksum validation failed, no checksums available
[WARNING] Checksum validation failed, no checksums available for https://wrensecurity.jfrog.io/wrensecurity/releases/org/sonatype/aether/aether-spi/1.7/aether-spi-1.7.jar.asc
            
Downloaded: https://wrensecurity.jfrog.io/wrensecurity/releases/org/sonatype/aether/aether-spi/1.7/aether-spi-1.7.jar.asc (194 B at 0.8 KB/sec)
Downloading: https://wrensecurity.jfrog.io/wrensecurity/releases/com/thoughtworks/qdox/qdox/2.0-M3/qdox-2.0-M3.jar.asc
235/235 B   
[WARNING] Could not validate integrity of download from https://wrensecurity.jfrog.io/wrensecurity/releases/com/thoughtworks/qdox/qdox/2.0-M3/qdox-2.0-M3.jar.asc: Checksum validation failed, no checksums available
[WARNING] Checksum validation failed, no checksums available for https://wrensecurity.jfrog.io/wrensecurity/releases/com/thoughtworks/qdox/qdox/2.0-M3/qdox-2.0-M3.jar.asc
            
Downloaded: https://wrensecurity.jfrog.io/wrensecurity/releases/com/thoughtworks/qdox/qdox/2.0-M3/qdox-2.0-M3.jar.asc (235 B at 1.7 KB/sec)
Downloading: https://wrensecurity.jfrog.io/wrensecurity/releases/org/apache/maven/maven-settings/3.0/maven-settings-3.0.pom.asc
202/202 B   
[WARNING] Could not validate integrity of download from https://wrensecurity.jfrog.io/wrensecurity/releases/org/apache/maven/maven-settings/3.0/maven-settings-3.0.pom.asc: Checksum validation failed, no checksums available
[WARNING] Checksum validation failed, no checksums available for https://wrensecurity.jfrog.io/wrensecurity/releases/org/apache/maven/maven-settings/3.0/maven-settings-3.0.pom.asc
            
Downloaded: https://wrensecurity.jfrog.io/wrensecurity/releases/org/apache/maven/maven-settings/3.0/maven-settings-3.0.pom.asc (202 B at 1.6 KB/sec)
Downloading: https://wrensecurity.jfrog.io/wrensecurity/releases/org/codehaus/plexus/plexus-interpolation/1.14/plexus-interpolation-1.14.pom.asc
202/202 B   
[WARNING] Could not validate integrity of download from https://wrensecurity.jfrog.io/wrensecurity/releases/org/codehaus/plexus/plexus-interpolation/1.14/plexus-interpolation-1.14.pom.asc: Checksum validation failed, no checksums available
[WARNING] Checksum validation failed, no checksums available for https://wrensecurity.jfrog.io/wrensecurity/releases/org/codehaus/plexus/plexus-interpolation/1.14/plexus-interpolation-1.14.pom.asc
            
Downloaded: https://wrensecurity.jfrog.io/wrensecurity/releases/org/codehaus/plexus/plexus-interpolation/1.14/plexus-interpolation-1.14.pom.asc (202 B at 1.3 KB/sec)
Downloading: https://wrensecurity.jfrog.io/wrensecurity/releases/org/sonatype/aether/aether-util/1.7/aether-util-1.7.pom.asc
194/194 B   
[WARNING] Could not validate integrity of download from https://wrensecurity.jfrog.io/wrensecurity/releases/org/sonatype/aether/aether-util/1.7/aether-util-1.7.pom.asc: Checksum validation failed, no checksums available
[WARNING] Checksum validation failed, no checksums available for https://wrensecurity.jfrog.io/wrensecurity/releases/org/sonatype/aether/aether-util/1.7/aether-util-1.7.pom.asc
            
Downloaded: https://wrensecurity.jfrog.io/wrensecurity/releases/org/sonatype/aether/aether-util/1.7/aether-util-1.7.pom.asc (194 B at 1.5 KB/sec)
Downloading: https://wrensecurity.jfrog.io/wrensecurity/releases/org/apache/maven/maven-settings-builder/3.0/maven-settings-builder-3.0.pom.asc
202/202 B   
[WARNING] Could not validate integrity of download from https://wrensecurity.jfrog.io/wrensecurity/releases/org/apache/maven/maven-settings-builder/3.0/maven-settings-builder-3.0.pom.asc: Checksum validation failed, no checksums available
[WARNING] Checksum validation failed, no checksums available for https://wrensecurity.jfrog.io/wrensecurity/releases/org/apache/maven/maven-settings-builder/3.0/maven-settings-builder-3.0.pom.asc
            
Downloaded: https://wrensecurity.jfrog.io/wrensecurity/releases/org/apache/maven/maven-settings-builder/3.0/maven-settings-builder-3.0.pom.asc (202 B at 1.2 KB/sec)
Downloading: https://wrensecurity.jfrog.io/wrensecurity/releases/org/sonatype/plexus/plexus-cipher/1.4/plexus-cipher-1.4.pom.asc
186/186 B   
[WARNING] Could not validate integrity of download from https://wrensecurity.jfrog.io/wrensecurity/releases/org/sonatype/plexus/plexus-cipher/1.4/plexus-cipher-1.4.pom.asc: Checksum validation failed, no checksums available
[WARNING] Checksum validation failed, no checksums available for https://wrensecurity.jfrog.io/wrensecurity/releases/org/sonatype/plexus/plexus-cipher/1.4/plexus-cipher-1.4.pom.asc
            
Downloaded: https://wrensecurity.jfrog.io/wrensecurity/releases/org/sonatype/plexus/plexus-cipher/1.4/plexus-cipher-1.4.pom.asc (186 B at 1.4 KB/sec)
Downloading: https://wrensecurity.jfrog.io/wrensecurity/releases/org/sonatype/sisu/sisu-inject-plexus/1.4.2/sisu-inject-plexus-1.4.2.pom.asc
194/194 B   
[WARNING] Could not validate integrity of download from https://wrensecurity.jfrog.io/wrensecurity/releases/org/sonatype/sisu/sisu-inject-plexus/1.4.2/sisu-inject-plexus-1.4.2.pom.asc: Checksum validation failed, no checksums available
[WARNING] Checksum validation failed, no checksums available for https://wrensecurity.jfrog.io/wrensecurity/releases/org/sonatype/sisu/sisu-inject-plexus/1.4.2/sisu-inject-plexus-1.4.2.pom.asc
            
Downloaded: https://wrensecurity.jfrog.io/wrensecurity/releases/org/sonatype/sisu/sisu-inject-plexus/1.4.2/sisu-inject-plexus-1.4.2.pom.asc (194 B at 1.3 KB/sec)
Downloading: https://wrensecurity.jfrog.io/wrensecurity/releases/org/apache/maven/maven-artifact/3.0/maven-artifact-3.0.pom.asc
202/202 B   
[WARNING] Could not validate integrity of download from https://wrensecurity.jfrog.io/wrensecurity/releases/org/apache/maven/maven-artifact/3.0/maven-artifact-3.0.pom.asc: Checksum validation failed, no checksums available
[WARNING] Checksum validation failed, no checksums available for https://wrensecurity.jfrog.io/wrensecurity/releases/org/apache/maven/maven-artifact/3.0/maven-artifact-3.0.pom.asc
            
Downloaded: https://wrensecurity.jfrog.io/wrensecurity/releases/org/apache/maven/maven-artifact/3.0/maven-artifact-3.0.pom.asc (202 B at 1.2 KB/sec)
Downloading: https://wrensecurity.jfrog.io/wrensecurity/releases/org/freemarker/freemarker/2.3.24-incubating/freemarker-2.3.24-incubating.pom.asc
499/499 B   
[WARNING] Could not validate integrity of download from https://wrensecurity.jfrog.io/wrensecurity/releases/org/freemarker/freemarker/2.3.24-incubating/freemarker-2.3.24-incubating.pom.asc: Checksum validation failed, no checksums available
[WARNING] Checksum validation failed, no checksums available for https://wrensecurity.jfrog.io/wrensecurity/releases/org/freemarker/freemarker/2.3.24-incubating/freemarker-2.3.24-incubating.pom.asc
            
Downloaded: https://wrensecurity.jfrog.io/wrensecurity/releases/org/freemarker/freemarker/2.3.24-incubating/freemarker-2.3.24-incubating.pom.asc (499 B at 2.6 KB/sec)
Downloading: https://wrensecurity.jfrog.io/wrensecurity/releases/org/sonatype/sisu/sisu-inject-bean/1.4.2/sisu-inject-bean-1.4.2.pom.asc
194/194 B   
[WARNING] Could not validate integrity of download from https://wrensecurity.jfrog.io/wrensecurity/releases/org/sonatype/sisu/sisu-inject-bean/1.4.2/sisu-inject-bean-1.4.2.pom.asc: Checksum validation failed, no checksums available
[WARNING] Checksum validation failed, no checksums available for https://wrensecurity.jfrog.io/wrensecurity/releases/org/sonatype/sisu/sisu-inject-bean/1.4.2/sisu-inject-bean-1.4.2.pom.asc
            
Downloaded: https://wrensecurity.jfrog.io/wrensecurity/releases/org/sonatype/sisu/sisu-inject-bean/1.4.2/sisu-inject-bean-1.4.2.pom.asc (194 B at 1.5 KB/sec)
Downloading: https://wrensecurity.jfrog.io/wrensecurity/releases/org/sonatype/aether/aether-api/1.7/aether-api-1.7.pom.asc
194/194 B   
[WARNING] Could not validate integrity of download from https://wrensecurity.jfrog.io/wrensecurity/releases/org/sonatype/aether/aether-api/1.7/aether-api-1.7.pom.asc: Checksum validation failed, no checksums available
[WARNING] Checksum validation failed, no checksums available for https://wrensecurity.jfrog.io/wrensecurity/releases/org/sonatype/aether/aether-api/1.7/aether-api-1.7.pom.asc
            
Downloaded: https://wrensecurity.jfrog.io/wrensecurity/releases/org/sonatype/aether/aether-api/1.7/aether-api-1.7.pom.asc (194 B at 1.1 KB/sec)
Downloading: https://wrensecurity.jfrog.io/wrensecurity/releases/org/apache/maven/maven-core/3.0/maven-core-3.0.pom.asc
202/202 B   
[WARNING] Could not validate integrity of download from https://wrensecurity.jfrog.io/wrensecurity/releases/org/apache/maven/maven-core/3.0/maven-core-3.0.pom.asc: Checksum validation failed, no checksums available
[WARNING] Checksum validation failed, no checksums available for https://wrensecurity.jfrog.io/wrensecurity/releases/org/apache/maven/maven-core/3.0/maven-core-3.0.pom.asc
            
Downloaded: https://wrensecurity.jfrog.io/wrensecurity/releases/org/apache/maven/maven-core/3.0/maven-core-3.0.pom.asc (202 B at 1.6 KB/sec)
Downloading: https://wrensecurity.jfrog.io/wrensecurity/releases/org/apache/maven/maven-plugin-api/3.0/maven-plugin-api-3.0.pom.asc
202/202 B   
[WARNING] Could not validate integrity of download from https://wrensecurity.jfrog.io/wrensecurity/releases/org/apache/maven/maven-plugin-api/3.0/maven-plugin-api-3.0.pom.asc: Checksum validation failed, no checksums available
[WARNING] Checksum validation failed, no checksums available for https://wrensecurity.jfrog.io/wrensecurity/releases/org/apache/maven/maven-plugin-api/3.0/maven-plugin-api-3.0.pom.asc
            
Downloaded: https://wrensecurity.jfrog.io/wrensecurity/releases/org/apache/maven/maven-plugin-api/3.0/maven-plugin-api-3.0.pom.asc (202 B at 0.9 KB/sec)
Downloading: https://wrensecurity.jfrog.io/wrensecurity/releases/org/twdata/maven/mojo-executor/2.2.0/mojo-executor-2.2.0.pom.asc
487/487 B   
[WARNING] Could not validate integrity of download from https://wrensecurity.jfrog.io/wrensecurity/releases/org/twdata/maven/mojo-executor/2.2.0/mojo-executor-2.2.0.pom.asc: Checksum validation failed, no checksums available
[WARNING] Checksum validation failed, no checksums available for https://wrensecurity.jfrog.io/wrensecurity/releases/org/twdata/maven/mojo-executor/2.2.0/mojo-executor-2.2.0.pom.asc
            
Downloaded: https://wrensecurity.jfrog.io/wrensecurity/releases/org/twdata/maven/mojo-executor/2.2.0/mojo-executor-2.2.0.pom.asc (487 B at 3.7 KB/sec)
Downloading: https://wrensecurity.jfrog.io/wrensecurity/releases/org/apache/maven/maven-aether-provider/3.0/maven-aether-provider-3.0.pom.asc
202/202 B   
[WARNING] Could not validate integrity of download from https://wrensecurity.jfrog.io/wrensecurity/releases/org/apache/maven/maven-aether-provider/3.0/maven-aether-provider-3.0.pom.asc: Checksum validation failed, no checksums available
[WARNING] Checksum validation failed, no checksums available for https://wrensecurity.jfrog.io/wrensecurity/releases/org/apache/maven/maven-aether-provider/3.0/maven-aether-provider-3.0.pom.asc
            
Downloaded: https://wrensecurity.jfrog.io/wrensecurity/releases/org/apache/maven/maven-aether-provider/3.0/maven-aether-provider-3.0.pom.asc (202 B at 1.5 KB/sec)
Downloading: https://wrensecurity.jfrog.io/wrensecurity/releases/org/apache/maven/maven-model-builder/3.0/maven-model-builder-3.0.pom.asc
202/202 B   
[WARNING] Could not validate integrity of download from https://wrensecurity.jfrog.io/wrensecurity/releases/org/apache/maven/maven-model-builder/3.0/maven-model-builder-3.0.pom.asc: Checksum validation failed, no checksums available
[WARNING] Checksum validation failed, no checksums available for https://wrensecurity.jfrog.io/wrensecurity/releases/org/apache/maven/maven-model-builder/3.0/maven-model-builder-3.0.pom.asc
            
Downloaded: https://wrensecurity.jfrog.io/wrensecurity/releases/org/apache/maven/maven-model-builder/3.0/maven-model-builder-3.0.pom.asc (202 B at 1.3 KB/sec)
Downloading: https://wrensecurity.jfrog.io/wrensecurity/releases/org/codehaus/plexus/plexus-utils/1.5.1/plexus-utils-1.5.1.pom.asc
473/473 B   
[WARNING] Could not validate integrity of download from https://wrensecurity.jfrog.io/wrensecurity/releases/org/codehaus/plexus/plexus-utils/1.5.1/plexus-utils-1.5.1.pom.asc: Checksum validation failed, no checksums available
[WARNING] Checksum validation failed, no checksums available for https://wrensecurity.jfrog.io/wrensecurity/releases/org/codehaus/plexus/plexus-utils/1.5.1/plexus-utils-1.5.1.pom.asc
            
Downloaded: https://wrensecurity.jfrog.io/wrensecurity/releases/org/codehaus/plexus/plexus-utils/1.5.1/plexus-utils-1.5.1.pom.asc (473 B at 2.1 KB/sec)
Downloading: https://wrensecurity.jfrog.io/wrensecurity/releases/org/sonatype/sisu/sisu-guice/2.1.7/sisu-guice-2.1.7.pom.asc
194/194 B   
[WARNING] Could not validate integrity of download from https://wrensecurity.jfrog.io/wrensecurity/releases/org/sonatype/sisu/sisu-guice/2.1.7/sisu-guice-2.1.7.pom.asc: Checksum validation failed, no checksums available
[WARNING] Checksum validation failed, no checksums available for https://wrensecurity.jfrog.io/wrensecurity/releases/org/sonatype/sisu/sisu-guice/2.1.7/sisu-guice-2.1.7.pom.asc
            
Downloaded: https://wrensecurity.jfrog.io/wrensecurity/releases/org/sonatype/sisu/sisu-guice/2.1.7/sisu-guice-2.1.7.pom.asc (194 B at 1.1 KB/sec)
Downloading: https://wrensecurity.jfrog.io/wrensecurity/releases/org/codehaus/plexus/plexus-classworlds/2.2.3/plexus-classworlds-2.2.3.pom.asc
202/202 B   
[WARNING] Could not validate integrity of download from https://wrensecurity.jfrog.io/wrensecurity/releases/org/codehaus/plexus/plexus-classworlds/2.2.3/plexus-classworlds-2.2.3.pom.asc: Checksum validation failed, no checksums available
[WARNING] Checksum validation failed, no checksums available for https://wrensecurity.jfrog.io/wrensecurity/releases/org/codehaus/plexus/plexus-classworlds/2.2.3/plexus-classworlds-2.2.3.pom.asc
            
Downloaded: https://wrensecurity.jfrog.io/wrensecurity/releases/org/codehaus/plexus/plexus-classworlds/2.2.3/plexus-classworlds-2.2.3.pom.asc (202 B at 1.1 KB/sec)
Downloading: https://wrensecurity.jfrog.io/wrensecurity/releases/org/sonatype/aether/aether-spi/1.7/aether-spi-1.7.pom.asc
194/194 B   
[WARNING] Could not validate integrity of download from https://wrensecurity.jfrog.io/wrensecurity/releases/org/sonatype/aether/aether-spi/1.7/aether-spi-1.7.pom.asc: Checksum validation failed, no checksums available
[WARNING] Checksum validation failed, no checksums available for https://wrensecurity.jfrog.io/wrensecurity/releases/org/sonatype/aether/aether-spi/1.7/aether-spi-1.7.pom.asc
            
Downloaded: https://wrensecurity.jfrog.io/wrensecurity/releases/org/sonatype/aether/aether-spi/1.7/aether-spi-1.7.pom.asc (194 B at 1.5 KB/sec)
Downloading: https://wrensecurity.jfrog.io/wrensecurity/releases/org/codehaus/plexus/plexus-component-annotations/1.5.5/plexus-component-annotations-1.5.5.pom.asc
202/202 B   
[WARNING] Could not validate integrity of download from https://wrensecurity.jfrog.io/wrensecurity/releases/org/codehaus/plexus/plexus-component-annotations/1.5.5/plexus-component-annotations-1.5.5.pom.asc: Checksum validation failed, no checksums available
[WARNING] Checksum validation failed, no checksums available for https://wrensecurity.jfrog.io/wrensecurity/releases/org/codehaus/plexus/plexus-component-annotations/1.5.5/plexus-component-annotations-1.5.5.pom.asc
            
Downloaded: https://wrensecurity.jfrog.io/wrensecurity/releases/org/codehaus/plexus/plexus-component-annotations/1.5.5/plexus-component-annotations-1.5.5.pom.asc (202 B at 0.9 KB/sec)
Downloading: https://wrensecurity.jfrog.io/wrensecurity/releases/org/sonatype/plexus/plexus-sec-dispatcher/1.3/plexus-sec-dispatcher-1.3.pom.asc
186/186 B   
[WARNING] Could not validate integrity of download from https://wrensecurity.jfrog.io/wrensecurity/releases/org/sonatype/plexus/plexus-sec-dispatcher/1.3/plexus-sec-dispatcher-1.3.pom.asc: Checksum validation failed, no checksums available
[WARNING] Checksum validation failed, no checksums available for https://wrensecurity.jfrog.io/wrensecurity/releases/org/sonatype/plexus/plexus-sec-dispatcher/1.3/plexus-sec-dispatcher-1.3.pom.asc
            
Downloaded: https://wrensecurity.jfrog.io/wrensecurity/releases/org/sonatype/plexus/plexus-sec-dispatcher/1.3/plexus-sec-dispatcher-1.3.pom.asc (186 B at 1.1 KB/sec)
Downloading: https://wrensecurity.jfrog.io/wrensecurity/releases/org/sonatype/aether/aether-impl/1.7/aether-impl-1.7.pom.asc
194/194 B   
[WARNING] Could not validate integrity of download from https://wrensecurity.jfrog.io/wrensecurity/releases/org/sonatype/aether/aether-impl/1.7/aether-impl-1.7.pom.asc: Checksum validation failed, no checksums available
[WARNING] Checksum validation failed, no checksums available for https://wrensecurity.jfrog.io/wrensecurity/releases/org/sonatype/aether/aether-impl/1.7/aether-impl-1.7.pom.asc
            
Downloaded: https://wrensecurity.jfrog.io/wrensecurity/releases/org/sonatype/aether/aether-impl/1.7/aether-impl-1.7.pom.asc (194 B at 1.4 KB/sec)
Downloading: https://wrensecurity.jfrog.io/wrensecurity/releases/org/apache/maven/maven-repository-metadata/3.0/maven-repository-metadata-3.0.pom.asc
202/202 B   
[WARNING] Could not validate integrity of download from https://wrensecurity.jfrog.io/wrensecurity/releases/org/apache/maven/maven-repository-metadata/3.0/maven-repository-metadata-3.0.pom.asc: Checksum validation failed, no checksums available
[WARNING] Checksum validation failed, no checksums available for https://wrensecurity.jfrog.io/wrensecurity/releases/org/apache/maven/maven-repository-metadata/3.0/maven-repository-metadata-3.0.pom.asc
            
Downloaded: https://wrensecurity.jfrog.io/wrensecurity/releases/org/apache/maven/maven-repository-metadata/3.0/maven-repository-metadata-3.0.pom.asc (202 B at 1.2 KB/sec)
Downloading: https://wrensecurity.jfrog.io/wrensecurity/releases/com/thoughtworks/qdox/qdox/2.0-M3/qdox-2.0-M3.pom.asc
235/235 B   
[WARNING] Could not validate integrity of download from https://wrensecurity.jfrog.io/wrensecurity/releases/com/thoughtworks/qdox/qdox/2.0-M3/qdox-2.0-M3.pom.asc: Checksum validation failed, no checksums available
[WARNING] Checksum validation failed, no checksums available for https://wrensecurity.jfrog.io/wrensecurity/releases/com/thoughtworks/qdox/qdox/2.0-M3/qdox-2.0-M3.pom.asc
            
Downloaded: https://wrensecurity.jfrog.io/wrensecurity/releases/com/thoughtworks/qdox/qdox/2.0-M3/qdox-2.0-M3.pom.asc (235 B at 2.2 KB/sec)
Downloading: https://wrensecurity.jfrog.io/wrensecurity/releases/org/apache/maven/maven-model/3.0/maven-model-3.0.pom.asc
202/202 B   
[WARNING] Could not validate integrity of download from https://wrensecurity.jfrog.io/wrensecurity/releases/org/apache/maven/maven-model/3.0/maven-model-3.0.pom.asc: Checksum validation failed, no checksums available
[WARNING] Checksum validation failed, no checksums available for https://wrensecurity.jfrog.io/wrensecurity/releases/org/apache/maven/maven-model/3.0/maven-model-3.0.pom.asc
            
Downloaded: https://wrensecurity.jfrog.io/wrensecurity/releases/org/apache/maven/maven-model/3.0/maven-model-3.0.pom.asc (202 B at 1.2 KB/sec)
[WARNING] [Retry 1 of 10] Waiting 750 milliseconds before retrying key request from hkps.pool.sks-keyservers.net/51.38.91.189 after last request failed: HTTP/1.1 502 Bad Gateway
[WARNING] [Retry 2 of 10] Waiting 1500 milliseconds before retrying key request from hkps.pool.sks-keyservers.net/51.38.91.189 after last request failed: HTTP/1.1 502 Bad Gateway
[WARNING] [Retry 3 of 10] Waiting 2250 milliseconds before retrying key request from hkps.pool.sks-keyservers.net/51.38.91.189 after last request failed: HTTP/1.1 502 Bad Gateway
[WARNING] [Retry 4 of 10] Waiting 3000 milliseconds before retrying key request from hkps.pool.sks-keyservers.net/51.38.91.189 after last request failed: HTTP/1.1 502 Bad Gateway
[WARNING] [Retry 5 of 10] Waiting 3750 milliseconds before retrying key request from hkps.pool.sks-keyservers.net/51.38.91.189 after last request failed: HTTP/1.1 502 Bad Gateway
[WARNING] [Retry 6 of 10] Waiting 4500 milliseconds before retrying key request from hkps.pool.sks-keyservers.net/51.38.91.189 after last request failed: HTTP/1.1 502 Bad Gateway
[WARNING] [Retry 7 of 10] Waiting 5250 milliseconds before retrying key request from hkps.pool.sks-keyservers.net/51.38.91.189 after last request failed: HTTP/1.1 502 Bad Gateway
[WARNING] [Retry 8 of 10] Waiting 6000 milliseconds before retrying key request from hkps.pool.sks-keyservers.net/51.38.91.189 after last request failed: HTTP/1.1 502 Bad Gateway
[WARNING] [Retry 9 of 10] Waiting 6750 milliseconds before retrying key request from hkps.pool.sks-keyservers.net/51.38.91.189 after last request failed: HTTP/1.1 502 Bad Gateway
[WARNING] [Retry 10 of 10] Waiting 7500 milliseconds before retrying key request from hkps.pool.sks-keyservers.net/51.38.91.189 after last request failed: HTTP/1.1 502 Bad Gateway
[INFO] ------------------------------------------------------------------------
[INFO] Reactor Summary:
[INFO] 
[INFO] Wren:DS BOM ........................................ SUCCESS [  7.140 s]
[INFO] Wren:DS Directory Services Project ................. SUCCESS [  1.640 s]
[INFO] Wren:DS Core APIs .................................. SUCCESS [ 43.120 s]
[INFO] Wren:DS Doc Helper Maven Plugin .................... FAILURE [01:00 min]
[INFO] Wren:DS Grizzly Transport Provider ................. SKIPPED
[INFO] Wren:DS CLI API .................................... SKIPPED
[INFO] Wren:DS SDK Toolkit ................................ SKIPPED
[INFO] Wren:DS SDK Examples ............................... SKIPPED
[INFO] Wren:DS Commons REST Adapter ....................... SKIPPED
[INFO] Wren:DS Maven Plugin ............................... SKIPPED
[INFO] Wren:DS Configuration API .......................... SKIPPED
[INFO] Wren:DS Commons REST LDAP Gateway .................. SKIPPED
[INFO] Wren:DS Server NG .................................. SKIPPED
[INFO] Wren:DS Server ..................................... SKIPPED
[INFO] Wren:DS Server Example Plugin ...................... SKIPPED
[INFO] Wren:DS Legacy ..................................... SKIPPED
[INFO] Wren:DS DSML Gateway ............................... SKIPPED
[INFO] Wren:DS Embedded Server Examples ................... SKIPPED
[INFO] Wren:DS Account Change Notification Handler for IDM  SKIPPED
[INFO] Wren:DS Doc Generated References ................... SKIPPED
[INFO] ------------------------------------------------------------------------
[INFO] BUILD FAILURE
[INFO] ------------------------------------------------------------------------
[INFO] Total time: 01:54 min
[INFO] Finished at: 2019-01-22T13:28:19-05:00
[INFO] Final Memory: 82M/731M
[INFO] ------------------------------------------------------------------------
[ERROR] Failed to execute goal org.simplify4u.plugins:pgpverify-maven-plugin:1.3.0-wren3:check (default) on project opendj-doc-maven-plugin: PGP server returned an error: HTTP/1.1 502 Bad Gateway -> [Help 1]
[ERROR] 
[ERROR] To see the full stack trace of the errors, re-run Maven with the -e switch.
[ERROR] Re-run Maven using the -X switch to enable full debug logging.
[ERROR] 
[ERROR] For more information about the errors and possible solutions, please read the following articles:
[ERROR] [Help 1] http://cwiki.apache.org/confluence/display/MAVEN/MojoFailureException
[ERROR] 
[ERROR] After correcting the problems, you can resume the build with the command
[ERROR]   mvn <goals> -rf :opendj-doc-maven-plugin
Build step 'Invoke top-level Maven targets' marked build as failure
Sending e-mails to: support@gluu.org
Finished: FAILURE