FailedConsole Output

Skipping 1,424 KB.. Full Log
ava/com/persistit/ValueCacheUnitTest.java:[56,30] Integer(int) in java.lang.Integer has been deprecated
[WARNING] /home/jenkins/.jenkins/jobs/gluu-opendj4/workspace/opendj-sdk/persistit/core/src/test/java/com/persistit/ValueCacheUnitTest.java:[62,30] Integer(int) in java.lang.Integer has been deprecated
[WARNING] /home/jenkins/.jenkins/jobs/gluu-opendj4/workspace/opendj-sdk/persistit/core/src/test/java/com/persistit/ValueCacheUnitTest.java:[81,34] Integer(int) in java.lang.Integer has been deprecated
[WARNING] /home/jenkins/.jenkins/jobs/gluu-opendj4/workspace/opendj-sdk/persistit/core/src/test/java/com/persistit/ValueCacheUnitTest.java:[87,34] Integer(int) in java.lang.Integer has been deprecated
[WARNING] /home/jenkins/.jenkins/jobs/gluu-opendj4/workspace/opendj-sdk/persistit/core/src/test/java/com/persistit/ValueCacheUnitTest.java:[101,13] junit.framework.Assert in junit.framework has been deprecated
[WARNING] /home/jenkins/.jenkins/jobs/gluu-opendj4/workspace/opendj-sdk/persistit/core/src/test/java/com/persistit/unit/KeyCoderTest1.java:[173,9] junit.framework.Assert in junit.framework has been deprecated
[WARNING] /home/jenkins/.jenkins/jobs/gluu-opendj4/workspace/opendj-sdk/persistit/core/src/test/java/com/persistit/unit/PersistitMapTest.java:[43,79] Integer(int) in java.lang.Integer has been deprecated
[WARNING] /home/jenkins/.jenkins/jobs/gluu-opendj4/workspace/opendj-sdk/persistit/core/src/test/java/com/persistit/unit/PersistitMapTest.java:[43,99] found raw type: java.util.TreeMap
  missing type arguments for generic class java.util.TreeMap<K,V>
[WARNING] /home/jenkins/.jenkins/jobs/gluu-opendj4/workspace/opendj-sdk/persistit/core/src/test/java/com/persistit/unit/PersistitMapTest.java:[44,84] Boolean(boolean) in java.lang.Boolean has been deprecated
[WARNING] /home/jenkins/.jenkins/jobs/gluu-opendj4/workspace/opendj-sdk/persistit/core/src/test/java/com/persistit/unit/PersistitMapTest.java:[45,13] Byte(byte) in java.lang.Byte has been deprecated
[WARNING] /home/jenkins/.jenkins/jobs/gluu-opendj4/workspace/opendj-sdk/persistit/core/src/test/java/com/persistit/unit/PersistitMapTest.java:[45,33] Short(short) in java.lang.Short has been deprecated
[WARNING] /home/jenkins/.jenkins/jobs/gluu-opendj4/workspace/opendj-sdk/persistit/core/src/test/java/com/persistit/unit/PersistitMapTest.java:[45,55] Character(char) in java.lang.Character has been deprecated
[WARNING] /home/jenkins/.jenkins/jobs/gluu-opendj4/workspace/opendj-sdk/persistit/core/src/test/java/com/persistit/unit/PersistitMapTest.java:[45,81] Integer(int) in java.lang.Integer has been deprecated
[WARNING] /home/jenkins/.jenkins/jobs/gluu-opendj4/workspace/opendj-sdk/persistit/core/src/test/java/com/persistit/unit/PersistitMapTest.java:[45,98] Long(long) in java.lang.Long has been deprecated
[WARNING] /home/jenkins/.jenkins/jobs/gluu-opendj4/workspace/opendj-sdk/persistit/core/src/test/java/com/persistit/unit/PersistitMapTest.java:[46,13] Float(float) in java.lang.Float has been deprecated
[WARNING] /home/jenkins/.jenkins/jobs/gluu-opendj4/workspace/opendj-sdk/persistit/core/src/test/java/com/persistit/unit/PersistitMapTest.java:[46,31] Double(double) in java.lang.Double has been deprecated
[WARNING] /home/jenkins/.jenkins/jobs/gluu-opendj4/workspace/opendj-sdk/persistit/core/src/test/java/com/persistit/unit/PersistitMapTest.java:[47,17] found raw type: java.util.ArrayList
  missing type arguments for generic class java.util.ArrayList<E>
[WARNING] /home/jenkins/.jenkins/jobs/gluu-opendj4/workspace/opendj-sdk/persistit/core/src/test/java/com/persistit/unit/PersistitMapTest.java:[50,94] Boolean(boolean) in java.lang.Boolean has been deprecated
[WARNING] /home/jenkins/.jenkins/jobs/gluu-opendj4/workspace/opendj-sdk/persistit/core/src/test/java/com/persistit/unit/PersistitMapTest.java:[51,13] Byte(byte) in java.lang.Byte has been deprecated
[WARNING] /home/jenkins/.jenkins/jobs/gluu-opendj4/workspace/opendj-sdk/persistit/core/src/test/java/com/persistit/unit/PersistitMapTest.java:[51,33] Short(short) in java.lang.Short has been deprecated
[WARNING] /home/jenkins/.jenkins/jobs/gluu-opendj4/workspace/opendj-sdk/persistit/core/src/test/java/com/persistit/unit/PersistitMapTest.java:[51,55] Character(char) in java.lang.Character has been deprecated
[WARNING] /home/jenkins/.jenkins/jobs/gluu-opendj4/workspace/opendj-sdk/persistit/core/src/test/java/com/persistit/unit/PersistitMapTest.java:[51,80] Integer(int) in java.lang.Integer has been deprecated
[WARNING] /home/jenkins/.jenkins/jobs/gluu-opendj4/workspace/opendj-sdk/persistit/core/src/test/java/com/persistit/unit/PersistitMapTest.java:[51,96] Long(long) in java.lang.Long has been deprecated
[WARNING] /home/jenkins/.jenkins/jobs/gluu-opendj4/workspace/opendj-sdk/persistit/core/src/test/java/com/persistit/unit/PersistitMapTest.java:[52,13] Float(float) in java.lang.Float has been deprecated
[WARNING] /home/jenkins/.jenkins/jobs/gluu-opendj4/workspace/opendj-sdk/persistit/core/src/test/java/com/persistit/unit/PersistitMapTest.java:[52,30] Double(double) in java.lang.Double has been deprecated
[WARNING] /home/jenkins/.jenkins/jobs/gluu-opendj4/workspace/opendj-sdk/persistit/core/src/test/java/com/persistit/unit/PersistitMapTest.java:[52,61] Integer(int) in java.lang.Integer has been deprecated
[WARNING] /home/jenkins/.jenkins/jobs/gluu-opendj4/workspace/opendj-sdk/persistit/core/src/test/java/com/persistit/unit/PersistitMapTest.java:[53,13] Integer(int) in java.lang.Integer has been deprecated
[WARNING] /home/jenkins/.jenkins/jobs/gluu-opendj4/workspace/opendj-sdk/persistit/core/src/test/java/com/persistit/unit/PersistitMapTest.java:[53,30] Integer(int) in java.lang.Integer has been deprecated
[INFO] /home/jenkins/.jenkins/jobs/gluu-opendj4/workspace/opendj-sdk/persistit/core/src/test/java/com/persistit/unit/PersistitMapTest.java: Some input files additionally use or override a deprecated API.
[INFO] /home/jenkins/.jenkins/jobs/gluu-opendj4/workspace/opendj-sdk/persistit/core/src/test/java/com/persistit/unit/PersistitMapTest.java: Some input files additionally use unchecked or unsafe operations.
[INFO] 
[INFO] --- maven-surefire-plugin:2.18:test (default-test) @ core ---
[INFO] Surefire report directory: /home/jenkins/.jenkins/jobs/gluu-opendj4/workspace/opendj-sdk/persistit/core/target/surefire-reports

-------------------------------------------------------
 T E S T S
-------------------------------------------------------
Running com.persistit.Bug932097Test
Tests run: 1, Failures: 0, Errors: 0, Skipped: 0, Time elapsed: 3.815 sec - in com.persistit.Bug932097Test
Running com.persistit.KeyHistogramTest
Tests run: 4, Failures: 0, Errors: 0, Skipped: 0, Time elapsed: 5.484 sec - in com.persistit.KeyHistogramTest
Running com.persistit.MVCCBasicTest
Tests run: 27, Failures: 0, Errors: 0, Skipped: 0, Time elapsed: 7.696 sec - in com.persistit.MVCCBasicTest
Running com.persistit.unit.TreeSelectorTest
Tests run: 8, Failures: 0, Errors: 0, Skipped: 0, Time elapsed: 0.01 sec - in com.persistit.unit.TreeSelectorTest
Running com.persistit.unit.KeyParserTest1
test1 - done
test2 - done
Tests run: 2, Failures: 0, Errors: 0, Skipped: 0, Time elapsed: 0.405 sec - in com.persistit.unit.KeyParserTest1
Running com.persistit.unit.FileLockTest
[main] WARNING Failure while registering MXBean: javax.management.InstanceAlreadyExistsException: com.persistit:type=Persistit
[main] WARNING Failure while registering MXBean: javax.management.InstanceAlreadyExistsException: com.persistit:type=Persistit,class=BufferPool.16384
Tests run: 1, Failures: 0, Errors: 0, Skipped: 0, Time elapsed: 0.285 sec - in com.persistit.unit.FileLockTest
Running com.persistit.unit.TemporaryVolumeTest1
.....
Cycle=1 had 200 evictions
Invalidating 203 pages in cycle 1
Cycle=2 had 199 evictions
Invalidating 402 pages in cycle 2
Cycle=3 had 200 evictions
Invalidating 602 pages in cycle 3
Cycle=4 had 199 evictions
Invalidating 801 pages in cycle 4
Cycle=5 had 199 evictions
Invalidating 1000 pages in cycle 5
Cycle=6 had 202 evictions
Invalidating 1202 pages in cycle 6
Cycle=7 had 199 evictions
Invalidating 1401 pages in cycle 7
Cycle=8 had 200 evictions
Invalidating 1601 pages in cycle 8
Cycle=9 had 199 evictions
Invalidating 1800 pages in cycle 9
Tests run: 10, Failures: 0, Errors: 0, Skipped: 0, Time elapsed: 20.264 sec - in com.persistit.unit.TemporaryVolumeTest1
Running com.persistit.unit.ValueTest1
test10 WARNING: An illegal reflective access operation has occurred
WARNING: Illegal reflective access by com.persistit.DefaultValueCoder$5 (file:/home/jenkins/.jenkins/jobs/gluu-opendj4/workspace/opendj-sdk/persistit/core/target/classes/) to method java.io.ObjectStreamClass.newInstance()
WARNING: Please consider reporting this to the maintainers of com.persistit.DefaultValueCoder$5
WARNING: Use --illegal-access=warn to enable warnings of further illegal reflective access operations
WARNING: All illegal access operations will be denied in a future release
- done
test1 - done
test2 - done
test3 - done
test4 - done
test5 - done
test6 - done
test7 - done
test8 - done
test9 - done
Tests run: 15, Failures: 0, Errors: 0, Skipped: 0, Time elapsed: 2.929 sec - in com.persistit.unit.ValueTest1
Running com.persistit.unit.BufferPoolMemConfigurationTest
Tests run: 2, Failures: 0, Errors: 0, Skipped: 0, Time elapsed: 0.312 sec - in com.persistit.unit.BufferPoolMemConfigurationTest
Running com.persistit.unit.KeyCoderTest1
Tests run: 5, Failures: 0, Errors: 0, Skipped: 0, Time elapsed: 0.943 sec - in com.persistit.unit.KeyCoderTest1
Running com.persistit.unit.PersistitMapTest
test1 - done
test2 - done
test3 - done
test4 - done
test5  i0 i100 i200 i300 i400 i500 i600 i700 i800 i900 r0 r100 r200 r300 r400 r500 r600 r700 r800 r900- done
test6 - done
test7 - done
Tests run: 7, Failures: 0, Errors: 0, Skipped: 0, Time elapsed: 3.874 sec - in com.persistit.unit.PersistitMapTest
Running com.persistit.unit.SimpleTest1
Tests run: 6, Failures: 0, Errors: 0, Skipped: 0, Time elapsed: 2.746 sec - in com.persistit.unit.SimpleTest1
Running com.persistit.unit.LongRecordTest1
test1ex.store() took 15,183,496ns
 - done
test2 - done
test3 - done
Tests run: 3, Failures: 0, Errors: 0, Skipped: 0, Time elapsed: 5.402 sec - in com.persistit.unit.LongRecordTest1
Running com.persistit.unit.ValueTest2
...test10 Displayable form: (com.persistit.unit.ValueTest2$Person){(long)65000,(Date)20210721122100.206+0000,"Mary",com.persistit.unit.ValueTest2$Person[]{(com.persistit.unit.ValueTest2$Person){(long)80000,(Date)20210721122100.206+0000,"John",com.persistit.unit.ValueTest2$Person[]{@0},"Smith"}},"Jones"}
- done
test1 - done
test2 - done
test3 ........- done
test4 - done
test5 ValueTest2.test5: memory in use=41982256
ValueTest2.test5: memory in use=44081384
ValueTest2.test5: memory in use=46178536
ValueTest2.test5: memory in use=48275688
ValueTest2.test5: memory in use=50372864
- done
test6 - done
test7 - done
test8 - done
test9 Displayable form: java.lang.Object[]{(Byte)1,(Integer)2,(Long)3,(Float)4.0,(Double)5.0,(Date)20210721122103.084+0000,"a",String[]{"a","b","c"},"a",@103,null,java.lang.Object[]{(Byte)1,(Integer)2,(Long)3,(Float)4.0,(Double)5.0,@69,"a",@103,"a",@103,null,@139}}
- done
.....Tests run: 18, Failures: 0, Errors: 0, Skipped: 0, Time elapsed: 5.807 sec - in com.persistit.unit.ValueTest2
Running com.persistit.unit.KeyTest1
test10 - done
test11 - done
test12 - done
test13 - done
test1 - done
test2 - done
test3 - done
test4 - done
test5 - done
test6 - done
test7 - done
test8 - done
test9  0- done
Tests run: 37, Failures: 0, Errors: 0, Skipped: 0, Time elapsed: 9.909 sec - in com.persistit.unit.KeyTest1
Running com.persistit.unit.SaveLoadTest1
test1 - done
Tests run: 1, Failures: 0, Errors: 0, Skipped: 0, Time elapsed: 0.208 sec - in com.persistit.unit.SaveLoadTest1
Running com.persistit.unit.TransactionTest3
test1 - done
test2 - done
test3 - done
test4 - done
test5 - done
Tests run: 5, Failures: 0, Errors: 0, Skipped: 0, Time elapsed: 1.118 sec - in com.persistit.unit.TransactionTest3
Running com.persistit.unit.KeyFilterTest2
test1 - done
Tests run: 1, Failures: 0, Errors: 0, Skipped: 0, Time elapsed: 0.246 sec - in com.persistit.unit.KeyFilterTest2
Running com.persistit.unit.ValueCoderTest2
test1 - done
test2 - done
test3 - done
test4 - done
Tests run: 4, Failures: 0, Errors: 0, Skipped: 0, Time elapsed: 0.786 sec - in com.persistit.unit.ValueCoderTest2
Running com.persistit.unit.DefaultCoderManagerTest
test1 - done
Tests run: 1, Failures: 0, Errors: 0, Skipped: 0, Time elapsed: 0.207 sec - in com.persistit.unit.DefaultCoderManagerTest
Running com.persistit.unit.ValueTest5
test1 - done
Tests run: 1, Failures: 0, Errors: 0, Skipped: 0, Time elapsed: 0.191 sec - in com.persistit.unit.ValueTest5
Running com.persistit.unit.ExchangeTest
Testing getTransaction
Testing getVolume
Testing getTree
Testing fetch
Testing isValueDefined
Testing hasChildren
Testing getAppCache
Testing getTimeoutMillis
Testing initCache
Testing cut
Testing getPersistitInstance
Testing getChangeCount
Testing fetchAndStore
Testing fetchAndRemove
Testing removeTree
Testing remove
Testing lock
Testing clear
Testing next
Testing getValue
Testing hasNext
Testing getKey
Testing store
Testing reset
Testing removeAll
Testing previous
Testing hasPrevious
Tests run: 9, Failures: 0, Errors: 0, Skipped: 0, Time elapsed: 2.368 sec - in com.persistit.unit.ExchangeTest
Running com.persistit.unit.ThreadSequencerTest
Tests run: 1, Failures: 0, Errors: 0, Skipped: 0, Time elapsed: 1.084 sec - in com.persistit.unit.ThreadSequencerTest
Running com.persistit.unit.TraverseVisitorTest
Tests run: 3, Failures: 0, Errors: 0, Skipped: 0, Time elapsed: 0.555 sec - in com.persistit.unit.TraverseVisitorTest
Running com.persistit.unit.KeyFilterTest1
test1 - done
test2 - done
test3 - done
test4 - done
test5 - done
test6 - done
Tests run: 10, Failures: 0, Errors: 0, Skipped: 0, Time elapsed: 1.906 sec - in com.persistit.unit.KeyFilterTest1
Running com.persistit.unit.ValueTest4
Tests run: 4, Failures: 0, Errors: 0, Skipped: 0, Time elapsed: 0.769 sec - in com.persistit.unit.ValueTest4
Running com.persistit.unit.JoinTest1
test1 - done
Tests run: 1, Failures: 0, Errors: 0, Skipped: 0, Time elapsed: 0.294 sec - in com.persistit.unit.JoinTest1
Running com.persistit.unit.TransactionTest1
test1 - done
test2 - done
test3 - done
test4 - done
test5 - done
Tests run: 6, Failures: 0, Errors: 0, Skipped: 0, Time elapsed: 1.372 sec - in com.persistit.unit.TransactionTest1
Running com.persistit.unit.BigDataTest
Tests run: 3, Failures: 0, Errors: 0, Skipped: 0, Time elapsed: 0.998 sec - in com.persistit.unit.BigDataTest
Running com.persistit.unit.ValueTest3
Tests run: 13, Failures: 0, Errors: 0, Skipped: 0, Time elapsed: 2.439 sec - in com.persistit.unit.ValueTest3
Running com.persistit.unit.TreeTest1
test1 - done
test2 - done
Tests run: 2, Failures: 0, Errors: 0, Skipped: 0, Time elapsed: 0.766 sec - in com.persistit.unit.TreeTest1
Running com.persistit.unit.KeyParserTest2
test1 - done
test2 - done
test3 - done
test4 
- done
Tests run: 4, Failures: 0, Errors: 0, Skipped: 0, Time elapsed: 0.805 sec - in com.persistit.unit.KeyParserTest2
Running com.persistit.unit.ValueCoderTest1
test1 - done
test2 - done
test3 - done
test4 - done
Tests run: 4, Failures: 0, Errors: 0, Skipped: 0, Time elapsed: 0.789 sec - in com.persistit.unit.ValueCoderTest1
Running com.persistit.Bug739533Test
maxValueSize=12234
Tests run: 1, Failures: 0, Errors: 0, Skipped: 0, Time elapsed: 0.243 sec - in com.persistit.Bug739533Test
Running com.persistit.DumpTaskTest
PersistitDump_202107211221.000000000000
Page 1 in volume persistit(/home/jenkins/.jenkins/jobs/gluu-opendj4/workspace/opendj-sdk/persistit/core/target/junit8699541705360657183/persistit/persistit) at index 1 timestamp=4,387 status=vd type=Data
Page 2 in volume persistit(/home/jenkins/.jenkins/jobs/gluu-opendj4/workspace/opendj-sdk/persistit/core/target/junit8699541705360657183/persistit/persistit) at index 2 timestamp=24,281 status=v type=Data
Tests run: 2, Failures: 0, Errors: 0, Skipped: 0, Time elapsed: 0.47 sec - in com.persistit.DumpTaskTest
Running com.persistit.Bug1017957Test
T2 iterations 5,000
T2 iterations 10,000
[Thread-238] ERROR BTree structure error Volume persistit(/home/jenkins/.jenkins/jobs/gluu-opendj4/workspace/opendj-sdk/persistit/core/target/junit11082246416872975249/persistit/persistit) page 21 invalid page type 3: should be 2
Exchange(Volume=/home/jenkins/.jenkins/jobs/gluu-opendj4/workspace/opendj-sdk/persistit/core/target/junit11082246416872975249/persistit/persistit,Tree=Bug1017957Test,,Key=<{1015,"0123456789abcdefghijklmnopqrstuvwxyz0123456789abcdefghijklmnopqrstuvwxyz0123456789abcdefghijklmnopqrstuvwxyz0123456789abcdefghijklmnopqrstuvwxyz0123456789abcdefghijklmnopqrstuvwxyz0123456789abcdefghijklmnopqrstuvwxyz0123456789abcdefghijklmnopqrstuvwxyz0123456789abcdefghijklmnopqrstuvwxyz0123456789abcdefghijklmnopqrstuvwxyz0123456789abcdefghijklmnopqrstuvwxyz0123456789abcdefghijklmnopqrstuvwxyz0123456789abcdefghijklmnopqrstuvwxyz0123456789abcdefghijklmnopqrstuvwxyz0123456789abcdefghijklmnopqrstuvwxyz0123456789abcdefghijklmnopqrstuvwxyz0123456789abcdefghijklmnopqrstuvwxyz0123456789abcdefghijklmnopqrstuvwxyz0123456789abcdefghijklmnopqrstuvwxyz0123456789abcdefghijklmnopqrstuvwxyz0123456789abcdefghijklmnopqrstuvwxyz0123456789abcdefghijklmnopqrstuvwxyz0123456789abcdefghijklmnopqrstuvwxyz0123456789abcdefghijklmnopqrstuvwxyz0123456789abcdefghijklmnopqrstuvwxyz0123456789abcdefghijklmnopqrstuvwxyz0123456789abcdefghijklmnopqrstuvwxyz0123456789abcdefghijklmnopqrstuvwxyz0123456789abcdefghijklmnopqrstuvwxyz0123456789abcdefghijklmnopqrstuv"}>)
com.persistit.exception.CorruptVolumeException: Volume persistit(/home/jenkins/.jenkins/jobs/gluu-opendj4/workspace/opendj-sdk/persistit/core/target/junit11082246416872975249/persistit/persistit) page 21 invalid page type 3: should be 2
[Thread-239] ERROR BTree structure error Volume persistit(/home/jenkins/.jenkins/jobs/gluu-opendj4/workspace/opendj-sdk/persistit/core/target/junit11082246416872975249/persistit/persistit) page 21 invalid page type 3: should be 2
Exchange(Volume=/home/jenkins/.jenkins/jobs/gluu-opendj4/workspace/opendj-sdk/persistit/core/target/junit11082246416872975249/persistit/persistit,Tree=Bug1017957Test,,Key=<{1009,99,"The quick red fox jumped over the lazy brown dog."}>)
0: Buffer=<Page 7 in volume persistit(/home/jenkins/.jenkins/jobs/gluu-opendj4/workspace/opendj-sdk/persistit/core/target/junit11082246416872975249/persistit/persistit) at index 12 timestamp=2,251,453 status=vd type=Data>, keyGeneration=-1, bufferGeneration=1010841, foundAt=<65532:exact:fixup:depth=4095:after>>
1: Buffer=<Page 4 in volume persistit(/home/jenkins/.jenkins/jobs/gluu-opendj4/workspace/opendj-sdk/persistit/core/target/junit11082246416872975249/persistit/persistit) at index 9 timestamp=2,251,454 status=vdwr1 <Thread-239> type=Index1>, keyGeneration=-1, bufferGeneration=75173, foundAt=<65532:exact:fixup:depth=4095:after>>
2: Buffer=<Page 21 in volume persistit(/home/jenkins/.jenkins/jobs/gluu-opendj4/workspace/opendj-sdk/persistit/core/target/junit11082246416872975249/persistit/persistit) at index 26 timestamp=2,251,367 status=vdwr1 <Thread-239> type=Index2>, keyGeneration=-1, bufferGeneration=16, foundAt=<65532:exact:fixup:depth=4095:after>>
	at com.persistit.Exchange.corrupt(Exchange.java:4288)
	at com.persistit.Exchange.checkPageType(Exchange.java:4109)
	at com.persistit.Exchange.searchLevel(Exchange.java:1293)
	at com.persistit.Exchange.searchTree(Exchange.java:1196)
	at com.persistit.Exchange.storeInternal(Exchange.java:1515)
	at com.persistit.Exchange.store(Exchange.java:1364)
	at com.persistit.Exchange.store(Exchange.java:2748)
	at com.persistit.Bug1017957Test.createUnsafeStructure(Bug1017957Test.java:206)
	at com.persistit.Bug1017957Test.access$000(Bug1017957Test.java:98)
	at com.persistit.Bug1017957Test$1.run(Bug1017957Test.java:124)
	at java.base/java.lang.Thread.run(Thread.java:834)
[Thread-238] ERROR BTree structure error Volume persistit(/home/jenkins/.jenkins/jobs/gluu-opendj4/workspace/opendj-sdk/persistit/core/target/junit11082246416872975249/persistit/persistit) page 21 invalid page type 3: should be 2
Exchange(Volume=/home/jenkins/.jenkins/jobs/gluu-opendj4/workspace/opendj-sdk/persistit/core/target/junit11082246416872975249/persistit/persistit,Tree=Bug1017957Test,,Key=<{1013,"0123456789abcdefghijklmnopqrstuvwxyz0123456789abcdefghijklmnopqrstuvwxyz0123456789abcdefghijklmnopqrstuvwxyz0123456789abcdefghijklmnopqrstuvwxyz0123456789abcdefghijklmnopqrstuvwxyz0123456789abcdefghijklmnopqrstuvwxyz0123456789abcdefghijklmnopqrstuvwxyz0123456789abcdefghijklmnopqrstuvwxyz0123456789abcdefghijklmnopqrstuvwxyz0123456789abcdefghijklmnopqrstuvwxyz0123456789abcdefghijklmnopqrstuvwxyz0123456789abcdefghijklmnopqrstuvwxyz0123456789abcdefghijklmnopqrstuvwxyz0123456789abcdefghijklmnopqrstuvwxyz0123456789abcdefghijklmnopqrstuvwxyz0123456789abcdefghijklmnopqrstuvwxyz0123456789abcdefghijklmnopqrstuvwxyz0123456789abcdefghijklmnopqrstuvwxyz0123456789abcdefghijklmnopqrstuvwxyz0123456789abcdefghijklmnopqrstuvwxyz0123456789abcdefghijklmnopqrstuvwxyz0123456789abcdefghijklmnopqrstuvwxyz0123456789abcdefghijklmnopqrstuvwxyz0123456789abcdefghijklmnopqrstuvwxyz0123456789abcdefghijklmnopqrstuvwxyz0123456789abcdefghijklmnopqrstuvwxyz0123456789abcdefghijklmnopqrstuvwxyz0123456789abcdefghijklmnopqrstuvwxyz0123456789abcdefghijklmnopqrstuv"}>)
0: Buffer=<Page 15 in volume persistit(/home/jenkins/.jenkins/jobs/gluu-opendj4/workspace/opendj-sdk/persistit/core/target/junit11082246416872975249/persistit/persistit) at index 20 timestamp=2,251,516 status=vd type=Data>, keyGeneration=151130, bufferGeneration=15469, foundAt=<36:depth=2:ebc=2:db=244:tail=2236>>
1: Buffer=<Page 4 in volume persistit(/home/jenkins/.jenkins/jobs/gluu-opendj4/workspace/opendj-sdk/persistit/core/target/junit11082246416872975249/persistit/persistit) at index 9 timestamp=2,251,517 status=vd type=Index1>, keyGeneration=-1, bufferGeneration=75187, foundAt=<65532:exact:fixup:depth=4095:after>>
2: Buffer=<Page 21 in volume persistit(/home/jenkins/.jenkins/jobs/gluu-opendj4/workspace/opendj-sdk/persistit/core/target/junit11082246416872975249/persistit/persistit) at index 26 timestamp=2,251,367 status=vdr1 type=Index2>, keyGeneration=151133, bufferGeneration=16, foundAt=<36:exact:depth=1046:ebc=0:db=38:tail=15320>>
com.persistit.exception.CorruptVolumeException: Volume persistit(/home/jenkins/.jenkins/jobs/gluu-opendj4/workspace/opendj-sdk/persistit/core/target/junit11082246416872975249/persistit/persistit) page 21 invalid page type 3: should be 2
	at com.persistit.Exchange.corrupt(Exchange.java:4288)
	at com.persistit.Exchange.checkPageType(Exchange.java:4109)
	at com.persistit.Exchange.searchLevel(Exchange.java:1293)
	at com.persistit.Exchange.searchTree(Exchange.java:1196)
	at com.persistit.Exchange.storeInternal(Exchange.java:1515)
	at com.persistit.Exchange.store(Exchange.java:1364)
	at com.persistit.Exchange.store(Exchange.java:2748)
	at com.persistit.Bug1017957Test.createUnsafeStructure(Bug1017957Test.java:206)
	at com.persistit.Bug1017957Test.access$000(Bug1017957Test.java:98)
	at com.persistit.Bug1017957Test$1.run(Bug1017957Test.java:124)
	at java.base/java.lang.Thread.run(Thread.java:834)
[Thread-238] ERROR BTree structure error Volume persistit(/home/jenkins/.jenkins/jobs/gluu-opendj4/workspace/opendj-sdk/persistit/core/target/junit11082246416872975249/persistit/persistit) page 21 invalid page type 3: should be 2
Exchange(Volume=/home/jenkins/.jenkins/jobs/gluu-opendj4/workspace/opendj-sdk/persistit/core/target/junit11082246416872975249/persistit/persistit,Tree=Bug1017957Test,,Key=<{1014,"0123456789abcdefghijklmnopqrstuvwxyz0123456789abcdefghijklmnopqrstuvwxyz0123456789abcdefghijklmnopqrstuvwxyz0123456789abcdefghijklmnopqrstuvwxyz0123456789abcdefghijklmnopqrstuvwxyz0123456789abcdefghijklmnopqrstuvwxyz0123456789abcdefghijklmnopqrstuvwxyz0123456789abcdefghijklmnopqrstuvwxyz0123456789abcdefghijklmnopqrstuvwxyz0123456789abcdefghijklmnopqrstuvwxyz0123456789abcdefghijklmnopqrstuvwxyz0123456789abcdefghijklmnopqrstuvwxyz0123456789abcdefghijklmnopqrstuvwxyz0123456789abcdefghijklmnopqrstuvwxyz0123456789abcdefghijklmnopqrstuvwxyz0123456789abcdefghijklmnopqrstuvwxyz0123456789abcdefghijklmnopqrstuvwxyz0123456789abcdefghijklmnopqrstuvwxyz0123456789abcdefghijklmnopqrstuvwxyz0123456789abcdefghijklmnopqrstuvwxyz0123456789abcdefghijklmnopqrstuvwxyz0123456789abcdefghijklmnopqrstuvwxyz0123456789abcdefghijklmnopqrstuvwxyz0123456789abcdefghijklmnopqrstuvwxyz0123456789abcdefghijklmnopqrstuvwxyz0123456789abcdefghijklmnopqrstuvwxyz0123456789abcdefghijklmnopqrstuvwxyz0123456789abcdefghijklmnopqrstuvwxyz0123456789abcdefghijklmnopqrstuv"}>)
0: Buffer=<Page 18 in volume persistit(/home/jenkins/.jenkins/jobs/gluu-opendj4/workspace/opendj-sdk/persistit/core/target/junit11082246416872975249/persistit/persistit) at index 23 timestamp=2,251,535 status=vd type=Data>, keyGeneration=151178, bufferGeneration=82529, foundAt=<36:depth=2:ebc=2:db=245:tail=2236>>
1: Buffer=<Page 4 in volume persistit(/home/jenkins/.jenkins/jobs/gluu-opendj4/workspace/opendj-sdk/persistit/core/target/junit11082246416872975249/persistit/persistit) at index 9 timestamp=2,251,536 status=vd type=Index1>, keyGeneration=-1, bufferGeneration=75189, foundAt=<65532:exact:fixup:depth=4095:after>>
2: Buffer=<Page 21 in volume persistit(/home/jenkins/.jenkins/jobs/gluu-opendj4/workspace/opendj-sdk/persistit/core/target/junit11082246416872975249/persistit/persistit) at index 26 timestamp=2,251,367 status=vdr1 type=Index2>, keyGeneration=151181, bufferGeneration=16, foundAt=<40:depth=2:end>>
com.persistit.exception.CorruptVolumeException: Volume persistit(/home/jenkins/.jenkins/jobs/gluu-opendj4/workspace/opendj-sdk/persistit/core/target/junit11082246416872975249/persistit/persistit) page 21 invalid page type 3: should be 2
	at com.persistit.Exchange.corrupt(Exchange.java:4288)
	at com.persistit.Exchange.checkPageType(Exchange.java:4109)
	at com.persistit.Exchange.searchLevel(Exchange.java:1293)
	at com.persistit.Exchange.searchTree(Exchange.java:1196)
	at com.persistit.Exchange.storeInternal(Exchange.java:1515)
	at com.persistit.Exchange.store(Exchange.java:1364)
	at com.persistit.Exchange.store(Exchange.java:2748)
	at com.persistit.Bug1017957Test.createUnsafeStructure(Bug1017957Test.java:206)
	at com.persistit.Bug1017957Test.access$000(Bug1017957Test.java:98)
	at com.persistit.Bug1017957Test$1.run(Bug1017957Test.java:124)
	at java.base/java.lang.Thread.run(Thread.java:834)
com.persistit.exception.CorruptVolumeException: Volume persistit(/home/jenkins/.jenkins/jobs/gluu-opendj4/workspace/opendj-sdk/persistit/core/target/junit11082246416872975249/persistit/persistit) page 21 invalid page type 3: should be 2
	at com.persistit.Exchange.corrupt(Exchange.java:4288)
	at com.persistit.Exchange.checkPageType(Exchange.java:4109)
	at com.persistit.Exchange.searchLevel(Exchange.java:1293)
	at com.persistit.Exchange.raw_removeKeyRangeInternal(Exchange.java:3641)
	at com.persistit.Exchange.removeKeyRangeInternal(Exchange.java:3401)
	at com.persistit.Exchange.removeKeyRange(Exchange.java:3365)
	at com.persistit.Bug1017957Test.removeCoveringRange(Bug1017957Test.java:219)
	at com.persistit.Bug1017957Test.access$200(Bug1017957Test.java:98)
	at com.persistit.Bug1017957Test$2.run(Bug1017957Test.java:151)
	at java.base/java.lang.Thread.run(Thread.java:834)
T2 iterations 15,000
T2 iterations 20,000
T1 iterations 5,000
T2 iterations 25,000
T2 iterations 30,000
T2 iterations 35,000

Volume persistit - checking
  Tree persistit:_directory - Faults:  0 Index pages/bytes: 0 / 0 Data pages/bytes: 1 / 76 LongRec pages/bytes: 0 / 0  MVV pages/records/bytes/antivalues: 0 / 0 / 0 / 0  Holes 0 Pages pruned 0
  Tree persistit:Bug1017957Test - Faults:  0 Index pages/bytes: 2 / 10,632 Data pages/bytes: 12 / 106,828 LongRec pages/bytes: 0 / 0  MVV pages/records/bytes/antivalues: 0 / 0 / 0 / 0  Holes 0 Pages pruned 0
Volume persistit Faults:  0 Index pages/bytes: 2 / 10,632 Data pages/bytes: 13 / 106,904 LongRec pages/bytes: 0 / 0  MVV pages/records/bytes/antivalues: 0 / 0 / 0 / 0  Holes 0 Pages pruned 0
Total errors 4Tests run: 1, Failures: 1, Errors: 0, Skipped: 0, Time elapsed: 10.265 sec <<< FAILURE! - in com.persistit.Bug1017957Test
induceCorruptionByStress(com.persistit.Bug1017957Test)  Time elapsed: 10.265 sec  <<< FAILURE!
java.lang.AssertionError: Exception occurred expected:<0> but was:<4>
	at org.junit.Assert.fail(Assert.java:89)
	at org.junit.Assert.failNotEquals(Assert.java:835)
	at org.junit.Assert.assertEquals(Assert.java:647)
	at com.persistit.Bug1017957Test.induceCorruptionByStress(Bug1017957Test.java:182)

Running com.persistit.FatalErrorExceptionTest
Tests run: 1, Failures: 0, Errors: 0, Skipped: 0, Time elapsed: 0.126 sec - in com.persistit.FatalErrorExceptionTest
Running com.persistit.JournalManagerTest
[main] WARNING Recovery exception com.persistit.exception.VolumeNotFoundException: /home/jenkins/.jenkins/jobs/gluu-opendj4/workspace/opendj-sdk/persistit/core/target/junit8602170030331048914/persistit/missing1 at transaction TStatus 17,611{204}c
[main] WARNING com.persistit.exception.VolumeNotFoundException: /home/jenkins/.jenkins/jobs/gluu-opendj4/workspace/opendj-sdk/persistit/core/target/junit8602170030331048914/persistit/missing1 while pruning transaction record TStatus 17,611{204}c
[main] WARNING Missing volume /home/jenkins/.jenkins/jobs/gluu-opendj4/workspace/opendj-sdk/persistit/core/target/junit8380676299295041881/persistit/missing1 referenced at journal address 17,643
[main] WARNING Missing volume /home/jenkins/.jenkins/jobs/gluu-opendj4/workspace/opendj-sdk/persistit/core/target/junit8380676299295041881/persistit/missing1 referenced at journal address 17,643 (2 similar occurrences in 0 seconds)
[JOURNAL_COPIER] WARNING Missing volume missing1(/home/jenkins/.jenkins/jobs/gluu-opendj4/workspace/opendj-sdk/persistit/core/target/junit17211630631883527529/persistit/missing1) referenced at journal address 34,557
[JOURNAL_COPIER] WARNING Lost page 0 from missing volume missing1(/home/jenkins/.jenkins/jobs/gluu-opendj4/workspace/opendj-sdk/persistit/core/target/junit17211630631883527529/persistit/missing1) referenced at journal address 34,557
[JOURNAL_COPIER] WARNING Lost page 1 from missing volume missing1(/home/jenkins/.jenkins/jobs/gluu-opendj4/workspace/opendj-sdk/persistit/core/target/junit17211630631883527529/persistit/missing1) referenced at journal address 50,977
[JOURNAL_COPIER] WARNING Lost page 2 from missing volume missing1(/home/jenkins/.jenkins/jobs/gluu-opendj4/workspace/opendj-sdk/persistit/core/target/junit17211630631883527529/persistit/missing1) referenced at journal address 51,121
[JOURNAL_COPIER] WARNING Lost page 0 from missing volume missing2(/home/jenkins/.jenkins/jobs/gluu-opendj4/workspace/opendj-sdk/persistit/core/target/junit17211630631883527529/persistit/missing2) referenced at journal address 17,909
[JOURNAL_COPIER] WARNING Lost page 1 from missing volume missing2(/home/jenkins/.jenkins/jobs/gluu-opendj4/workspace/opendj-sdk/persistit/core/target/junit17211630631883527529/persistit/missing2) referenced at journal address 34,329
[JOURNAL_COPIER] WARNING Lost page 2 from missing volume missing2(/home/jenkins/.jenkins/jobs/gluu-opendj4/workspace/opendj-sdk/persistit/core/target/junit17211630631883527529/persistit/missing2) referenced at journal address 34,473
[main] WARNING Missing volume missing2(/home/jenkins/.jenkins/jobs/gluu-opendj4/workspace/opendj-sdk/persistit/core/target/junit17211630631883527529/persistit/missing2) referenced at journal address 34,473 (12 similar occurrences in 0 seconds)
Journal at /home/jenkins/.jenkins/jobs/gluu-opendj4/workspace/opendj-sdk/persistit/core/target/junit7403905087171833952/persistit/JournalManagerTest_journal_:
Keystone Address:  300,000,000
Base Address: 0
Block Size: 100,000,000
Journal created: 202107211222
Last valid checkpoint: Checkpoint 322,708c @ 2021-07-21 12:22:03
Last valid checkpoint address: 300,017,679
Recovered transaction count committed=0 uncommitted=0
Recovered page count: 85
Volume handle map--
     1->persistit(/home/jenkins/.jenkins/jobs/gluu-opendj4/workspace/opendj-sdk/persistit/core/target/junit7403905087171833952/persistit/persistit)
Tree handle map--
Validating file /home/jenkins/.jenkins/jobs/gluu-opendj4/workspace/opendj-sdk/persistit/core/target/junit7403905087171833952/persistit/JournalManagerTest_journal_.000000000000
Validating file /home/jenkins/.jenkins/jobs/gluu-opendj4/workspace/opendj-sdk/persistit/core/target/junit7403905087171833952/persistit/JournalManagerTest_journal_.000000000001
Validating file /home/jenkins/.jenkins/jobs/gluu-opendj4/workspace/opendj-sdk/persistit/core/target/junit7403905087171833952/persistit/JournalManagerTest_journal_.000000000002
Tests run: 13, Failures: 0, Errors: 0, Skipped: 0, Time elapsed: 23.196 sec - in com.persistit.JournalManagerTest
Running com.persistit.AccumulatorRecoveryTest
(Acceptable) rollback in Thread-283
Tests run: 4, Failures: 0, Errors: 0, Skipped: 0, Time elapsed: 20.219 sec - in com.persistit.AccumulatorRecoveryTest
Running com.persistit.Bug870352Test
Tests run: 1, Failures: 0, Errors: 0, Skipped: 0, Time elapsed: 0.225 sec - in com.persistit.Bug870352Test
Running com.persistit.Bug920754Test
Tests run: 1, Failures: 0, Errors: 0, Skipped: 0, Time elapsed: 0.238 sec - in com.persistit.Bug920754Test
Running com.persistit.TreeTransactionalLifetimeTest
Tests run: 5, Failures: 0, Errors: 0, Skipped: 0, Time elapsed: 2.523 sec - in com.persistit.TreeTransactionalLifetimeTest
Running com.persistit.FastIndexTest
Tests run: 4, Failures: 0, Errors: 0, Skipped: 0, Time elapsed: 5.55 sec - in com.persistit.FastIndexTest
Running com.persistit.Bug708592Test
* expect failure here
Tests run: 1, Failures: 0, Errors: 0, Skipped: 0, Time elapsed: 0.256 sec - in com.persistit.Bug708592Test
Running com.persistit.Bug989202Test
Tests run: 1, Failures: 0, Errors: 0, Skipped: 0, Time elapsed: 0.207 sec - in com.persistit.Bug989202Test
Running com.persistit.BufferTest2
Tests run: 11, Failures: 0, Errors: 0, Skipped: 0, Time elapsed: 2.845 sec - in com.persistit.BufferTest2
Running com.persistit.Bug927701Test
Tests run: 1, Failures: 0, Errors: 0, Skipped: 0, Time elapsed: 4.68 sec - in com.persistit.Bug927701Test
Running com.persistit.MVCCPruneBufferTest
       {1}  "THE QUICK RED FOX JUMPED OVER THE LAZY BROWN DOG."
       {2}  "The quick red fox jumped over the lazy brown dog."
       {3}  "THE QUICK RED FOX JUMPED OVER THE LAZY BROWN DOG."
       {4}  "The quick red fox jumped over the lazy brown dog."
       {5}  "THE QUICK RED FOX JUMPED OVER THE LAZY BROWN DOG."
       {6}  "The quick red fox jumped over the lazy brown dog."
       {7}  "THE QUICK RED FOX JUMPED OVER THE LAZY BROWN DOG."
       {8}  "The quick red fox jumped over the lazy brown dog."
       {9}  "THE QUICK RED FOX JUMPED OVER THE LAZY BROWN DOG."
      {10}  "The quick red fox jumped over the lazy brown dog."
      {11}  "THE QUICK RED FOX JUMPED OVER THE LAZY BROWN DOG."
      {12}  "The quick red fox jumped over the lazy brown dog."
      {13}  "THE QUICK RED FOX JUMPED OVER THE LAZY BROWN DOG."
      {14}  "The quick red fox jumped over the lazy brown dog."
      {15}  "THE QUICK RED FOX JUMPED OVER THE LAZY BROWN DOG."
      {16}  "The quick red fox jumped over the lazy brown dog."
      {17}  "THE QUICK RED FOX JUMPED OVER THE LAZY BROWN DOG."
      {18}  "The quick red fox jumped over the lazy brown dog."
      {19}  "THE QUICK RED FOX JUMPED OVER THE LAZY BROWN DOG."
      {20}  "The quick red fox jumped over the lazy brown dog."
      {22}  "The quick red fox jumped over the lazy brown dog."
      {24}  "The quick red fox jumped over the lazy brown dog."
      {26}  "The quick red fox jumped over the lazy brown dog."
      {28}  "The quick red fox jumped over the lazy brown dog."
      {30}  "The quick red fox jumped over the lazy brown dog."
      {32}  "The quick red fox jumped over the lazy brown dog."
      {34}  "The quick red fox jumped over the lazy brown dog."
      {36}  "The quick red fox jumped over the lazy brown dog."
      {38}  "The quick red fox jumped over the lazy brown dog."
      {40}  "The quick red fox jumped over the lazy brown dog."
      {42}  "The quick red fox jumped over the lazy brown dog."
      {44}  "The quick red fox jumped over the lazy brown dog."
      {46}  "The quick red fox jumped over the lazy brown dog."
      {48}  "The quick red fox jumped over the lazy brown dog."
      {50}  "The quick red fox jumped over the lazy brown dog."
      {52}  "The quick red fox jumped over the lazy brown dog."
      {54}  "The quick red fox jumped over the lazy brown dog."
      {56}  "The quick red fox jumped over the lazy brown dog."
      {58}  "The quick red fox jumped over the lazy brown dog."
      {60}  "The quick red fox jumped over the lazy brown dog."
      {62}  "The quick red fox jumped over the lazy brown dog."
      {64}  "The quick red fox jumped over the lazy brown dog."
      {66}  "The quick red fox jumped over the lazy brown dog."
      {68}  "The quick red fox jumped over the lazy brown dog."
      {70}  "The quick red fox jumped over the lazy brown dog."
      {72}  "The quick red fox jumped over the lazy brown dog."
      {74}  "The quick red fox jumped over the lazy brown dog."
      {76}  "The quick red fox jumped over the lazy brown dog."
      {78}  "The quick red fox jumped over the lazy brown dog."
      {80}  "The quick red fox jumped over the lazy brown dog."
      {82}  "The quick red fox jumped over the lazy brown dog."
      {84}  "The quick red fox jumped over the lazy brown dog."
      {86}  "The quick red fox jumped over the lazy brown dog."
      {88}  "The quick red fox jumped over the lazy brown dog."
      {90}  "The quick red fox jumped over the lazy brown dog."
      {92}  "The quick red fox jumped over the lazy brown dog."
      {94}  "The quick red fox jumped over the lazy brown dog."
      {96}  "The quick red fox jumped over the lazy brown dog."
      {98}  "The quick red fox jumped over the lazy brown dog."
     {100}  "The quick red fox jumped over the lazy brown dog."
     {102}  "The quick red fox jumped over the lazy brown dog."
     {104}  "The quick red fox jumped over the lazy brown dog."
     {106}  "The quick red fox jumped over the lazy brown dog."
     {108}  "The quick red fox jumped over the lazy brown dog."
     {110}  "The quick red fox jumped over the lazy brown dog."
     {112}  "The quick red fox jumped over the lazy brown dog."
     {114}  "The quick red fox jumped over the lazy brown dog."
     {116}  "The quick red fox jumped over the lazy brown dog."
     {118}  "The quick red fox jumped over the lazy brown dog."
     {120}  "The quick red fox jumped over the lazy brown dog."
     {122}  "The quick red fox jumped over the lazy brown dog."
     {124}  "The quick red fox jumped over the lazy brown dog."
     {126}  "The quick red fox jumped over the lazy brown dog."
     {128}  "The quick red fox jumped over the lazy brown dog."
     {130}  "The quick red fox jumped over the lazy brown dog."
     {132}  "The quick red fox jumped over the lazy brown dog."
     {134}  "The quick red fox jumped over the lazy brown dog."
     {136}  "The quick red fox jumped over the lazy brown dog."
     {138}  "The quick red fox jumped over the lazy brown dog."
     {140}  "The quick red fox jumped over the lazy brown dog."
     {142}  "The quick red fox jumped over the lazy brown dog."
     {144}  "The quick red fox jumped over the lazy brown dog."
     {146}  "The quick red fox jumped over the lazy brown dog."
     {148}  "The quick red fox jumped over the lazy brown dog."
     {150}  "The quick red fox jumped over the lazy brown dog."
     {152}  "The quick red fox jumped over the lazy brown dog."
     {154}  "The quick red fox jumped over the lazy brown dog."
     {156}  "The quick red fox jumped over the lazy brown dog."
     {158}  "The quick red fox jumped over the lazy brown dog."
     {160}  "The quick red fox jumped over the lazy brown dog."
     {162}  "The quick red fox jumped over the lazy brown dog."
     {164}  "The quick red fox jumped over the lazy brown dog."
     {166}  "The quick red fox jumped over the lazy brown dog."
     {168}  "The quick red fox jumped over the lazy brown dog."
     {170}  "The quick red fox jumped over the lazy brown dog."
     {172}  "The quick red fox jumped over the lazy brown dog."
     {174}  "The quick red fox jumped over the lazy brown dog."
     {176}  "The quick red fox jumped over the lazy brown dog."
     {178}  "The quick red fox jumped over the lazy brown dog."
     {180}  "The quick red fox jumped over the lazy brown dog."
     {182}  "The quick red fox jumped over the lazy brown dog."
     {184}  "The quick red fox jumped over the lazy brown dog."
     {186}  "The quick red fox jumped over the lazy brown dog."
     {188}  "The quick red fox jumped over the lazy brown dog."
     {190}  "The quick red fox jumped over the lazy brown dog."
     {192}  "The quick red fox jumped over the lazy brown dog."
     {194}  "The quick red fox jumped over the lazy brown dog."
     {196}  "The quick red fox jumped over the lazy brown dog."
     {198}  "The quick red fox jumped over the lazy brown dog."
     {200}  "The quick red fox jumped over the lazy brown dog."
     {202}  "The quick red fox jumped over the lazy brown dog."
     {204}  "The quick red fox jumped over the lazy brown dog."
     {206}  "The quick red fox jumped over the lazy brown dog."
     {208}  "The quick red fox jumped over the lazy brown dog."
     {210}  "The quick red fox jumped over the lazy brown dog."
     {212}  "The quick red fox jumped over the lazy brown dog."
     {214}  "The quick red fox jumped over the lazy brown dog."
     {216}  "The quick red fox jumped over the lazy brown dog."
     {218}  "The quick red fox jumped over the lazy brown dog."
     {220}  "The quick red fox jumped over the lazy brown dog."
     {222}  "The quick red fox jumped over the lazy brown dog."
     {224}  "The quick red fox jumped over the lazy brown dog."
     {226}  "The quick red fox jumped over the lazy brown dog."
     {228}  "The quick red fox jumped over the lazy brown dog."
     {230}  "The quick red fox jumped over the lazy brown dog."
     {232}  "The quick red fox jumped over the lazy brown dog."
     {234}  "The quick red fox jumped over the lazy brown dog."
     {236}  "The quick red fox jumped over the lazy brown dog."
     {238}  "The quick red fox jumped over the lazy brown dog."
     {240}  "The quick red fox jumped over the lazy brown dog."
     {242}  "The quick red fox jumped over the lazy brown dog."
     {244}  "The quick red fox jumped over the lazy brown dog."
     {246}  "The quick red fox jumped over the lazy brown dog."
     {"x"}  undefined
cycle 0
cycle 10
cycle 20
cycle 30
cycle 40
cycle 50
cycle 60
cycle 70
cycle 80
cycle 90
cycle 100
cycle 110
cycle 120
cycle 130
cycle 140
cycle 150
cycle 160
cycle 170
cycle 180
cycle 190
Tests run: 9, Failures: 0, Errors: 0, Skipped: 1, Time elapsed: 39.338 sec - in com.persistit.MVCCPruneBufferTest
Running com.persistit.ConfigurationTest
Tests run: 7, Failures: 0, Errors: 0, Skipped: 0, Time elapsed: 1.418 sec - in com.persistit.ConfigurationTest
Running com.persistit.ValueCacheUnitTest
test1 - done
test2 - done
test3  - 21 - done
Tests run: 3, Failures: 0, Errors: 0, Skipped: 0, Time elapsed: 0.063 sec - in com.persistit.ValueCacheUnitTest
Running com.persistit.Bug942669Test
Tests run: 2, Failures: 0, Errors: 0, Skipped: 1, Time elapsed: 3.625 sec - in com.persistit.Bug942669Test
Running com.persistit.Bug1064565Test
Tests run: 2, Failures: 0, Errors: 0, Skipped: 0, Time elapsed: 1.926 sec - in com.persistit.Bug1064565Test
Running com.persistit.VolumeStructureTest
Checking persistit(/home/jenkins/.jenkins/jobs/gluu-opendj4/workspace/opendj-sdk/persistit/core/target/junit3490291548745762998/persistit/persistit) 
  Faults:  0 Index pages/bytes: 1 / 0 Data pages/bytes: 3 / 140 LongRec pages/bytes: 0 / 0  MVV pages/records/bytes/antivalues: 0 / 0 / 0 / 0  Holes 0 Pages pruned 0
663 -- 663
663 -- 663
663 -- 663
663 -- 663
663 -- 663
663 -- 663
663 -- 663
663 -- 663
663 -- 663
Checking persistit(/home/jenkins/.jenkins/jobs/gluu-opendj4/workspace/opendj-sdk/persistit/core/target/junit14506956825737299801/persistit/persistit) 
  Faults:  0 Index pages/bytes: 1 / 0 Data pages/bytes: 3 / 140 LongRec pages/bytes: 0 / 0  MVV pages/records/bytes/antivalues: 0 / 0 / 0 / 0  Holes 0 Pages pruned 0
Tests run: 3, Failures: 0, Errors: 0, Skipped: 0, Time elapsed: 1.562 sec - in com.persistit.VolumeStructureTest
Running com.persistit.ScriptedKeyFilterTest
Tests run: 1, Failures: 0, Errors: 0, Skipped: 0, Time elapsed: 0.006 sec - in com.persistit.ScriptedKeyFilterTest
Running com.persistit.IntegrityCheckTest

  Tree persistit:mvv - Faults:  0 Index pages/bytes: 1 / 516 Data pages/bytes: 9 / 126,424 LongRec pages/bytes: 0 / 0  MVV pages/records/bytes/antivalues: 9 / 1,000 / 41,500 / 500  Holes 0 Pages pruned 0
  Tree persistit:mvv - Faults:  0 Index pages/bytes: 1 / 516 Data pages/bytes: 9 / 55,268 LongRec pages/bytes: 0 / 0  MVV pages/records/bytes/antivalues: 9 / 1,000 / 41,500 / 500  Holes 0 Pages pruned 9
  Tree persistit:mvv - Faults:  0 Index pages/bytes: 1 / 324 Data pages/bytes: 6 / 54,664 LongRec pages/bytes: 0 / 0  MVV pages/records/bytes/antivalues: 0 / 0 / 0 / 0  Holes 0 Pages pruned 0
  Tree persistit:primordial - Faults:  0 Index pages/bytes: 1 / 388 Data pages/bytes: 7 / 54,692 LongRec pages/bytes: 0 / 0  MVV pages/records/bytes/antivalues: 0 / 0 / 0 / 0  Holes 0 Pages pruned 0
  Tree persistit:mvv initial key too big at offset 1 for keyblock at 32 --[Page=8 type=Data rightSibling=9 status=vdr1 start=32 end=524 size=16384 alloc=736 slack=696 index=8 timestamp=1,723 generation=312] (path 5->8) depth=2
  Tree persistit:mvv left sibling final key is less than parent key (path 5->9) depth=2
  Tree persistit:mvv - Faults:  2 Index pages/bytes: 1 / 516 Data pages/bytes: 8 / 110,996 LongRec pages/bytes: 0 / 0  MVV pages/records/bytes/antivalues: 8 / 878 / 36,437 / 439  Holes 0 Pages pruned 0
Volume persistit - checking
  Tree persistit:_directory - Faults:  0 Index pages/bytes: 0 / 0 Data pages/bytes: 1 / 108 LongRec pages/bytes: 0 / 0  MVV pages/records/bytes/antivalues: 0 / 0 / 0 / 0  Holes 0 Pages pruned 0
  Tree persistit:_classIndex - Faults:  0 Index pages/bytes: 0 / 0 Data pages/bytes: 1 / 0 LongRec pages/bytes: 0 / 0  MVV pages/records/bytes/antivalues: 0 / 0 / 0 / 0  Holes 0 Pages pruned 0
  Tree persistit:mvv - Faults:  0 Index pages/bytes: 1 / 388 Data pages/bytes: 7 / 54,692 LongRec pages/bytes: 0 / 0  MVV pages/records/bytes/antivalues: 0 / 0 / 0 / 0  Holes 0 Pages pruned 0
  Tree persistit Page on garbage chain is referenced by multiple parents (path 11->7) depth=2
Volume persistit Faults:  1 Index pages/bytes: 1 / 388 Data pages/bytes: 9 / 54,800 LongRec pages/bytes: 0 / 0  MVV pages/records/bytes/antivalues: 0 / 0 / 0 / 0  Holes 0 Pages pruned 0
  Tree persistit:mvv invalid length in MVV at offset/length=7574/72 (path 5->8) depth=2
  Tree persistit:mvv left sibling final key is less than parent key (path 5->9) depth=2
  Tree persistit:mvv - Faults:  2 Index pages/bytes: 1 / 516 Data pages/bytes: 8 / 110,996 LongRec pages/bytes: 0 / 0  MVV pages/records/bytes/antivalues: 8 / 892 / 37,018 / 446  Holes 0 Pages pruned 0
  Tree persistit:mvv - Faults:  0 Index pages/bytes: 1 / 516 Data pages/bytes: 9 / 126,424 LongRec pages/bytes: 0 / 0  MVV pages/records/bytes/antivalues: 9 / 1,000 / 41,500 / 500  Holes 0 Pages pruned 0Checking persistit(/home/jenkins/.jenkins/jobs/gluu-opendj4/workspace/opendj-sdk/persistit/core/target/junit15258344872122390899/persistit/persistit) 
  Faults:  0 Index pages/bytes: 10 / 5,160 Data pages/bytes: 92 / 841,536 LongRec pages/bytes: 0 / 0  MVV pages/records/bytes/antivalues: 64 / 7,005 / 80,555 / 3,500  Holes 0 Pages pruned 0


Volume persistit - checking
  Tree persistit:_directory - Faults:  0 Index pages/bytes: 0 / 0 Data pages/bytes: 1 / 436 LongRec pages/bytes: 0 / 0  MVV pages/records/bytes/antivalues: 0 / 0 / 0 / 0  Holes 0 Pages pruned 0
  Tree persistit:_classIndex - Faults:  0 Index pages/bytes: 0 / 0 Data pages/bytes: 1 / 0 LongRec pages/bytes: 0 / 0  MVV pages/records/bytes/antivalues: 0 / 0 / 0 / 0  Holes 0 Pages pruned 0
  Tree persistit:mvv0 - Faults:  0 Index pages/bytes: 1 / 516 Data pages/bytes: 9 / 868 LongRec pages/bytes: 0 / 0  MVV pages/records/bytes/antivalues: 9 / 1,000 / 11,500 / 500  Holes 0 Pages pruned 9
  Tree persistit:mvv1 - Faults:  0 Index pages/bytes: 1 / 516 Data pages/bytes: 9 / 55,268 LongRec pages/bytes: 0 / 0  MVV pages/records/bytes/antivalues: 9 / 1,000 / 11,500 / 500  Holes 0 Pages pruned 9
  Tree persistit:mvv2 - Faults:  0 Index pages/bytes: 1 / 516 Data pages/bytes: 9 / 868 LongRec pages/bytes: 0 / 0  MVV pages/records/bytes/antivalues: 9 / 1,000 / 11,500 / 500  Holes 0 Pages pruned 9
  Tree persistit:mvv3 - Faults:  0 Index pages/bytes: 1 / 516 Data pages/bytes: 9 / 55,268 LongRec pages/bytes: 0 / 0  MVV pages/records/bytes/antivalues: 9 / 1,000 / 11,500 / 500  Holes 0 Pages pruned 9
  Tree persistit:mvv4 - Faults:  0 Index pages/bytes: 1 / 516 Data pages/bytes: 9 / 868 LongRec pages/bytes: 0 / 0  MVV pages/records/bytes/antivalues: 9 / 1,000 / 11,500 / 500  Holes 0 Pages pruned 9
  Tree persistit:mvv5 - Faults:  0 Index pages/bytes: 1 / 516 Data pages/bytes: 9 / 55,268 LongRec pages/bytes: 0 / 0  MVV pages/records/bytes/antivalues: 9 / 1,000 / 11,500 / 500  Holes 0 Pages pruned 9
  Tree persistit:mvv6 - Faults:  0 Index pages/bytes: 0 / 0 Data pages/bytes: 1 / 0 LongRec pages/bytes: 0 / 0  MVV pages/records/bytes/antivalues: 0 / 0 / 0 / 0  Holes 0 Pages pruned 0
  Tree persistit:mvv7 - Faults:  0 Index pages/bytes: 0 / 0 Data pages/bytes: 1 / 0 LongRec pages/bytes: 0 / 0  MVV pages/records/bytes/antivalues: 0 / 0 / 0 / 0  Holes 0 Pages pruned 0
  Tree persistit:mvv8 - Faults:  0 Index pages/bytes: 0 / 0 Data pages/bytes: 1 / 0 LongRec pages/bytes: 0 / 0  MVV pages/records/bytes/antivalues: 0 / 0 / 0 / 0  Holes 0 Pages pruned 0
  Tree persistit:mvv9 - Faults:  0 Index pages/bytes: 0 / 0 Data pages/bytes: 1 / 0 LongRec pages/bytes: 0 / 0  MVV pages/records/bytes/antivalues: 0 / 0 / 0 / 0  Holes 0 Pages pruned 0
Volume persistit Faults:  0 Index pages/bytes: 6 / 3,096 Data pages/bytes: 60 / 168,844 LongRec pages/bytes: 0 / 0  MVV pages/records/bytes/antivalues: 54 / 6,000 / 69,000 / 3,000  Holes 0 Pages pruned 54
Total Faults:  0 Index pages/bytes: 6 / 3,096 Data pages/bytes: 60 / 168,844 LongRec pages/bytes: 0 / 0  MVV pages/records/bytes/antivalues: 54 / 6,000 / 69,000 / 3,000  Holes 0 Pages pruned 54
3 aborted transactions were cleared by pruningTests run: 8, Failures: 0, Errors: 0, Skipped: 1, Time elapsed: 7.315 sec - in com.persistit.IntegrityCheckTest
Running com.persistit.Bug777918Test
Checking _system(/home/jenkins/.jenkins/jobs/gluu-opendj4/workspace/opendj-sdk/persistit/core/target/junit17109077155701079442/persistit/persistit_system) 
Checking persistit(/home/jenkins/.jenkins/jobs/gluu-opendj4/workspace/opendj-sdk/persistit/core/target/junit17109077155701079442/persistit/persistit) 
Checking _txn(/home/jenkins/.jenkins/jobs/gluu-opendj4/workspace/opendj-sdk/persistit/core/target/junit17109077155701079442/persistit/persistit_txn) 
  Faults:  0 Index pages/bytes: 1 / 13,104 Data pages/bytes: 824 / 12,000,272 LongRec pages/bytes: 0 / 0  MVV pages/records/bytes/antivalues: 0 / 0 / 0 / 0  Holes 0 Pages pruned 0
Checking _system(/home/jenkins/.jenkins/jobs/gluu-opendj4/workspace/opendj-sdk/persistit/core/target/junit17109077155701079442/persistit/persistit_system) 
Checking persistit(/home/jenkins/.jenkins/jobs/gluu-opendj4/workspace/opendj-sdk/persistit/core/target/junit17109077155701079442/persistit/persistit) 
Checking _txn(/home/jenkins/.jenkins/jobs/gluu-opendj4/workspace/opendj-sdk/persistit/core/target/junit17109077155701079442/persistit/persistit_txn) 
  Faults:  0 Index pages/bytes: 1 / 13,104 Data pages/bytes: 824 / 12,000,272 LongRec pages/bytes: 0 / 0  MVV pages/records/bytes/antivalues: 0 / 0 / 0 / 0  Holes 0 Pages pruned 0
Checking _system(/home/jenkins/.jenkins/jobs/gluu-opendj4/workspace/opendj-sdk/persistit/core/target/junit16216831837810470927/persistit/persistit_system) 
Checking persistit(/home/jenkins/.jenkins/jobs/gluu-opendj4/workspace/opendj-sdk/persistit/core/target/junit16216831837810470927/persistit/persistit) 
Checking _txn(/home/jenkins/.jenkins/jobs/gluu-opendj4/workspace/opendj-sdk/persistit/core/target/junit16216831837810470927/persistit/persistit_txn) 
  Faults:  0 Index pages/bytes: 1 / 6,544 Data pages/bytes: 414 / 6,000,248 LongRec pages/bytes: 0 / 0  MVV pages/records/bytes/antivalues: 0 / 0 / 0 / 0  Holes 0 Pages pruned 0
Checking _system(/home/jenkins/.jenkins/jobs/gluu-opendj4/workspace/opendj-sdk/persistit/core/target/junit16216831837810470927/persistit/persistit_system) 
Checking persistit(/home/jenkins/.jenkins/jobs/gluu-opendj4/workspace/opendj-sdk/persistit/core/target/junit16216831837810470927/persistit/persistit) 
Checking _txn(/home/jenkins/.jenkins/jobs/gluu-opendj4/workspace/opendj-sdk/persistit/core/target/junit16216831837810470927/persistit/persistit_txn) 
  Faults:  0 Index pages/bytes: 1 / 6,544 Data pages/bytes: 414 / 6,000,248 LongRec pages/bytes: 0 / 0  MVV pages/records/bytes/antivalues: 0 / 0 / 0 / 0  Holes 0 Pages pruned 0
Checking _system(/home/jenkins/.jenkins/jobs/gluu-opendj4/workspace/opendj-sdk/persistit/core/target/junit9043380728491318798/persistit/persistit_system) 
Checking persistit(/home/jenkins/.jenkins/jobs/gluu-opendj4/workspace/opendj-sdk/persistit/core/target/junit9043380728491318798/persistit/persistit) 
Checking _txn(/home/jenkins/.jenkins/jobs/gluu-opendj4/workspace/opendj-sdk/persistit/core/target/junit9043380728491318798/persistit/persistit_txn) 
  Faults:  0 Index pages/bytes: 1 / 14,336 Data pages/bytes: 901 / 13,145,984 LongRec pages/bytes: 0 / 0  MVV pages/records/bytes/antivalues: 488 / 95,497 / 1,050,518 / 0  Holes 0 Pages pruned 0
Checking _system(/home/jenkins/.jenkins/jobs/gluu-opendj4/workspace/opendj-sdk/persistit/core/target/junit9043380728491318798/persistit/persistit_system) 
Checking persistit(/home/jenkins/.jenkins/jobs/gluu-opendj4/workspace/opendj-sdk/persistit/core/target/junit9043380728491318798/persistit/persistit) 
Checking _txn(/home/jenkins/.jenkins/jobs/gluu-opendj4/workspace/opendj-sdk/persistit/core/target/junit9043380728491318798/persistit/persistit_txn) 
  Faults:  0 Index pages/bytes: 1 / 14,336 Data pages/bytes: 901 / 13,145,984 LongRec pages/bytes: 0 / 0  MVV pages/records/bytes/antivalues: 488 / 95,497 / 1,050,518 / 0  Holes 0 Pages pruned 0
[main] WARNING Recovery exception com.persistit.Bug777918Test$Bug777918Exception: Purposely stop transaction recovery at ts=100007
    	at com.persistit.Bug777918Test$TestCrashingRecoveryListener.startTransaction(Bug777918Test.java:245)
    	at com.persistit.TransactionPlayer.applyTransaction(TransactionPlayer.java:122)
    	at com.persistit.RecoveryManager.applyAllRecoveredTransactions(RecoveryManager.java:1531)
    	at com.persistit.Persistit.finishRecovery(Persistit.java:728)
    	at com.persistit.Persistit.initialize(Persistit.java:448)
    	at com.persistit.Bug777918Test.testMakeBranchTxnLongRecord(Bug777918Test.java:196)
    	at java.base/jdk.internal.reflect.NativeMethodAccessorImpl.invoke0(Native Method)
    	at java.base/jdk.internal.reflect.NativeMethodAccessorImpl.invoke(NativeMethodAccessorImpl.java:62)
    	at java.base/jdk.internal.reflect.DelegatingMethodAccessorImpl.invoke(DelegatingMethodAccessorImpl.java:43)
    	at java.base/java.lang.reflect.Method.invoke(Method.java:566)
    	at org.junit.runners.model.FrameworkMethod$1.runReflectiveCall(FrameworkMethod.java:59)
    	at org.junit.internal.runners.model.ReflectiveCallable.run(ReflectiveCallable.java:12)
    	at org.junit.runners.model.FrameworkMethod.invokeExplosively(FrameworkMethod.java:56)
    	at org.junit.internal.runners.statements.InvokeMethod.evaluate(InvokeMethod.java:17)
    	at org.junit.internal.runners.statements.RunBefores.evaluate(RunBefores.java:26)
    	at org.junit.internal.runners.statements.RunAfters.evaluate(RunAfters.java:27)
    	at org.junit.rules.ExternalResource$1.evaluate(ExternalResource.java:54)
    	at org.junit.runners.ParentRunner$3.evaluate(ParentRunner.java:306)
    	at org.junit.runners.BlockJUnit4ClassRunner$1.evaluate(BlockJUnit4ClassRunner.java:100)
    	at org.junit.runners.ParentRunner.runLeaf(ParentRunner.java:366)
    	at org.junit.runners.BlockJUnit4ClassRunner.runChild(BlockJUnit4ClassRunner.java:103)
    	at org.junit.runners.BlockJUnit4ClassRunner.runChild(BlockJUnit4ClassRunner.java:63)
    	at org.junit.runners.ParentRunner$4.run(ParentRunner.java:331)
    	at org.junit.runners.ParentRunner$1.schedule(ParentRunner.java:79)
    	at org.junit.runners.ParentRunner.runChildren(ParentRunner.java:329)
    	at org.junit.runners.ParentRunner.access$100(ParentRunner.java:66)
    	at org.junit.runners.ParentRunner$2.evaluate(ParentRunner.java:293)
    	at org.junit.runners.ParentRunner$3.evaluate(ParentRunner.java:306)
    	at org.junit.runners.ParentRunner.run(ParentRunner.java:413)
    	at org.apache.maven.surefire.junit4.JUnit4Provider.execute(JUnit4Provider.java:283)
    	at org.apache.maven.surefire.junit4.JUnit4Provider.executeWithRerun(JUnit4Provider.java:173)
    	at org.apache.maven.surefire.junit4.JUnit4Provider.executeTestSet(JUnit4Provider.java:153)
    	at org.apache.maven.surefire.junit4.JUnit4Provider.invoke(JUnit4Provider.java:128)
    	at org.apache.maven.surefire.booter.ForkedBooter.invokeProviderInSameClassLoader(ForkedBooter.java:203)
    	at org.apache.maven.surefire.booter.ForkedBooter.runSuitesInProcess(ForkedBooter.java:155)
    	at org.apache.maven.surefire.booter.ForkedBooter.main(ForkedBooter.java:103)
     at transaction TStatus 467,524,670{100,013}c
Checking _system(/home/jenkins/.jenkins/jobs/gluu-opendj4/workspace/opendj-sdk/persistit/core/target/junit8869608596585015564/persistit/persistit_system) 
Checking persistit(/home/jenkins/.jenkins/jobs/gluu-opendj4/workspace/opendj-sdk/persistit/core/target/junit8869608596585015564/persistit/persistit) 
Checking _txn(/home/jenkins/.jenkins/jobs/gluu-opendj4/workspace/opendj-sdk/persistit/core/target/junit8869608596585015564/persistit/persistit_txn) 
  Faults:  0 Index pages/bytes: 1 / 2,928 Data pages/bytes: 188 / 2,687,948 LongRec pages/bytes: 27,986 / 279,048,406  MVV pages/records/bytes/antivalues: 88 / 6,008 / 66,139 / 0  Holes 0 Pages pruned 0
Tests run: 4, Failures: 0, Errors: 0, Skipped: 0, Time elapsed: 15.628 sec - in com.persistit.Bug777918Test
Running com.persistit.WarmupTest
Tests run: 2, Failures: 0, Errors: 0, Skipped: 1, Time elapsed: 0.325 sec - in com.persistit.WarmupTest
Running com.persistit.ClassIndexTest
840 classes
Tests run: 6, Failures: 0, Errors: 0, Skipped: 0, Time elapsed: 1.454 sec - in com.persistit.ClassIndexTest
Running com.persistit.TreeBuilderTest
Sorted 50000
Sorted 100000
Sorted 150000
Sorted 200000
Sorted 250000
Sorted 300000
Merged 50000
Merged 100000
Merged 150000
Merged 200000
Merged 250000
Merged 300000
Sorted 50000
Sorted 100000
Duplicate key {-351672470}
Merged 50000
Duplicate key {709886647}
Duplicate key {1227463818}
Merged 99997
Tests run: 5, Failures: 0, Errors: 0, Skipped: 0, Time elapsed: 4.412 sec - in com.persistit.TreeBuilderTest
Running com.persistit.TreeTest2
[JOURNAL_FLUSHER] WARNING Journal flush operation took 2,959ms last 8 cycles average is 369ms
Tests run: 2, Failures: 0, Errors: 0, Skipped: 0, Time elapsed: 12.369 sec - in com.persistit.TreeTest2
Running com.persistit.CreateAndDeleteVolumeTest
[JOURNAL_COPIER] WARNING Missing volume hwdemo4(hwdemo4) referenced at journal address 1,000,017,290
[main] WARNING Recovery exception com.persistit.exception.UnderSpecifiedVolumeException: hwdemo4 at transaction TStatus 1,000,017,173{527}c
[main] WARNING com.persistit.exception.UnderSpecifiedVolumeException: hwdemo4 while pruning transaction record TStatus 1,000,017,173{527}c
[main] WARNING Missing volume hwdemo4(hwdemo4) referenced at journal address 1,000,033,938 (6 similar occurrences in 0 seconds)
[JOURNAL_COPIER] WARNING Missing volume hwdemo4(hwdemo4) referenced at journal address 1,000,017,290
[main] WARNING Recovery exception com.persistit.exception.UnderSpecifiedVolumeException: hwdemo3 at transaction TStatus 2,000,017,419{815}c
[main] WARNING com.persistit.exception.UnderSpecifiedVolumeException: hwdemo3 while pruning transaction record TStatus 2,000,017,419{815}c
[main] WARNING Missing volume hwdemo3(hwdemo3) referenced at journal address 2,000,034,184 (12 similar occurrences in 0 seconds)
[JOURNAL_COPIER] WARNING Missing volume hwdemo4(hwdemo4) referenced at journal address 1,000,017,290
[main] WARNING Recovery exception com.persistit.exception.UnderSpecifiedVolumeException: hwdemo2 at transaction TStatus 3,000,017,605{1,102}c
[main] WARNING com.persistit.exception.UnderSpecifiedVolumeException: hwdemo2 while pruning transaction record TStatus 3,000,017,605{1,102}c
[main] WARNING Missing volume hwdemo2(hwdemo2) referenced at journal address 3,000,050,790 (18 similar occurrences in 0 seconds)
[JOURNAL_COPIER] WARNING Missing volume hwdemo4(hwdemo4) referenced at journal address 1,000,017,290
[main] WARNING Recovery exception com.persistit.exception.UnderSpecifiedVolumeException: hwdemo1 at transaction TStatus 4,000,017,791{1,390}c
[main] WARNING com.persistit.exception.UnderSpecifiedVolumeException: hwdemo1 while pruning transaction record TStatus 4,000,017,791{1,390}c
[main] WARNING com.persistit.exception.VolumeNotFoundException: _system while pruning transaction record TStatus 4,000,017,791{1,390}c
[main] WARNING com.persistit.exception.VolumeNotFoundException: _system while pruning transaction record TStatus 4,000,017,791{1,390}c
[main] WARNING com.persistit.exception.VolumeNotFoundException: _system while pruning transaction record TStatus 4,000,017,791{1,390}c
[main] WARNING com.persistit.exception.VolumeNotFoundException: _system while pruning transaction record TStatus 5,000,017,977{1,679}c
[main] WARNING com.persistit.exception.VolumeNotFoundException: _system while pruning transaction record TStatus 4,000,017,791{1,390}c
[main] WARNING com.persistit.exception.VolumeNotFoundException: _system while pruning transaction record TStatus 5,000,017,977{1,679}c
[CLEANUP_MANAGER] WARNING com.persistit.exception.VolumeNotFoundException: _system while pruning transaction record TStatus 4,000,017,791{1,390}c
[CLEANUP_MANAGER] WARNING com.persistit.exception.VolumeNotFoundException: _system while pruning transaction record TStatus 5,000,017,977{1,679}c
[main] WARNING com.persistit.exception.VolumeNotFoundException: _system while pruning transaction record TStatus 4,000,017,791{1,390}c
[main] WARNING com.persistit.exception.VolumeNotFoundException: _system while pruning transaction record TStatus 5,000,017,977{1,679}c
[main] WARNING Missing volume hwdemo1(hwdemo1) referenced at journal address 4,000,034,556 (120 similar occurrences in 2 seconds)
Tests run: 3, Failures: 0, Errors: 0, Skipped: 2, Time elapsed: 3.691 sec - in com.persistit.CreateAndDeleteVolumeTest
Running com.persistit.Bug1041293Test
Tests run: 3, Failures: 0, Errors: 0, Skipped: 0, Time elapsed: 0.624 sec - in com.persistit.Bug1041293Test
Running com.persistit.Bug1003578Test
Tests run: 1, Failures: 0, Errors: 0, Skipped: 0, Time elapsed: 0.73 sec - in com.persistit.Bug1003578Test
Running com.persistit.TreeLifetimeTest
Tests run: 4, Failures: 0, Errors: 0, Skipped: 0, Time elapsed: 0.909 sec - in com.persistit.TreeLifetimeTest
Running com.persistit.Bug974589Test
Iteration 1 completed
Iteration 2 completed
Iteration 3 completed
Iteration 4 completed
Tests run: 1, Failures: 0, Errors: 0, Skipped: 0, Time elapsed: 1.143 sec - in com.persistit.Bug974589Test
Running com.persistit.Bug1022567Test
Tests run: 3, Failures: 0, Errors: 0, Skipped: 0, Time elapsed: 2.168 sec - in com.persistit.Bug1022567Test
Running com.persistit.BackupTaskTest

Waiting for checkpoint
Checkpoint Checkpoint 152,311c @ 2021-07-21 12:24:23 written
[CLEANUP_MANAGER] ERROR java.lang.IllegalStateException: Release not preceded by get
    	at com.persistit.Persistit.releaseExchange(Persistit.java:984)
    	at com.persistit.Persistit.releaseExchange(Persistit.java:944)
    	at com.persistit.TransactionPlayer.releaseExchange(TransactionPlayer.java:345)
    	at com.persistit.TransactionPlayer.applyTransactionUpdates(TransactionPlayer.java:198)
    	at com.persistit.TransactionPlayer.applyTransaction(TransactionPlayer.java:123)
    	at com.persistit.JournalManager.pruneObsoleteTransactions(JournalManager.java:1780)
    	at com.persistit.JournalManager.pruneObsoleteTransactions(JournalManager.java:1727)
    	at com.persistit.CleanupManager.poll(CleanupManager.java:162)
    	at com.persistit.CleanupManager.runTask(CleanupManager.java:89)
    	at com.persistit.IOTaskRunnable.run(IOTaskRunnable.java:144)
    	at java.base/java.lang.Thread.run(Thread.java:834)
    
Copying back pages from journal
437 pages copied
Total size of files in backup set: 16M
Backing up /home/jenkins/.jenkins/jobs/gluu-opendj4/workspace/opendj-sdk/persistit/core/target/junit13090819344851430564/persistit/persistit_system size=1,638K
Backing up /home/jenkins/.jenkins/jobs/gluu-opendj4/workspace/opendj-sdk/persistit/core/target/junit13090819344851430564/persistit/persistit_txn size=1,638K
Backing up /home/jenkins/.jenkins/jobs/gluu-opendj4/workspace/opendj-sdk/persistit/core/target/junit13090819344851430564/persistit/persistit size=3,277K
Backing up /home/jenkins/.jenkins/jobs/gluu-opendj4/workspace/opendj-sdk/persistit/core/target/junit13090819344851430564/persistit/persistit_journal.000000000000 size=9,010K
Backup of 4 files to /home/jenkins/.jenkins/jobs/gluu-opendj4/workspace/opendj-sdk/persistit/core/target/junit13090819344851430564/backup.zip completed
Unzipping files from /home/jenkins/.jenkins/jobs/gluu-opendj4/workspace/opendj-sdk/persistit/core/target/junit13090819344851430564/backup.zip size=16M
Unzipping /home/jenkins/.jenkins/jobs/gluu-opendj4/workspace/opendj-sdk/persistit/core/target/junit13090819344851430564/persistit/persistit_system
Unzipping /home/jenkins/.jenkins/jobs/gluu-opendj4/workspace/opendj-sdk/persistit/core/target/junit13090819344851430564/persistit/persistit_txn
Unzipping /home/jenkins/.jenkins/jobs/gluu-opendj4/workspace/opendj-sdk/persistit/core/target/junit13090819344851430564/persistit/persistit
Unzipping /home/jenkins/.jenkins/jobs/gluu-opendj4/workspace/opendj-sdk/persistit/core/target/junit13090819344851430564/persistit/persistit_journal.000000000000Checking _system(/home/jenkins/.jenkins/jobs/gluu-opendj4/workspace/opendj-sdk/persistit/core/target/junit13090819344851430564/persistit/persistit_system) 
Checking persistit(/home/jenkins/.jenkins/jobs/gluu-opendj4/workspace/opendj-sdk/persistit/core/target/junit13090819344851430564/persistit/persistit) 
Checking _txn(/home/jenkins/.jenkins/jobs/gluu-opendj4/workspace/opendj-sdk/persistit/core/target/junit13090819344851430564/persistit/persistit_txn) 
  Faults:  0 Index pages/bytes: 1 / 3,008 Data pages/bytes: 189 / 2,080,876 LongRec pages/bytes: 0 / 0  MVV pages/records/bytes/antivalues: 185 / 12,296 / 135,307 / 0  Holes 0 Pages pruned 0

Waiting for checkpoint
Checkpoint Checkpoint 802,587c @ 2021-07-21 12:24:29 written
Total size of files in backup set: 8,838K
Backing up /home/jenkins/.jenkins/jobs/gluu-opendj4/workspace/opendj-sdk/persistit/core/target/junit2422654679713791494/persistit/persistit_system size=1,638K
Backing up /home/jenkins/.jenkins/jobs/gluu-opendj4/workspace/opendj-sdk/persistit/core/target/junit2422654679713791494/persistit/persistit_txn size=1,638K
Backing up /home/jenkins/.jenkins/jobs/gluu-opendj4/workspace/opendj-sdk/persistit/core/target/junit2422654679713791494/persistit/persistit size=3,277K
Backing up /home/jenkins/.jenkins/jobs/gluu-opendj4/workspace/opendj-sdk/persistit/core/target/junit2422654679713791494/persistit/persistit_journal.000000000000 size=2,284K
Backup of 4 files to /tmp/backup5800280838484656417.zip completed
Unzipping files from /tmp/backup5800280838484656417.zip size=326K
Unzipping /home/jenkins/.jenkins/jobs/gluu-opendj4/workspace/opendj-sdk/persistit/core/target/junit2422654679713791494/persistit/persistit_system
Unzipping /home/jenkins/.jenkins/jobs/gluu-opendj4/workspace/opendj-sdk/persistit/core/target/junit2422654679713791494/persistit/persistit_txn
Unzipping /home/jenkins/.jenkins/jobs/gluu-opendj4/workspace/opendj-sdk/persistit/core/target/junit2422654679713791494/persistit/persistit
Unzipping /home/jenkins/.jenkins/jobs/gluu-opendj4/workspace/opendj-sdk/persistit/core/target/junit2422654679713791494/persistit/persistit_journal.000000000000Checking _system(/home/jenkins/.jenkins/jobs/gluu-opendj4/workspace/opendj-sdk/persistit/core/target/junit2422654679713791494/persistit/persistit_system) 
Checking persistit(/home/jenkins/.jenkins/jobs/gluu-opendj4/workspace/opendj-sdk/persistit/core/target/junit2422654679713791494/persistit/persistit) 
Checking _txn(/home/jenkins/.jenkins/jobs/gluu-opendj4/workspace/opendj-sdk/persistit/core/target/junit2422654679713791494/persistit/persistit_txn) 
  Faults:  0 Index pages/bytes: 1 / 2,384 Data pages/bytes: 154 / 2,201,408 LongRec pages/bytes: 0 / 0  MVV pages/records/bytes/antivalues: 0 / 0 / 0 / 0  Holes 0 Pages pruned 0
Tests run: 2, Failures: 0, Errors: 0, Skipped: 0, Time elapsed: 8.389 sec - in com.persistit.BackupTaskTest
Running com.persistit.ValueTest7
Tests run: 2, Failures: 0, Errors: 0, Skipped: 0, Time elapsed: 0.385 sec - in com.persistit.ValueTest7
Running com.persistit.Bug980292Test
Tests run: 1, Failures: 0, Errors: 0, Skipped: 0, Time elapsed: 0.393 sec - in com.persistit.Bug980292Test
Running com.persistit.TimelyResourceTest
71,575 entries, 67,589 rollbacks
No more versions
No more versions
No more versions
Tests run: 4, Failures: 0, Errors: 0, Skipped: 0, Time elapsed: 10.872 sec - in com.persistit.TimelyResourceTest
Running com.persistit.Bug706132Test
Tests run: 2, Failures: 0, Errors: 0, Skipped: 0, Time elapsed: 0.555 sec - in com.persistit.Bug706132Test
Running com.persistit.Bug889850Test
Tests run: 1, Failures: 0, Errors: 0, Skipped: 0, Time elapsed: 0.298 sec - in com.persistit.Bug889850Test
Running com.persistit.Bug882219Test
Tests run: 1, Failures: 0, Errors: 0, Skipped: 1, Time elapsed: 0.001 sec - in com.persistit.Bug882219Test
Running com.persistit.CleanupManagerTest
[CLEANUP_MANAGER] WARNING com.persistit.CleanupManagerTest$ExpectedException while performing cleanup action CleanupMockAction(123)
[CLEANUP_MANAGER] WARNING com.persistit.CleanupManagerTest$ExpectedException while performing cleanup action CleanupMockAction(123)
Exception in thread "CLEANUP_MANAGER" java.lang.AssertionError: expected:<100686> but was:<100793>
	at org.junit.Assert.fail(Assert.java:89)
	at org.junit.Assert.failNotEquals(Assert.java:835)
	at org.junit.Assert.assertEquals(Assert.java:647)
	at org.junit.Assert.assertEquals(Assert.java:633)
	at com.persistit.CleanupManagerTest$CleanupMockAction.performAction(CleanupManagerTest.java:54)
	at com.persistit.CleanupManager.poll(CleanupManager.java:172)
	at com.persistit.CleanupManager.runTask(CleanupManager.java:89)
	at com.persistit.IOTaskRunnable.run(IOTaskRunnable.java:144)
	at java.base/java.lang.Thread.run(Thread.java:834)
Tests run: 3, Failures: 0, Errors: 0, Skipped: 0, Time elapsed: 1.791 sec - in com.persistit.CleanupManagerTest
Running com.persistit.Bug996241Test
Tests run: 2, Failures: 0, Errors: 0, Skipped: 0, Time elapsed: 2.874 sec - in com.persistit.Bug996241Test
Running com.persistit.MediatedFileChannelTest
errors=0 interrupts=10 count=19491Tests run: 2, Failures: 0, Errors: 0, Skipped: 0, Time elapsed: 10.017 sec - in com.persistit.MediatedFileChannelTest
Running com.persistit.Bug1065677Test
Tests run: 1, Failures: 0, Errors: 0, Skipped: 0, Time elapsed: 0.738 sec - in com.persistit.Bug1065677Test
Running com.persistit.Bug918909Test
Tests run: 8, Failures: 0, Errors: 0, Skipped: 0, Time elapsed: 21.687 sec - in com.persistit.Bug918909Test
Running com.persistit.Bug912514Test
Tests run: 3, Failures: 0, Errors: 0, Skipped: 0, Time elapsed: 0.596 sec - in com.persistit.Bug912514Test
Running com.persistit.AccumulatorTest
Retry     0
Retry     1
Retry     2
Retry     3
Retry     4
Retry     5
Retry     6
Retry     7
Retry     8
Retry     9
Count per ms = 1  Nanos per call=10,504,270Tests run: 13, Failures: 0, Errors: 0, Skipped: 0, Time elapsed: 39.654 sec - in com.persistit.AccumulatorTest
Running com.persistit.Bug1041003Test
Expected: com.persistit.exception.PersistitIOException: Writing to file /home/jenkins/.jenkins/jobs/gluu-opendj4/workspace/opendj-sdk/persistit/core/target/junit18129900609608844758/persistit/persistit_journal.000000000001:java.io.IOException: injected
Tests run: 1, Failures: 0, Errors: 0, Skipped: 0, Time elapsed: 0.306 sec - in com.persistit.Bug1041003Test
Running com.persistit.Bug790709Test
Page 3 in volume persistit(/home/jenkins/.jenkins/jobs/gluu-opendj4/workspace/opendj-sdk/persistit/core/target/junit13942737719886251658/persistit/persistit) at index 3 timestamp=6,302 status=vd type=Data keys=1021
Page 4 in volume persistit(/home/jenkins/.jenkins/jobs/gluu-opendj4/workspace/opendj-sdk/persistit/core/target/junit13942737719886251658/persistit/persistit) at index 4 timestamp=12,453 status=vd type=Data keys=1021
Page 3 in volume persistit(/home/jenkins/.jenkins/jobs/gluu-opendj4/workspace/opendj-sdk/persistit/core/target/junit13942737719886251658/persistit/persistit) at index 3 timestamp=12,519 status=vd type=Data keys=1021
Page 4 in volume persistit(/home/jenkins/.jenkins/jobs/gluu-opendj4/workspace/opendj-sdk/persistit/core/target/junit13942737719886251658/persistit/persistit) at index 4 timestamp=12,519 status=vd type=Data keys=1020
Tests run: 2, Failures: 0, Errors: 0, Skipped: 0, Time elapsed: 0.412 sec - in com.persistit.Bug790709Test
Running com.persistit.InternalHashSetUnitTest
Tests run: 1, Failures: 0, Errors: 0, Skipped: 0, Time elapsed: 0.415 sec - in com.persistit.InternalHashSetUnitTest
Running com.persistit.AlertMonitorTest
Tests run: 3, Failures: 0, Errors: 0, Skipped: 0, Time elapsed: 2.098 sec - in com.persistit.AlertMonitorTest
Running com.persistit.Bug937877Test
Tests run: 1, Failures: 0, Errors: 0, Skipped: 0, Time elapsed: 0.293 sec - in com.persistit.Bug937877Test
Running com.persistit.TransactionIndexTest
Tests run: 8, Failures: 0, Errors: 0, Skipped: 0, Time elapsed: 5.07 sec - in com.persistit.TransactionIndexTest
Running com.persistit.AccumulatorMemoryTest
Tests run: 2, Failures: 0, Errors: 0, Skipped: 0, Time elapsed: 2.995 sec - in com.persistit.AccumulatorMemoryTest
Running com.persistit.InsertSequenceTest
Tests run: 3, Failures: 0, Errors: 0, Skipped: 0, Time elapsed: 2.899 sec - in com.persistit.InsertSequenceTest
Running com.persistit.Bug877656Test
Tests run: 2, Failures: 0, Errors: 0, Skipped: 0, Time elapsed: 0.341 sec - in com.persistit.Bug877656Test
Running com.persistit.Bug885477Test
Tests run: 2, Failures: 0, Errors: 0, Skipped: 0, Time elapsed: 0.408 sec - in com.persistit.Bug885477Test
Running com.persistit.ExchangeLockTest
Tests run: 8, Failures: 0, Errors: 0, Skipped: 0, Time elapsed: 9.248 sec - in com.persistit.ExchangeLockTest
Running com.persistit.TransactionAbandonedTest
[main] WARNING Transaction abandoned Transaction_100008077 depth=1 status=<ts=233 tc=ABORTED mvv=0> owner=NoReadNoWrite
[main] WARNING Transaction abandoned Transaction_100008080 depth=1 status=<ts=233 tc=ABORTED mvv=0> owner=ReadOnly
[main] WARNING Transaction abandoned Transaction_100008083 depth=1 status=<ts=233 tc=ABORTED mvv=0> owner=ReadAndWrite
Tests run: 3, Failures: 0, Errors: 0, Skipped: 0, Time elapsed: 1.006 sec - in com.persistit.TransactionAbandonedTest
Running com.persistit.IOFailureTest
[JOURNAL_FLUSHER] ERROR Journal write failure com.persistit.exception.PersistitIOException: Writing to file /home/jenkins/.jenkins/jobs/gluu-opendj4/workspace/opendj-sdk/persistit/core/target/junit1456307658112329833/persistit/persistit_journal.000000000001:java.io.IOException: Disk Full in /home/jenkins/.jenkins/jobs/gluu-opendj4/workspace/opendj-sdk/persistit/core/target/junit1456307658112329833/persistit/persistit_journal.000000000001 at offset 100,000
[PAGE_WRITER:16384] ERROR com.persistit.exception.PersistitIOException: Writing to file /home/jenkins/.jenkins/jobs/gluu-opendj4/workspace/opendj-sdk/persistit/core/target/junit1456307658112329833/persistit/persistit_journal.000000000001:java.io.IOException: Disk Full
Checking persistit(/home/jenkins/.jenkins/jobs/gluu-opendj4/workspace/opendj-sdk/persistit/core/target/junit1456307658112329833/persistit/persistit) 
  Faults:  0 Index pages/bytes: 3 / 22,552 Data pages/bytes: 1,412 / 20,644,052 LongRec pages/bytes: 0 / 0  MVV pages/records/bytes/antivalues: 0 / 0 / 0 / 0  Holes 0 Pages pruned 0
[main] ERROR Journal write failure com.persistit.exception.PersistitIOException: Writing to file /home/jenkins/.jenkins/jobs/gluu-opendj4/workspace/opendj-sdk/persistit/core/target/junit1456307658112329833/persistit/persistit_journal.000000000001:java.io.IOException: Disk Full in /home/jenkins/.jenkins/jobs/gluu-opendj4/workspace/opendj-sdk/persistit/core/target/junit1456307658112329833/persistit/persistit_journal.000000000001 at offset 100,000 (51 similar occurrences in 5 seconds)
[main] ERROR IOException java.io.IOException: Disk Full while extending persistit: old length=1,638,400, new length=3,276,800
Checking persistit(/home/jenkins/.jenkins/jobs/gluu-opendj4/workspace/opendj-sdk/persistit/core/target/junit2266459322841708886/persistit/persistit) 
  Faults:  0 Index pages/bytes: 1 / 2,176 Data pages/bytes: 139 / 2,007,260 LongRec pages/bytes: 0 / 0  MVV pages/records/bytes/antivalues: 0 / 0 / 0 / 0  Holes 0 Pages pruned 0
[main] ERROR Recovery failed due to com.persistit.exception.CorruptJournalException: End of file at JournalAddress 10,000,214 - the journal needs to be repaired or discarded
[main] ERROR IOException java.io.IOException: Read Failure while reading volume persistit(/home/jenkins/.jenkins/jobs/gluu-opendj4/workspace/opendj-sdk/persistit/core/target/junit11607988541387323568/persistit/persistit) page 5 into buffer # 1
[JOURNAL_FLUSHER] ERROR Journal write failure com.persistit.exception.PersistitIOException: Writing to file /home/jenkins/.jenkins/jobs/gluu-opendj4/workspace/opendj-sdk/persistit/core/target/junit13948005257326337068/persistit/persistit_journal.000000000001:java.io.IOException: Disk Full in /home/jenkins/.jenkins/jobs/gluu-opendj4/workspace/opendj-sdk/persistit/core/target/junit13948005257326337068/persistit/persistit_journal.000000000001 at offset 100,000
[main] WARNING Transaction neither committed nor rolled back Transaction_100008094 depth=1 status=<ts=278,921 tc=UNCOMMITTED mvv=981> owner=main
[main] ERROR com.persistit.exception.PersistitIOException: Writing to file /home/jenkins/.jenkins/jobs/gluu-opendj4/workspace/opendj-sdk/persistit/core/target/junit13948005257326337068/persistit/persistit_journal.000000000001:java.io.IOException: Disk Full
[main] ERROR Journal write failure com.persistit.exception.PersistitIOException: Writing to file /home/jenkins/.jenkins/jobs/gluu-opendj4/workspace/opendj-sdk/persistit/core/target/junit13948005257326337068/persistit/persistit_journal.000000000001:java.io.IOException: Disk Full in /home/jenkins/.jenkins/jobs/gluu-opendj4/workspace/opendj-sdk/persistit/core/target/junit13948005257326337068/persistit/persistit_journal.000000000001 at offset 100,000 (37 similar occurrences in 1 seconds)
[JOURNAL_COPIER] ERROR Exception java.io.IOException: Write Failure while writing volume persistit(/home/jenkins/.jenkins/jobs/gluu-opendj4/workspace/opendj-sdk/persistit/core/target/junit5139360703339381953/persistit/persistit) page 0
[JOURNAL_COPIER] WARNING Exception com.persistit.exception.PersistitIOException: java.io.IOException: Write Failure while copying volume persistit(/home/jenkins/.jenkins/jobs/gluu-opendj4/workspace/opendj-sdk/persistit/core/target/junit5139360703339381953/persistit/persistit) page 0 from journal address 17,311
[JOURNAL_COPIER] ERROR com.persistit.exception.PersistitIOException: java.io.IOException: Write Failure
[JOURNAL_COPIER] WARNING Exception com.persistit.exception.PersistitIOException: java.io.IOException: Write Failure while copying volume persistit(/home/jenkins/.jenkins/jobs/gluu-opendj4/workspace/opendj-sdk/persistit/core/target/junit5139360703339381953/persistit/persistit) page 0 from journal address 17,311
[JOURNAL_COPIER] WARNING Exception com.persistit.exception.PersistitIOException: java.io.IOException: Write Failure while copying volume persistit(/home/jenkins/.jenkins/jobs/gluu-opendj4/workspace/opendj-sdk/persistit/core/target/junit5139360703339381953/persistit/persistit) page 0 from journal address 17,311
[JOURNAL_COPIER] WARNING Exception com.persistit.exception.PersistitIOException: java.io.IOException: Write Failure while copying volume persistit(/home/jenkins/.jenkins/jobs/gluu-opendj4/workspace/opendj-sdk/persistit/core/target/junit5139360703339381953/persistit/persistit) page 0 from journal address 17,311
[main] ERROR Exception java.io.IOException: Write Failure while writing volume persistit(/home/jenkins/.jenkins/jobs/gluu-opendj4/workspace/opendj-sdk/persistit/core/target/junit5139360703339381953/persistit/persistit) page 0 (4 similar occurrences in 1 seconds)
Tests run: 8, Failures: 0, Errors: 0, Skipped: 0, Time elapsed: 23.108 sec - in com.persistit.IOFailureTest
Running com.persistit.RecoveryTest
Checking persistit(/home/jenkins/.jenkins/jobs/gluu-opendj4/workspace/opendj-sdk/persistit/core/target/junit13157543731164583053/persistit/persistit) 
  Faults:  0 Index pages/bytes: 501 / 8,096 Data pages/bytes: 1,006 / 10,696,604 LongRec pages/bytes: 0 / 0  MVV pages/records/bytes/antivalues: 1,005 / 10,500 / 10,549,500 / 10,500  Holes 0 Pages pruned 0
[JOURNAL_COPIER] ERROR Too many journal files 61
Checking persistit(/home/jenkins/.jenkins/jobs/gluu-opendj4/workspace/opendj-sdk/persistit/core/target/junit13157543731164583053/persistit/persistit) 
  Faults:  0 Index pages/bytes: 1,001 / 196 Data pages/bytes: 1,011 / 910,536 LongRec pages/bytes: 0 / 0  MVV pages/records/bytes/antivalues: 0 / 0 / 0 / 0  Holes 0 Pages pruned 0
Tests run: 11, Failures: 0, Errors: 0, Skipped: 1, Time elapsed: 20.041 sec - in com.persistit.RecoveryTest
Running com.persistit.MVVTest
Tests run: 32, Failures: 0, Errors: 0, Skipped: 0, Time elapsed: 0.008 sec - in com.persistit.MVVTest
Running com.persistit.Bug1058254Test
Tests run: 1, Failures: 0, Errors: 0, Skipped: 0, Time elapsed: 0.215 sec - in com.persistit.Bug1058254Test
Running com.persistit.Bug911849Test
Tests run: 1, Failures: 0, Errors: 0, Skipped: 0, Time elapsed: 14.312 sec - in com.persistit.Bug911849Test
Running com.persistit.MVCCPruneTest
[main] WARNING Transaction neither committed nor rolled back Transaction_100008220 depth=1 status=<ts=184 tc=UNCOMMITTED mvv=1> owner=main
Tests run: 14, Failures: 0, Errors: 0, Skipped: 0, Time elapsed: 2.84 sec - in com.persistit.MVCCPruneTest
Running com.persistit.TransactionTest2
Computing balance
Starting balance is 0
[TransactionThread_3] WARNING Transaction neither committed nor rolled back Transaction_100008230 depth=1 status=<ts=1,883 tc=UNCOMMITTED mvv=0> owner=TransactionThread_3
[TransactionThread_5] WARNING Transaction neither committed nor rolled back Transaction_100008233 depth=1 status=<ts=5,078 tc=UNCOMMITTED mvv=0> owner=TransactionThread_5
[TransactionThread_7] WARNING Transaction neither committed nor rolled back Transaction_100008234 depth=1 status=<ts=9,484 tc=UNCOMMITTED mvv=0> owner=TransactionThread_7
[TransactionThread_9] WARNING Transaction neither committed nor rolled back Transaction_100008236 depth=1 status=<ts=12,349 tc=UNCOMMITTED mvv=0> owner=TransactionThread_9
[TransactionThread_11] WARNING Transaction neither committed nor rolled back Transaction_100008238 depth=1 status=<ts=15,648 tc=UNCOMMITTED mvv=1> owner=TransactionThread_11
[TransactionThread_13] WARNING Transaction neither committed nor rolled back Transaction_100008240 depth=1 status=<ts=19,230 tc=UNCOMMITTED mvv=1> owner=TransactionThread_13
[TransactionThread_2] WARNING Transaction neither committed nor rolled back Transaction_100008229 depth=1 status=<ts=25,865 tc=UNCOMMITTED mvv=1> owner=TransactionThread_2
[TransactionThread_6] WARNING Transaction neither committed nor rolled back Transaction_100008232 depth=1 status=<ts=28,465 tc=UNCOMMITTED mvv=1> owner=TransactionThread_6
[TransactionThread_10] WARNING Transaction neither committed nor rolled back Transaction_100008237 depth=1 status=<ts=34,329 tc=UNCOMMITTED mvv=1> owner=TransactionThread_10
[TransactionThread_14] WARNING Transaction neither committed nor rolled back Transaction_100008241 depth=1 status=<ts=40,121 tc=UNCOMMITTED mvv=0> owner=TransactionThread_14
[TransactionThread_17] WARNING Transaction neither committed nor rolled back Transaction_100008244 depth=1 status=<ts=45,775 tc=UNCOMMITTED mvv=1> owner=TransactionThread_17
[TransactionThread_19] WARNING Transaction neither committed nor rolled back Transaction_100008246 depth=1 status=<ts=51,690 tc=UNCOMMITTED mvv=0> owner=TransactionThread_19
[TransactionThread_21] WARNING Transaction neither committed nor rolled back Transaction_100008248 depth=1 status=<ts=57,449 tc=UNCOMMITTED mvv=0> owner=TransactionThread_21
[TransactionThread_4] WARNING Transaction neither committed nor rolled back Transaction_100008231 depth=1 status=<ts=70,048 tc=UNCOMMITTED mvv=1> owner=TransactionThread_4
[TransactionThread_12] WARNING Transaction neither committed nor rolled back Transaction_100008239 depth=1 status=<ts=76,866 tc=UNCOMMITTED mvv=1> owner=TransactionThread_12
[TransactionThread_18] WARNING Transaction neither committed nor rolled back Transaction_100008245 depth=1 status=<ts=84,200 tc=UNCOMMITTED mvv=1> owner=TransactionThread_18
[TransactionThread_22] WARNING Transaction neither committed nor rolled back Transaction_100008249 depth=1 status=<ts=92,393 tc=UNCOMMITTED mvv=0> owner=TransactionThread_22
[TransactionThread_29] WARNING Transaction neither committed nor rolled back Transaction_100008256 depth=1 status=<ts=117,522 tc=UNCOMMITTED mvv=0> owner=TransactionThread_29
[TransactionThread_8] WARNING Transaction neither committed nor rolled back Transaction_100008235 depth=1 status=<ts=129,427 tc=UNCOMMITTED mvv=1> owner=TransactionThread_8
[TransactionThread_20] WARNING Transaction neither committed nor rolled back Transaction_100008247 depth=1 status=<ts=138,418 tc=UNCOMMITTED mvv=0> owner=TransactionThread_20
[TransactionThread_26] WARNING Transaction neither committed nor rolled back Transaction_100008253 depth=1 status=<ts=147,619 tc=UNCOMMITTED mvv=0> owner=TransactionThread_26
[TransactionThread_30] WARNING Transaction neither committed nor rolled back Transaction_100008257 depth=1 status=<ts=155,597 tc=UNCOMMITTED mvv=1> owner=TransactionThread_30
[TransactionThread_33] WARNING Transaction neither committed nor rolled back Transaction_100008260 depth=1 status=<ts=163,971 tc=UNCOMMITTED mvv=0> owner=TransactionThread_33
[TransactionThread_35] WARNING Transaction neither committed nor rolled back Transaction_100008262 depth=1 status=<ts=172,612 tc=UNCOMMITTED mvv=1> owner=TransactionThread_35
[TransactionThread_37] WARNING Transaction neither committed nor rolled back Transaction_100008264 depth=1 status=<ts=180,853 tc=UNCOMMITTED mvv=0> owner=TransactionThread_37
[TransactionThread_16] WARNING Transaction neither committed nor rolled back Transaction_100008243 depth=1 status=<ts=196,328 tc=UNCOMMITTED mvv=1> owner=TransactionThread_16
[TransactionThread_28] WARNING Transaction neither committed nor rolled back Transaction_100008255 depth=1 status=<ts=203,388 tc=UNCOMMITTED mvv=1> owner=TransactionThread_28
[TransactionThread_34] WARNING Transaction neither committed nor rolled back Transaction_100008261 depth=1 status=<ts=211,898 tc=UNCOMMITTED mvv=0> owner=TransactionThread_34
[TransactionThread_38] WARNING Transaction neither committed nor rolled back Transaction_100008265 depth=1 status=<ts=219,327 tc=UNCOMMITTED mvv=0> owner=TransactionThread_38
[TransactionThread_41] WARNING Transaction neither committed nor rolled back Transaction_100008268 depth=1 status=<ts=228,098 tc=UNCOMMITTED mvv=0> owner=TransactionThread_41
[TransactionThread_43] WARNING Transaction neither committed nor rolled back Transaction_100008270 depth=1 status=<ts=234,516 tc=UNCOMMITTED mvv=0> owner=TransactionThread_43
[TransactionThread_45] WARNING Transaction neither committed nor rolled back Transaction_100008272 depth=1 status=<ts=241,662 tc=UNCOMMITTED mvv=1> owner=TransactionThread_45
[TransactionThread_24] WARNING Transaction neither committed nor rolled back Transaction_100008251 depth=1 status=<ts=257,591 tc=UNCOMMITTED mvv=1> owner=TransactionThread_24
[TransactionThread_36] WARNING Transaction neither committed nor rolled back Transaction_100008263 depth=1 status=<ts=264,789 tc=UNCOMMITTED mvv=1> owner=TransactionThread_36
[TransactionThread_42] WARNING Transaction neither committed nor rolled back Transaction_100008269 depth=1 status=<ts=269,050 tc=UNCOMMITTED mvv=1> owner=TransactionThread_42
[TransactionThread_46] WARNING Transaction neither committed nor rolled back Transaction_100008273 depth=1 status=<ts=273,829 tc=UNCOMMITTED mvv=0> owner=TransactionThread_46
[TransactionThread_51] WARNING Transaction neither committed nor rolled back Transaction_100008278 depth=1 status=<ts=288,892 tc=UNCOMMITTED mvv=0> owner=TransactionThread_51
[TransactionThread_53] WARNING Transaction neither committed nor rolled back Transaction_100008280 depth=1 status=<ts=299,189 tc=UNCOMMITTED mvv=0> owner=TransactionThread_53
[TransactionThread_32] WARNING Transaction neither committed nor rolled back Transaction_100008259 depth=1 status=<ts=315,401 tc=UNCOMMITTED mvv=1> owner=TransactionThread_32
[TransactionThread_44] WARNING Transaction neither committed nor rolled back Transaction_100008271 depth=1 status=<ts=322,349 tc=UNCOMMITTED mvv=1> owner=TransactionThread_44
[TransactionThread_50] WARNING Transaction neither committed nor rolled back Transaction_100008277 depth=1 status=<ts=326,419 tc=UNCOMMITTED mvv=0> owner=TransactionThread_50
[TransactionThread_54] WARNING Transaction neither committed nor rolled back Transaction_100008281 depth=1 status=<ts=330,330 tc=UNCOMMITTED mvv=1> owner=TransactionThread_54
[TransactionThread_57] WARNING Transaction neither committed nor rolled back Transaction_100008284 depth=1 status=<ts=334,051 tc=UNCOMMITTED mvv=0> owner=TransactionThread_57
[TransactionThread_59] WARNING Transaction neither committed nor rolled back Transaction_100008286 depth=1 status=<ts=338,847 tc=UNCOMMITTED mvv=1> owner=TransactionThread_59
[TransactionThread_61] WARNING Transaction neither committed nor rolled back Transaction_100008288 depth=1 status=<ts=343,217 tc=UNCOMMITTED mvv=0> owner=TransactionThread_61
[TransactionThread_40] WARNING Transaction neither committed nor rolled back Transaction_100008267 depth=1 status=<ts=351,970 tc=UNCOMMITTED mvv=1> owner=TransactionThread_40
[TransactionThread_52] WARNING Transaction neither committed nor rolled back Transaction_100008279 depth=1 status=<ts=356,370 tc=UNCOMMITTED mvv=0> owner=TransactionThread_52
[TransactionThread_58] WARNING Transaction neither committed nor rolled back Transaction_100008285 depth=1 status=<ts=361,253 tc=UNCOMMITTED mvv=0> owner=TransactionThread_58
[TransactionThread_65] WARNING Transaction neither committed nor rolled back Transaction_100008292 depth=1 status=<ts=371,419 tc=UNCOMMITTED mvv=0> owner=TransactionThread_65
[TransactionThread_69] WARNING Transaction neither committed nor rolled back Transaction_100008296 depth=1 status=<ts=380,575 tc=UNCOMMITTED mvv=1> owner=TransactionThread_69
[TransactionThread_48] WARNING Transaction neither committed nor rolled back Transaction_100008275 depth=1 status=<ts=395,157 tc=UNCOMMITTED mvv=1> owner=TransactionThread_48
[TransactionThread_60] WARNING Transaction neither committed nor rolled back Transaction_100008287 depth=1 status=<ts=402,950 tc=UNCOMMITTED mvv=0> owner=TransactionThread_60
[TransactionThread_66] WARNING Transaction neither committed nor rolled back Transaction_100008293 depth=1 status=<ts=413,491 tc=UNCOMMITTED mvv=0> owner=TransactionThread_66
[TransactionThread_70] WARNING Transaction neither committed nor rolled back Transaction_100008297 depth=1 status=<ts=426,817 tc=UNCOMMITTED mvv=0> owner=TransactionThread_70
[TransactionThread_73] WARNING Transaction neither committed nor rolled back Transaction_100008300 depth=1 status=<ts=439,231 tc=UNCOMMITTED mvv=1> owner=TransactionThread_73
[TransactionThread_75] WARNING Transaction neither committed nor rolled back Transaction_100008302 depth=1 status=<ts=450,788 tc=UNCOMMITTED mvv=1> owner=TransactionThread_75
[TransactionThread_77] WARNING Transaction neither committed nor rolled back Transaction_100008304 depth=1 status=<ts=462,798 tc=UNCOMMITTED mvv=0> owner=TransactionThread_77
[TransactionThread_56] WARNING Transaction neither committed nor rolled back Transaction_100008283 depth=1 status=<ts=487,129 tc=UNCOMMITTED mvv=1> owner=TransactionThread_56
[TransactionThread_68] WARNING Transaction neither committed nor rolled back Transaction_100008295 depth=1 status=<ts=499,336 tc=UNCOMMITTED mvv=0> owner=TransactionThread_68
[TransactionThread_74] WARNING Transaction neither committed nor rolled back Transaction_100008301 depth=1 status=<ts=512,147 tc=UNCOMMITTED mvv=0> owner=TransactionThread_74
[TransactionThread_78] WARNING Transaction neither committed nor rolled back Transaction_100008305 depth=1 status=<ts=522,460 tc=UNCOMMITTED mvv=1> owner=TransactionThread_78
[TransactionThread_81] WARNING Transaction neither committed nor rolled back Transaction_100008308 depth=1 status=<ts=533,608 tc=UNCOMMITTED mvv=1> owner=TransactionThread_81
[TransactionThread_83] WARNING Transaction neither committed nor rolled back Transaction_100008310 depth=1 status=<ts=545,955 tc=UNCOMMITTED mvv=1> owner=TransactionThread_83
[TransactionThread_85] WARNING Transaction neither committed nor rolled back Transaction_100008312 depth=1 status=<ts=556,777 tc=UNCOMMITTED mvv=0> owner=TransactionThread_85
[TransactionThread_76] WARNING Transaction neither committed nor rolled back Transaction_100008303 depth=1 status=<ts=587,953 tc=UNCOMMITTED mvv=1> owner=TransactionThread_76
[TransactionThread_82] WARNING Transaction neither committed nor rolled back Transaction_100008309 depth=1 status=<ts=599,057 tc=UNCOMMITTED mvv=1> owner=TransactionThread_82
[TransactionThread_86] WARNING Transaction neither committed nor rolled back Transaction_100008313 depth=1 status=<ts=608,889 tc=UNCOMMITTED mvv=0> owner=TransactionThread_86
[TransactionThread_89] WARNING Transaction neither committed nor rolled back Transaction_100008316 depth=1 status=<ts=618,843 tc=UNCOMMITTED mvv=1> owner=TransactionThread_89
[TransactionThread_91] WARNING Transaction neither committed nor rolled back Transaction_100008318 depth=1 status=<ts=628,950 tc=UNCOMMITTED mvv=0> owner=TransactionThread_91
[TransactionThread_93] WARNING Transaction neither committed nor rolled back Transaction_100008320 depth=1 status=<ts=640,624 tc=UNCOMMITTED mvv=1> owner=TransactionThread_93
[TransactionThread_72] WARNING Transaction neither committed nor rolled back Transaction_100008299 depth=1 status=<ts=661,543 tc=UNCOMMITTED mvv=1> owner=TransactionThread_72
[TransactionThread_84] WARNING Transaction neither committed nor rolled back Transaction_100008311 depth=1 status=<ts=672,301 tc=UNCOMMITTED mvv=0> owner=TransactionThread_84
[TransactionThread_90] WARNING Transaction neither committed nor rolled back Transaction_100008317 depth=1 status=<ts=681,944 tc=UNCOMMITTED mvv=0> owner=TransactionThread_90
[TransactionThread_97] WARNING Transaction neither committed nor rolled back Transaction_100008324 depth=1 status=<ts=700,488 tc=UNCOMMITTED mvv=0> owner=TransactionThread_97
[TransactionThread_99] WARNING Transaction neither committed nor rolled back Transaction_100008326 depth=1 status=<ts=710,677 tc=UNCOMMITTED mvv=1> owner=TransactionThread_99
[TransactionThread_101] WARNING Transaction neither committed nor rolled back Transaction_100008328 depth=1 status=<ts=721,876 tc=UNCOMMITTED mvv=0> owner=TransactionThread_101
[TransactionThread_80] WARNING Transaction neither committed nor rolled back Transaction_100008307 depth=1 status=<ts=742,719 tc=UNCOMMITTED mvv=1> owner=TransactionThread_80
[TransactionThread_92] WARNING Transaction neither committed nor rolled back Transaction_100008319 depth=1 status=<ts=751,987 tc=UNCOMMITTED mvv=0> owner=TransactionThread_92
[TransactionThread_98] WARNING Transaction neither committed nor rolled back Transaction_100008325 depth=1 status=<ts=761,788 tc=UNCOMMITTED mvv=0> owner=TransactionThread_98
[TransactionThread_102] WARNING Transaction neither committed nor rolled back Transaction_100008329 depth=1 status=<ts=772,915 tc=UNCOMMITTED mvv=0> owner=TransactionThread_102
[TransactionThread_105] WARNING Transaction neither committed nor rolled back Transaction_100008332 depth=1 status=<ts=781,397 tc=UNCOMMITTED mvv=1> owner=TransactionThread_105
[TransactionThread_107] WARNING Transaction neither committed nor rolled back Transaction_100008334 depth=1 status=<ts=790,047 tc=UNCOMMITTED mvv=0> owner=TransactionThread_107
[TransactionThread_109] WARNING Transaction neither committed nor rolled back Transaction_100008336 depth=1 status=<ts=793,367 tc=UNCOMMITTED mvv=0> owner=TransactionThread_109
[TransactionThread_88] WARNING Transaction neither committed nor rolled back Transaction_100008315 depth=1 status=<ts=812,375 tc=UNCOMMITTED mvv=1> owner=TransactionThread_88
[TransactionThread_100] WARNING Transaction neither committed nor rolled back Transaction_100008327 depth=1 status=<ts=822,160 tc=UNCOMMITTED mvv=0> owner=TransactionThread_100
[TransactionThread_106] WARNING Transaction neither committed nor rolled back Transaction_100008333 depth=1 status=<ts=833,767 tc=UNCOMMITTED mvv=1> owner=TransactionThread_106
[TransactionThread_110] WARNING Transaction neither committed nor rolled back Transaction_100008337 depth=1 status=<ts=844,824 tc=UNCOMMITTED mvv=1> owner=TransactionThread_110
[TransactionThread_115] WARNING Transaction neither committed nor rolled back Transaction_100008342 depth=1 status=<ts=865,519 tc=UNCOMMITTED mvv=0> owner=TransactionThread_115
[TransactionThread_117] WARNING Transaction neither committed nor rolled back Transaction_100008344 depth=1 status=<ts=877,420 tc=UNCOMMITTED mvv=1> owner=TransactionThread_117
[TransactionThread_96] WARNING Transaction neither committed nor rolled back Transaction_100008323 depth=1 status=<ts=897,442 tc=UNCOMMITTED mvv=0> owner=TransactionThread_96
[TransactionThread_108] WARNING Transaction neither committed nor rolled back Transaction_100008335 depth=1 status=<ts=908,831 tc=UNCOMMITTED mvv=0> owner=TransactionThread_108
[TransactionThread_114] WARNING Transaction neither committed nor rolled back Transaction_100008341 depth=1 status=<ts=920,643 tc=UNCOMMITTED mvv=0> owner=TransactionThread_114
[TransactionThread_118] WARNING Transaction neither committed nor rolled back Transaction_100008345 depth=1 status=<ts=930,934 tc=UNCOMMITTED mvv=0> owner=TransactionThread_118
[TransactionThread_121] WARNING Transaction neither committed nor rolled back Transaction_100008348 depth=1 status=<ts=941,483 tc=UNCOMMITTED mvv=1> owner=TransactionThread_121
[TransactionThread_123] WARNING Transaction neither committed nor rolled back Transaction_100008350 depth=1 status=<ts=951,018 tc=UNCOMMITTED mvv=1> owner=TransactionThread_123
[TransactionThread_125] WARNING Transaction neither committed nor rolled back Transaction_100008352 depth=1 status=<ts=960,331 tc=UNCOMMITTED mvv=0> owner=TransactionThread_125
[TransactionThread_104] WARNING Transaction neither committed nor rolled back Transaction_100008331 depth=1 status=<ts=977,163 tc=UNCOMMITTED mvv=1> owner=TransactionThread_104
[TransactionThread_116] WARNING Transaction neither committed nor rolled back Transaction_100008343 depth=1 status=<ts=987,309 tc=UNCOMMITTED mvv=0> owner=TransactionThread_116
[TransactionThread_122] WARNING Transaction neither committed nor rolled back Transaction_100008349 depth=1 status=<ts=997,259 tc=UNCOMMITTED mvv=0> owner=TransactionThread_122
[TransactionThread_126] WARNING Transaction neither committed nor rolled back Transaction_100008353 depth=1 status=<ts=1,007,614 tc=UNCOMMITTED mvv=0> owner=TransactionThread_126
[TransactionThread_131] WARNING Transaction neither committed nor rolled back Transaction_100008358 depth=1 status=<ts=1,029,280 tc=UNCOMMITTED mvv=1> owner=TransactionThread_131
[TransactionThread_112] WARNING Transaction neither committed nor rolled back Transaction_100008339 depth=1 status=<ts=1,062,085 tc=UNCOMMITTED mvv=1> owner=TransactionThread_112
[TransactionThread_124] WARNING Transaction neither committed nor rolled back Transaction_100008351 depth=1 status=<ts=1,071,942 tc=UNCOMMITTED mvv=1> owner=TransactionThread_124
[TransactionThread_130] WARNING Transaction neither committed nor rolled back Transaction_100008357 depth=1 status=<ts=1,081,333 tc=UNCOMMITTED mvv=1> owner=TransactionThread_130
[TransactionThread_134] WARNING Transaction neither committed nor rolled back Transaction_100008361 depth=1 status=<ts=1,091,498 tc=UNCOMMITTED mvv=0> owner=TransactionThread_134
[TransactionThread_137] WARNING Transaction neither committed nor rolled back Transaction_100008364 depth=1 status=<ts=1,102,207 tc=UNCOMMITTED mvv=1> owner=TransactionThread_137
[TransactionThread_139] WARNING Transaction neither committed nor rolled back Transaction_100008366 depth=1 status=<ts=1,113,592 tc=UNCOMMITTED mvv=1> owner=TransactionThread_139
[TransactionThread_141] WARNING Transaction neither committed nor rolled back Transaction_100008368 depth=1 status=<ts=1,123,960 tc=UNCOMMITTED mvv=0> owner=TransactionThread_141
[TransactionThread_120] WARNING Transaction neither committed nor rolled back Transaction_100008347 depth=1 status=<ts=1,144,917 tc=UNCOMMITTED mvv=1> owner=TransactionThread_120
[TransactionThread_132] WARNING Transaction neither committed nor rolled back Transaction_100008359 depth=1 status=<ts=1,155,709 tc=UNCOMMITTED mvv=0> owner=TransactionThread_132
[TransactionThread_138] WARNING Transaction neither committed nor rolled back Transaction_100008365 depth=1 status=<ts=1,168,305 tc=UNCOMMITTED mvv=0> owner=TransactionThread_138
[TransactionThread_142] WARNING Transaction neither committed nor rolled back Transaction_100008369 depth=1 status=<ts=1,181,062 tc=UNCOMMITTED mvv=1> owner=TransactionThread_142
[TransactionThread_145] WARNING Transaction neither committed nor rolled back Transaction_100008372 depth=1 status=<ts=1,192,662 tc=UNCOMMITTED mvv=1> owner=TransactionThread_145
[TransactionThread_147] WARNING Transaction neither committed nor rolled back Transaction_100008374 depth=1 status=<ts=1,204,518 tc=UNCOMMITTED mvv=0> owner=TransactionThread_147
[TransactionThread_149] WARNING Transaction neither committed nor rolled back Transaction_100008376 depth=1 status=<ts=1,211,410 tc=UNCOMMITTED mvv=0> owner=TransactionThread_149
[TransactionThread_128] WARNING Transaction neither committed nor rolled back Transaction_100008355 depth=1 status=<ts=1,237,210 tc=UNCOMMITTED mvv=0> owner=TransactionThread_128
[TransactionThread_140] WARNING Transaction neither committed nor rolled back Transaction_100008367 depth=1 status=<ts=1,248,753 tc=UNCOMMITTED mvv=1> owner=TransactionThread_140
[TransactionThread_146] WARNING Transaction neither committed nor rolled back Transaction_100008373 depth=1 status=<ts=1,260,175 tc=UNCOMMITTED mvv=0> owner=TransactionThread_146
[TransactionThread_150] WARNING Transaction neither committed nor rolled back Transaction_100008377 depth=1 status=<ts=1,271,689 tc=UNCOMMITTED mvv=1> owner=TransactionThread_150
[TransactionThread_153] WARNING Transaction neither committed nor rolled back Transaction_100008380 depth=1 status=<ts=1,283,786 tc=UNCOMMITTED mvv=1> owner=TransactionThread_153
[TransactionThread_155] WARNING Transaction neither committed nor rolled back Transaction_100008382 depth=1 status=<ts=1,295,454 tc=UNCOMMITTED mvv=0> owner=TransactionThread_155
[TransactionThread_157] WARNING Transaction neither committed nor rolled back Transaction_100008384 depth=1 status=<ts=1,307,239 tc=UNCOMMITTED mvv=1> owner=TransactionThread_157
[TransactionThread_136] WARNING Transaction neither committed nor rolled back Transaction_100008363 depth=1 status=<ts=1,332,330 tc=UNCOMMITTED mvv=1> owner=TransactionThread_136
[TransactionThread_148] WARNING Transaction neither committed nor rolled back Transaction_100008375 depth=1 status=<ts=1,343,438 tc=UNCOMMITTED mvv=0> owner=TransactionThread_148
[TransactionThread_158] WARNING Transaction neither committed nor rolled back Transaction_100008385 depth=1 status=<ts=1,365,560 tc=UNCOMMITTED mvv=0> owner=TransactionThread_158
[TransactionThread_161] WARNING Transaction neither committed nor rolled back Transaction_100008388 depth=1 status=<ts=1,376,646 tc=UNCOMMITTED mvv=1> owner=TransactionThread_161
[TransactionThread_163] WARNING Transaction neither committed nor rolled back Transaction_100008390 depth=1 status=<ts=1,385,667 tc=UNCOMMITTED mvv=0> owner=TransactionThread_163
[TransactionThread_144] WARNING Transaction neither committed nor rolled back Transaction_100008371 depth=1 status=<ts=1,411,733 tc=UNCOMMITTED mvv=0> owner=TransactionThread_144
[TransactionThread_156] WARNING Transaction neither committed nor rolled back Transaction_100008383 depth=1 status=<ts=1,423,209 tc=UNCOMMITTED mvv=0> owner=TransactionThread_156
[TransactionThread_162] WARNING Transaction neither committed nor rolled back Transaction_100008389 depth=1 status=<ts=1,434,289 tc=UNCOMMITTED mvv=0> owner=TransactionThread_162
[TransactionThread_166] WARNING Transaction neither committed nor rolled back Transaction_100008393 depth=1 status=<ts=1,444,323 tc=UNCOMMITTED mvv=0> owner=TransactionThread_166
[TransactionThread_169] WARNING Transaction neither committed nor rolled back Transaction_100008396 depth=1 status=<ts=1,454,770 tc=UNCOMMITTED mvv=1> owner=TransactionThread_169
[TransactionThread_171] WARNING Transaction neither committed nor rolled back Transaction_100008398 depth=1 status=<ts=1,465,883 tc=UNCOMMITTED mvv=0> owner=TransactionThread_171
[TransactionThread_173] WARNING Transaction neither committed nor rolled back Transaction_100008400 depth=1 status=<ts=1,476,394 tc=UNCOMMITTED mvv=0> owner=TransactionThread_173
[TransactionThread_152] WARNING Transaction neither committed nor rolled back Transaction_100008379 depth=1 status=<ts=1,498,049 tc=UNCOMMITTED mvv=0> owner=TransactionThread_152
[TransactionThread_170] WARNING Transaction neither committed nor rolled back Transaction_100008397 depth=1 status=<ts=1,515,569 tc=UNCOMMITTED mvv=1> owner=TransactionThread_170
[TransactionThread_174] WARNING Transaction neither committed nor rolled back Transaction_100008401 depth=1 status=<ts=1,526,447 tc=UNCOMMITTED mvv=1> owner=TransactionThread_174
[TransactionThread_179] WARNING Transaction neither committed nor rolled back Transaction_100008406 depth=1 status=<ts=1,551,268 tc=UNCOMMITTED mvv=0> owner=TransactionThread_179
[TransactionThread_172] WARNING Transaction neither committed nor rolled back Transaction_100008399 depth=1 status=<ts=1,587,848 tc=UNCOMMITTED mvv=0> owner=TransactionThread_172
[TransactionThread_178] WARNING Transaction neither committed nor rolled back Transaction_100008405 depth=1 status=<ts=1,600,877 tc=UNCOMMITTED mvv=0> owner=TransactionThread_178
[TransactionThread_182] WARNING Transaction neither committed nor rolled back Transaction_100008409 depth=1 status=<ts=1,609,041 tc=UNCOMMITTED mvv=0> owner=TransactionThread_182
[TransactionThread_185] WARNING Transaction neither committed nor rolled back Transaction_100008412 depth=1 status=<ts=1,619,658 tc=UNCOMMITTED mvv=0> owner=TransactionThread_185
[TransactionThread_187] WARNING Transaction neither committed nor rolled back Transaction_100008414 depth=1 status=<ts=1,629,409 tc=UNCOMMITTED mvv=1> owner=TransactionThread_187
[TransactionThread_189] WARNING Transaction neither committed nor rolled back Transaction_100008416 depth=1 status=<ts=1,635,825 tc=UNCOMMITTED mvv=0> owner=TransactionThread_189
[TransactionThread_168] WARNING Transaction neither committed nor rolled back Transaction_100008395 depth=1 status=<ts=1,657,828 tc=UNCOMMITTED mvv=1> owner=TransactionThread_168
[TransactionThread_180] WARNING Transaction neither committed nor rolled back Transaction_100008407 depth=1 status=<ts=1,670,169 tc=UNCOMMITTED mvv=0> owner=TransactionThread_180
[TransactionThread_186] WARNING Transaction neither committed nor rolled back Transaction_100008413 depth=1 status=<ts=1,683,314 tc=UNCOMMITTED mvv=1> owner=TransactionThread_186
[TransactionThread_190] WARNING Transaction neither committed nor rolled back Transaction_100008417 depth=1 status=<ts=1,694,154 tc=UNCOMMITTED mvv=1> owner=TransactionThread_190
[TransactionThread_193] WARNING Transaction neither committed nor rolled back Transaction_100008420 depth=1 status=<ts=1,705,540 tc=UNCOMMITTED mvv=0> owner=TransactionThread_193
[TransactionThread_195] WARNING Transaction neither committed nor rolled back Transaction_100008422 depth=1 status=<ts=1,716,776 tc=UNCOMMITTED mvv=0> owner=TransactionThread_195
[TransactionThread_197] WARNING Transaction neither committed nor rolled back Transaction_100008424 depth=1 status=<ts=1,726,853 tc=UNCOMMITTED mvv=0> owner=TransactionThread_197
[TransactionThread_176] WARNING Transaction neither committed nor rolled back Transaction_100008403 depth=1 status=<ts=1,748,964 tc=UNCOMMITTED mvv=0> owner=TransactionThread_176
[TransactionThread_188] WARNING Transaction neither committed nor rolled back Transaction_100008415 depth=1 status=<ts=1,760,017 tc=UNCOMMITTED mvv=1> owner=TransactionThread_188
[TransactionThread_194] WARNING Transaction neither committed nor rolled back Transaction_100008421 depth=1 status=<ts=1,769,891 tc=UNCOMMITTED mvv=0> owner=TransactionThread_194
[TransactionThread_198] WARNING Transaction neither committed nor rolled back Transaction_100008425 depth=1 status=<ts=1,781,618 tc=UNCOMMITTED mvv=0> owner=TransactionThread_198
[TransactionThread_201] WARNING Transaction neither committed nor rolled back Transaction_100008428 depth=1 status=<ts=1,793,741 tc=UNCOMMITTED mvv=1> owner=TransactionThread_201
[TransactionThread_184] WARNING Transaction neither committed nor rolled back Transaction_100008411 depth=1 status=<ts=1,810,607 tc=UNCOMMITTED mvv=1> owner=TransactionThread_184
[TransactionThread_205] WARNING Transaction neither committed nor rolled back Transaction_100008432 depth=1 status=<ts=1,810,646 tc=UNCOMMITTED mvv=0> owner=TransactionThread_205
[TransactionThread_202] WARNING Transaction neither committed nor rolled back Transaction_100008429 depth=1 status=<ts=1,810,634 tc=UNCOMMITTED mvv=1> owner=TransactionThread_202
[TransactionThread_200] WARNING Transaction neither committed nor rolled back Transaction_100008427 depth=1 status=<ts=1,810,592 tc=UNCOMMITTED mvv=1> owner=TransactionThread_200
[TransactionThread_204] WARNING Transaction neither committed nor rolled back Transaction_100008431 depth=1 status=<ts=1,810,656 tc=UNCOMMITTED mvv=0> owner=TransactionThread_204
[TransactionThread_196] WARNING Transaction neither committed nor rolled back Transaction_100008423 depth=1 status=<ts=1,810,652 tc=UNCOMMITTED mvv=1> owner=TransactionThread_196
Completed transactions: 450356
Failed transactions: 0
Retried transactions: 2095

CurrentCount=172  AbortedCount=4  LongRunningCount=0  FreeCount=1,893
atCache=Floor=1,810,658 Ceiling=1,810,658 Low=MAX High=MIN Count=0
Ending balance is 0 which AGREES
Computing balance
Starting balance is 0
Starting transaction threads
Waiting for threads to end
TransactionThread_4 has finished 25000 iterations
TransactionThread_6 has finished 25000 iterations
TransactionThread_5 has finished 25000 iterations
TransactionThread_2 has finished 25000 iterations
TransactionThread_1 has finished 25000 iterations
TransactionThread_3 has finished 25000 iterations
TransactionThread_0 has finished 25000 iterations
TransactionThread_7 has finished 25000 iterations
All threads ended at 5856 ms
Completed transactions: 650356
Failed transactions: 0
Retried transactions: 3196
Ending balance is 0 which AGREES
Tests run: 5, Failures: 0, Errors: 0, Skipped: 1, Time elapsed: 16.783 sec - in com.persistit.TransactionTest2
Running com.persistit.Bug1010079Test
Tests run: 1, Failures: 0, Errors: 0, Skipped: 0, Time elapsed: 0.677 sec - in com.persistit.Bug1010079Test
Running com.persistit.Bug915594Test
Tests run: 1, Failures: 0, Errors: 0, Skipped: 0, Time elapsed: 0.406 sec - in com.persistit.Bug915594Test
Running com.persistit.Bug992801Test
Tests run: 1, Failures: 0, Errors: 0, Skipped: 0, Time elapsed: 0.189 sec - in com.persistit.Bug992801Test
Running com.persistit.TransactionLifetimeTest
Tests run: 33, Failures: 0, Errors: 0, Skipped: 0, Time elapsed: 10.245 sec - in com.persistit.TransactionLifetimeTest
Running com.persistit.VolumeTest
Tests run: 8, Failures: 0, Errors: 0, Skipped: 0, Time elapsed: 8.997 sec - in com.persistit.VolumeTest
Running com.persistit.StatisticsTaskTest
  elapsed ms         hit       miss        new      evict     jwrite      jread      jcopy    tcommit      troll         CJ         CV         RV         RJ         WJ         EV         FJ   IOkbytes
       1,120       0.000      0.000      0.000      0.000      0.000      0.000      0.000      0.000      0.000      0.000      0.000      0.000      0.000      0.000      0.000      0.000      0.000 RATE
       2,119       0.000      0.000      0.000      0.000      0.000      0.000      0.000      0.000      0.000      0.000      0.000      0.000      0.000      0.000      0.000      0.000      0.000 RATE
       3,119       0.000      0.000      0.000      0.000      0.000      0.000      0.000      0.000      0.000      0.000      0.000      0.000      0.000      0.000      0.000      0.000      0.000 RATE
       4,118       0.000      0.000      0.000      0.000      0.000      0.000      0.000      0.000      0.000      0.000      0.000      0.000      0.000      0.000      0.000      0.000      0.000 RATE
Tests run: 2, Failures: 0, Errors: 0, Skipped: 0, Time elapsed: 4.524 sec - in com.persistit.StatisticsTaskTest
Running com.persistit.BufferTest
Tests run: 3, Failures: 0, Errors: 0, Skipped: 1, Time elapsed: 0.436 sec - in com.persistit.BufferTest
Running com.persistit.Bug923790Test
Tests run: 1, Failures: 0, Errors: 0, Skipped: 0, Time elapsed: 2.24 sec - in com.persistit.Bug923790Test
Running com.persistit.Bug1056489Test
Tests run: 1, Failures: 0, Errors: 0, Skipped: 0, Time elapsed: 0.198 sec - in com.persistit.Bug1056489Test
Running com.persistit.Bug1018526Test
[main] WARNING BufferPool[20@16384:closed] has 6 stranded pages
Tests run: 3, Failures: 0, Errors: 0, Skipped: 0, Time elapsed: 0.846 sec - in com.persistit.Bug1018526Test
Running com.persistit.CommandLineTest
Tests run: 4, Failures: 0, Errors: 0, Skipped: 0, Time elapsed: 7.356 sec - in com.persistit.CommandLineTest
Running com.persistit.Bug947182Test
Tests run: 1, Failures: 0, Errors: 0, Skipped: 0, Time elapsed: 0.182 sec - in com.persistit.Bug947182Test
Running com.persistit.TransactionIndexConcurrencyTest

Before cleanup:
   2,764ms:  Commits=499,767 Aborts=233
CurrentCount=3,077  AbortedCount=1  LongRunningCount=1,844  FreeCount=15,223
atCache=Floor=999,114 Ceiling=999,114 Low=MAX High=MIN Count=0


After cleanup:
   2,764ms:  Commits=499,767 Aborts=233
CurrentCount=0  AbortedCount=1  LongRunningCount=0  FreeCount=20,000
atCache=Floor=1,000,268 Ceiling=1,000,268 Low=MAX High=MIN Count=0

Tests run: 2, Failures: 0, Errors: 0, Skipped: 0, Time elapsed: 4.15 sec - in com.persistit.TransactionIndexConcurrencyTest
Running com.persistit.BufferPoolTest
Timestamp     100,000,000 Checkpoint     200,000,000 Current     400,000,000 Priority     350,000,040
Timestamp     200,000,000 Checkpoint     200,000,000 Current     410,000,000 Priority     260,000,040
Timestamp     300,000,000 Checkpoint     200,000,000 Current     420,000,000 Priority     170,000,040
Timestamp     400,000,000 Checkpoint     200,000,000 Current     430,000,000 Priority      80,000,040
Timestamp     500,000,000 Checkpoint     200,000,000 Current     440,000,000 Priority              23
Timestamp     600,000,000 Checkpoint     200,000,000 Current     450,000,000 Priority              23
Timestamp     700,000,000 Checkpoint     200,000,000 Current     460,000,000 Priority              23
Timestamp     800,000,000 Checkpoint     200,000,000 Current     470,000,000 Priority              23
Timestamp     900,000,000 Checkpoint     200,000,000 Current     480,000,000 Priority              23
Timestamp   1,000,000,000 Checkpoint     200,000,000 Current     490,000,000 Priority              23
Timestamp   1,100,000,000 Checkpoint     200,000,000 Current     500,000,000 Priority              23
Timestamp   1,200,000,000 Checkpoint     200,000,000 Current     510,000,000 Priority              23
Timestamp   1,300,000,000 Checkpoint     200,000,000 Current     520,000,000 Priority              23
Timestamp   1,400,000,000 Checkpoint     200,000,000 Current     530,000,000 Priority              23
Timestamp   1,500,000,000 Checkpoint     200,000,000 Current     540,000,000 Priority              23
Timestamp   1,600,000,000 Checkpoint     200,000,000 Current     550,000,000 Priority              23
Timestamp   1,700,000,000 Checkpoint     200,000,000 Current     560,000,000 Priority              23
Timestamp   1,800,000,000 Checkpoint     200,000,000 Current     570,000,000 Priority              23
Timestamp   1,900,000,000 Checkpoint     200,000,000 Current     580,000,000 Priority              23
Tests run: 5, Failures: 0, Errors: 0, Skipped: 0, Time elapsed: 1.201 sec - in com.persistit.BufferPoolTest
Running com.persistit.ExchangeRebalanceTest

testRebalanceException
Checking persistit(/home/jenkins/.jenkins/jobs/gluu-opendj4/workspace/opendj-sdk/persistit/core/target/junit427071799433778104/persistit/persistit) 
  Faults:  0 Index pages/bytes: 1 / 192 Data pages/bytes: 4 / 32,656 LongRec pages/bytes: 0 / 0  MVV pages/records/bytes/antivalues: 0 / 0 / 0 / 0  Holes 0 Pages pruned 0
Checking persistit(/home/jenkins/.jenkins/jobs/gluu-opendj4/workspace/opendj-sdk/persistit/core/target/junit427071799433778104/persistit/persistit) 
  Faults:  0 Index pages/bytes: 1 / 340 Data pages/bytes: 5 / 32,692 LongRec pages/bytes: 0 / 0  MVV pages/records/bytes/antivalues: 0 / 0 / 0 / 0  Holes 0 Pages pruned 0

testRebalanceIndexException
Checking persistit(/home/jenkins/.jenkins/jobs/gluu-opendj4/workspace/opendj-sdk/persistit/core/target/junit12724598677547593796/persistit/persistit) 
  Faults:  0 Index pages/bytes: 4 / 49,772 Data pages/bytes: 1,193 / 10,297,888 LongRec pages/bytes: 0 / 0  MVV pages/records/bytes/antivalues: 0 / 0 / 0 / 0  Holes 0 Pages pruned 0
Checking persistit(/home/jenkins/.jenkins/jobs/gluu-opendj4/workspace/opendj-sdk/persistit/core/target/junit12724598677547593796/persistit/persistit) 
  Faults:  0 Index pages/bytes: 5 / 49,832 Data pages/bytes: 1,192 / 10,285,252 LongRec pages/bytes: 0 / 0  MVV pages/records/bytes/antivalues: 0 / 0 / 0 / 0  Holes 0 Pages pruned 0
Tests run: 2, Failures: 0, Errors: 0, Skipped: 0, Time elapsed: 0.684 sec - in com.persistit.ExchangeRebalanceTest
Running com.persistit.SplitPolicyTest
Page 3 in volume persistit(/home/jenkins/.jenkins/jobs/gluu-opendj4/workspace/opendj-sdk/persistit/core/target/junit574098139582438362/persistit/persistit) at index 3 timestamp=3,688 status=vdr1 type=Data avail=1660
Page 4 in volume persistit(/home/jenkins/.jenkins/jobs/gluu-opendj4/workspace/opendj-sdk/persistit/core/target/junit574098139582438362/persistit/persistit) at index 4 timestamp=6,863 status=vdr1 type=Data avail=1640
Page 6 in volume persistit(/home/jenkins/.jenkins/jobs/gluu-opendj4/workspace/opendj-sdk/persistit/core/target/junit574098139582438362/persistit/persistit) at index 6 timestamp=10,028 status=vdr1 type=Data avail=1640
Page 7 in volume persistit(/home/jenkins/.jenkins/jobs/gluu-opendj4/workspace/opendj-sdk/persistit/core/target/junit574098139582438362/persistit/persistit) at index 7 timestamp=13,193 status=vdr1 type=Data avail=1640
Page 8 in volume persistit(/home/jenkins/.jenkins/jobs/gluu-opendj4/workspace/opendj-sdk/persistit/core/target/junit574098139582438362/persistit/persistit) at index 8 timestamp=16,359 status=vdr1 type=Data avail=1640
Page 9 in volume persistit(/home/jenkins/.jenkins/jobs/gluu-opendj4/workspace/opendj-sdk/persistit/core/target/junit574098139582438362/persistit/persistit) at index 9 timestamp=19,524 status=vdr1 type=Data avail=1640
Page 10 in volume persistit(/home/jenkins/.jenkins/jobs/gluu-opendj4/workspace/opendj-sdk/persistit/core/target/junit574098139582438362/persistit/persistit) at index 10 timestamp=22,689 status=vdr1 type=Data avail=1640
Page 11 in volume persistit(/home/jenkins/.jenkins/jobs/gluu-opendj4/workspace/opendj-sdk/persistit/core/target/junit574098139582438362/persistit/persistit) at index 11 timestamp=25,854 status=vdr1 type=Data avail=1640
Page 12 in volume persistit(/home/jenkins/.jenkins/jobs/gluu-opendj4/workspace/opendj-sdk/persistit/core/target/junit574098139582438362/persistit/persistit) at index 12 timestamp=29,019 status=vdr1 type=Data avail=1640
Page 13 in volume persistit(/home/jenkins/.jenkins/jobs/gluu-opendj4/workspace/opendj-sdk/persistit/core/target/junit574098139582438362/persistit/persistit) at index 13 timestamp=32,184 status=vdr1 type=Data avail=1640
Page 14 in volume persistit(/home/jenkins/.jenkins/jobs/gluu-opendj4/workspace/opendj-sdk/persistit/core/target/junit574098139582438362/persistit/persistit) at index 14 timestamp=35,349 status=vdr1 type=Data avail=1640
Page 15 in volume persistit(/home/jenkins/.jenkins/jobs/gluu-opendj4/workspace/opendj-sdk/persistit/core/target/junit574098139582438362/persistit/persistit) at index 15 timestamp=38,514 status=vdr1 type=Data avail=1640
Page 16 in volume persistit(/home/jenkins/.jenkins/jobs/gluu-opendj4/workspace/opendj-sdk/persistit/core/target/junit574098139582438362/persistit/persistit) at index 16 timestamp=41,679 status=vdr1 type=Data avail=1640
Page 17 in volume persistit(/home/jenkins/.jenkins/jobs/gluu-opendj4/workspace/opendj-sdk/persistit/core/target/junit574098139582438362/persistit/persistit) at index 17 timestamp=44,844 status=vdr1 type=Data avail=1640
Page 18 in volume persistit(/home/jenkins/.jenkins/jobs/gluu-opendj4/workspace/opendj-sdk/persistit/core/target/junit574098139582438362/persistit/persistit) at index 18 timestamp=48,009 status=vdr1 type=Data avail=1640
Page 19 in volume persistit(/home/jenkins/.jenkins/jobs/gluu-opendj4/workspace/opendj-sdk/persistit/core/target/junit574098139582438362/persistit/persistit) at index 19 timestamp=48,009 status=vdr1 type=Data avail=14692
Page 3 in volume persistit(/home/jenkins/.jenkins/jobs/gluu-opendj4/workspace/opendj-sdk/persistit/core/target/junit574098139582438362/persistit/persistit) at index 3 timestamp=99,030 status=vdr1 type=Data avail=14680
Page 4 in volume persistit(/home/jenkins/.jenkins/jobs/gluu-opendj4/workspace/opendj-sdk/persistit/core/target/junit574098139582438362/persistit/persistit) at index 4 timestamp=95,865 status=vdr1 type=Data avail=1640
Page 6 in volume persistit(/home/jenkins/.jenkins/jobs/gluu-opendj4/workspace/opendj-sdk/persistit/core/target/junit574098139582438362/persistit/persistit) at index 6 timestamp=51,552 status=vdr1 type=Data avail=1644
Page 7 in volume persistit(/home/jenkins/.jenkins/jobs/gluu-opendj4/workspace/opendj-sdk/persistit/core/target/junit574098139582438362/persistit/persistit) at index 7 timestamp=54,717 status=vdr1 type=Data avail=1640
Page 8 in volume persistit(/home/jenkins/.jenkins/jobs/gluu-opendj4/workspace/opendj-sdk/persistit/core/target/junit574098139582438362/persistit/persistit) at index 8 timestamp=57,882 status=vdr1 type=Data avail=1640
Page 9 in volume persistit(/home/jenkins/.jenkins/jobs/gluu-opendj4/workspace/opendj-sdk/persistit/core/target/junit574098139582438362/persistit/persistit) at index 9 timestamp=61,047 status=vdr1 type=Data avail=1640
Page 10 in volume persistit(/home/jenkins/.jenkins/jobs/gluu-opendj4/workspace/opendj-sdk/persistit/core/target/junit574098139582438362/persistit/persistit) at index 10 timestamp=64,212 status=vdr1 type=Data avail=1640
Page 11 in volume persistit(/home/jenkins/.jenkins/jobs/gluu-opendj4/workspace/opendj-sdk/persistit/core/target/junit574098139582438362/persistit/persistit) at index 11 timestamp=67,377 status=vdr1 type=Data avail=1640
Page 12 in volume persistit(/home/jenkins/.jenkins/jobs/gluu-opendj4/workspace/opendj-sdk/persistit/core/target/junit574098139582438362/persistit/persistit) at index 12 timestamp=70,542 status=vdr1 type=Data avail=1640
Page 13 in volume persistit(/home/jenkins/.jenkins/jobs/gluu-opendj4/workspace/opendj-sdk/persistit/core/target/junit574098139582438362/persistit/persistit) at index 13 timestamp=73,707 status=vdr1 type=Data avail=1640
Page 14 in volume persistit(/home/jenkins/.jenkins/jobs/gluu-opendj4/workspace/opendj-sdk/persistit/core/target/junit574098139582438362/persistit/persistit) at index 14 timestamp=76,873 status=vdr1 type=Data avail=1640
Page 15 in volume persistit(/home/jenkins/.jenkins/jobs/gluu-opendj4/workspace/opendj-sdk/persistit/core/target/junit574098139582438362/persistit/persistit) at index 15 timestamp=80,038 status=vdr1 type=Data avail=1640
Page 16 in volume persistit(/home/jenkins/.jenkins/jobs/gluu-opendj4/workspace/opendj-sdk/persistit/core/target/junit574098139582438362/persistit/persistit) at index 16 timestamp=83,203 status=vdr1 type=Data avail=1640
Page 17 in volume persistit(/home/jenkins/.jenkins/jobs/gluu-opendj4/workspace/opendj-sdk/persistit/core/target/junit574098139582438362/persistit/persistit) at index 17 timestamp=86,368 status=vdr1 type=Data avail=1640
Page 18 in volume persistit(/home/jenkins/.jenkins/jobs/gluu-opendj4/workspace/opendj-sdk/persistit/core/target/junit574098139582438362/persistit/persistit) at index 18 timestamp=89,533 status=vdr1 type=Data avail=1640
Page 19 in volume persistit(/home/jenkins/.jenkins/jobs/gluu-opendj4/workspace/opendj-sdk/persistit/core/target/junit574098139582438362/persistit/persistit) at index 19 timestamp=92,698 status=vdr1 type=Data avail=1640
Page 19 in volume persistit(/home/jenkins/.jenkins/jobs/gluu-opendj4/workspace/opendj-sdk/persistit/core/target/junit574098139582438362/persistit/persistit) at index 19 timestamp=157,781 status=vdr1 type=Data avail=4208
Tests run: 6, Failures: 0, Errors: 0, Skipped: 0, Time elapsed: 1.311 sec - in com.persistit.SplitPolicyTest
Running com.persistit.CorruptVolumeTest
[main] ERROR BTree structure error Volume persistit(/home/jenkins/.jenkins/jobs/gluu-opendj4/workspace/opendj-sdk/persistit/core/target/junit11165629191862081146/persistit/persistit) level=1 page=0 previousPage=5 initialPage=5 key=<{9000}> oldBuffer=<Page 5 in volume persistit(/home/jenkins/.jenkins/jobs/gluu-opendj4/workspace/opendj-sdk/persistit/core/target/junit11165629191862081146/persistit/persistit) at index 5 timestamp=60,466 status=vdr1 type=Index1> invalid page address
Exchange(Volume=/home/jenkins/.jenkins/jobs/gluu-opendj4/workspace/opendj-sdk/persistit/core/target/junit11165629191862081146/persistit/persistit,Tree=CorruptVolumeTest,,Key=<{9000}>)
0: Buffer=<Page 22 in volume persistit(/home/jenkins/.jenkins/jobs/gluu-opendj4/workspace/opendj-sdk/persistit/core/target/junit11165629191862081146/persistit/persistit) at index 3 timestamp=60,457 status=vd type=Data>, keyGeneration=30004, bufferGeneration=2196, foundAt=<32:fixup:depth=1:ebc=0:db=38:tail=16356>>
1: Buffer=<Page 5 in volume persistit(/home/jenkins/.jenkins/jobs/gluu-opendj4/workspace/opendj-sdk/persistit/core/target/junit11165629191862081146/persistit/persistit) at index 5 timestamp=60,466 status=vdr1 type=Index1>, keyGeneration=-1, bufferGeneration=42, foundAt=<65532:exact:fixup:depth=4095:after>>
Volume persistit(/home/jenkins/.jenkins/jobs/gluu-opendj4/workspace/opendj-sdk/persistit/core/target/junit11165629191862081146/persistit/persistit) level=1 page=0 previousPage=5 initialPage=5 key=<{9000}> oldBuffer=<Page 5 in volume persistit(/home/jenkins/.jenkins/jobs/gluu-opendj4/workspace/opendj-sdk/persistit/core/target/junit11165629191862081146/persistit/persistit) at index 5 timestamp=60,466 status=vdr1 type=Index1> invalid page address
com.persistit.exception.CorruptVolumeException: Volume persistit(/home/jenkins/.jenkins/jobs/gluu-opendj4/workspace/opendj-sdk/persistit/core/target/junit11165629191862081146/persistit/persistit) level=1 page=0 previousPage=5 initialPage=5 key=<{9000}> oldBuffer=<Page 5 in volume persistit(/home/jenkins/.jenkins/jobs/gluu-opendj4/workspace/opendj-sdk/persistit/core/target/junit11165629191862081146/persistit/persistit) at index 5 timestamp=60,466 status=vdr1 type=Index1> invalid page address
	at com.persistit.Exchange.corrupt(Exchange.java:4288)
	at com.persistit.Exchange.searchLevel(Exchange.java:1280)
	at com.persistit.Exchange.searchTree(Exchange.java:1196)
	at com.persistit.Exchange.search(Exchange.java:1122)
	at com.persistit.Exchange.searchAndFetchInternal(Exchange.java:3145)
	at com.persistit.Exchange.fetch(Exchange.java:3058)
	at com.persistit.Exchange.fetch(Exchange.java:2915)
	at com.persistit.CorruptVolumeTest.testCorruptVolume(CorruptVolumeTest.java:47)
	at java.base/jdk.internal.reflect.NativeMethodAccessorImpl.invoke0(Native Method)
	at java.base/jdk.internal.reflect.NativeMethodAccessorImpl.invoke(NativeMethodAccessorImpl.java:62)
	at java.base/jdk.internal.reflect.DelegatingMethodAccessorImpl.invoke(DelegatingMethodAccessorImpl.java:43)
	at java.base/java.lang.reflect.Method.invoke(Method.java:566)
	at org.junit.runners.model.FrameworkMethod$1.runReflectiveCall(FrameworkMethod.java:59)
	at org.junit.internal.runners.model.ReflectiveCallable.run(ReflectiveCallable.java:12)
	at org.junit.runners.model.FrameworkMethod.invokeExplosively(FrameworkMethod.java:56)
	at org.junit.internal.runners.statements.InvokeMethod.evaluate(InvokeMethod.java:17)
	at org.junit.internal.runners.statements.RunBefores.evaluate(RunBefores.java:26)
	at org.junit.internal.runners.statements.RunAfters.evaluate(RunAfters.java:27)
	at org.junit.rules.ExternalResource$1.evaluate(ExternalResource.java:54)
	at org.junit.runners.ParentRunner$3.evaluate(ParentRunner.java:306)
	at org.junit.runners.BlockJUnit4ClassRunner$1.evaluate(BlockJUnit4ClassRunner.java:100)
	at org.junit.runners.ParentRunner.runLeaf(ParentRunner.java:366)
	at org.junit.runners.BlockJUnit4ClassRunner.runChild(BlockJUnit4ClassRunner.java:103)
	at org.junit.runners.BlockJUnit4ClassRunner.runChild(BlockJUnit4ClassRunner.java:63)
	at org.junit.runners.ParentRunner$4.run(ParentRunner.java:331)
	at org.junit.runners.ParentRunner$1.schedule(ParentRunner.java:79)
	at org.junit.runners.ParentRunner.runChildren(ParentRunner.java:329)
	at org.junit.runners.ParentRunner.access$100(ParentRunner.java:66)
	at org.junit.runners.ParentRunner$2.evaluate(ParentRunner.java:293)
	at org.junit.runners.ParentRunner$3.evaluate(ParentRunner.java:306)
	at org.junit.runners.ParentRunner.run(ParentRunner.java:413)
	at org.apache.maven.surefire.junit4.JUnit4Provider.execute(JUnit4Provider.java:283)
	at org.apache.maven.surefire.junit4.JUnit4Provider.executeWithRerun(JUnit4Provider.java:173)
	at org.apache.maven.surefire.junit4.JUnit4Provider.executeTestSet(JUnit4Provider.java:153)
	at org.apache.maven.surefire.junit4.JUnit4Provider.invoke(JUnit4Provider.java:128)
	at org.apache.maven.surefire.booter.ForkedBooter.invokeProviderInSameClassLoader(ForkedBooter.java:203)
	at org.apache.maven.surefire.booter.ForkedBooter.runSuitesInProcess(ForkedBooter.java:155)
	at org.apache.maven.surefire.booter.ForkedBooter.main(ForkedBooter.java:103)
Tests run: 1, Failures: 0, Errors: 0, Skipped: 0, Time elapsed: 0.243 sec - in com.persistit.CorruptVolumeTest
Running com.persistit.TransactionSessionSwitchTest
Tests run: 1, Failures: 0, Errors: 0, Skipped: 0, Time elapsed: 1.154 sec - in com.persistit.TransactionSessionSwitchTest
Running com.persistit.MVCCConcurrentTest
Tests run: 1, Failures: 0, Errors: 0, Skipped: 0, Time elapsed: 0.242 sec - in com.persistit.MVCCConcurrentTest

Results :

Failed tests: 
  Bug1017957Test.induceCorruptionByStress:182 Exception occurred expected:<0> but was:<4>



Tests run: 565, Failures: 1, Errors: 0, Skipped: 10

[INFO] ------------------------------------------------------------------------
[INFO] Reactor Summary for org.gluufederation.commons.parent 2.0.11:
[INFO] 
[INFO] org.gluufederation.commons.parent .................. SUCCESS [  1.684 s]
[INFO] org.gluufederation.commons.maven-external-dependency-plugin SUCCESS [  4.807 s]
[INFO] org.gluufederation.commons.build-tools ............. SUCCESS [  5.797 s]
[INFO] org.gluufederation.commons.i18n-framework .......... SUCCESS [  0.050 s]
[INFO] org.gluufederation.commons.i18n-framework.maven-plugin SUCCESS [ 12.288 s]
[INFO] org.gluufederation.commons.i18n-framework.core ..... SUCCESS [  8.203 s]
[INFO] org.gluufederation.commons.i18n-framework.jul ...... SUCCESS [  7.891 s]
[INFO] org.gluufederation.commons.i18n-framework.slf4j .... SUCCESS [ 13.786 s]
[INFO] org.gluufederation.commons.guice ................... SUCCESS [  0.030 s]
[INFO] org.gluufederation.commons.guice.core .............. SUCCESS [  7.166 s]
[INFO] org.gluufederation.commons.guice.servlet ........... SUCCESS [  5.574 s]
[INFO] org.gluufederation.commons.guice.test .............. SUCCESS [  5.354 s]
[INFO] org.gluufederation.commons.ui ...................... SUCCESS [  5.569 s]
[INFO] org.gluufederation.commons.ui.commons .............. SUCCESS [ 17.796 s]
[INFO] org.gluufederation.commons.ui.user ................. SUCCESS [ 15.537 s]
[INFO] org.gluufederation.commons.ui.mock ................. SUCCESS [ 14.934 s]
[INFO] org.gluufederation.commons.commons ................. SUCCESS [  0.035 s]
[INFO] org.gluufederation.commons.util-parent ............. SUCCESS [  0.018 s]
[INFO] org.gluufederation.commons.util .................... SUCCESS [ 15.934 s]
[INFO] org.gluufederation.commons.test-utils .............. SUCCESS [  7.049 s]
[INFO] org.gluufederation.commons.http-framework .......... SUCCESS [  0.014 s]
[INFO] org.gluufederation.commons.http-framework.core ..... SUCCESS [ 24.520 s]
[INFO] org.gluufederation.commons.rest .................... SUCCESS [  0.021 s]
[INFO] org.gluufederation.commons.api-descriptor .......... SUCCESS [ 16.033 s]
[INFO] org.gluufederation.commons.json-resource ........... SUCCESS [ 14.822 s]
[INFO] org.gluufederation.commons.security ................ SUCCESS [  5.023 s]
[INFO] org.gluufederation.commons.http-framework.client-apache-common SUCCESS [  3.455 s]
[INFO] org.gluufederation.commons.http-framework.client-apache-sync SUCCESS [  6.096 s]
[INFO] org.gluufederation.commons.http-framework.binding-test-utils SUCCESS [  3.620 s]
[INFO] org.gluufederation.commons.http-framework.servlet .. SUCCESS [ 12.726 s]
[INFO] org.gluufederation.commons.http-framework.client-apache-async SUCCESS [  6.549 s]
[INFO] org.gluufederation.commons.json-resource-http ...... SUCCESS [ 11.268 s]
[INFO] org.gluufederation.commons.audit ................... SUCCESS [  0.015 s]
[INFO] org.gluufederation.commons.audit.core .............. SUCCESS [ 15.528 s]
[INFO] org.gluufederation.commons.audit.json .............. SUCCESS [  5.431 s]
[INFO] org.gluufederation.commons.audit.handler-csv ....... SUCCESS [ 36.928 s]
[INFO] org.gluufederation.commons.audit.handler-syslog .... SUCCESS [  6.313 s]
[INFO] org.gluufederation.commons.audit.handler-jdbc ...... SUCCESS [  7.726 s]
[INFO] org.gluufederation.commons.audit.handler-elasticsearch SUCCESS [  7.065 s]
[INFO] org.gluufederation.commons.audit.handler-jms ....... SUCCESS [  6.683 s]
[INFO] org.gluufederation.commons.audit.servlet ........... SUCCESS [  8.317 s]
[INFO] org.gluufederation.commons.audit.handler-json ...... SUCCESS [  5.754 s]
[INFO] org.gluufederation.commons.audit.handler-splunk .... SUCCESS [  3.427 s]
[INFO] org.gluufederation.commons.auth-filters ............ SUCCESS [  0.022 s]
[INFO] org.gluufederation.commons.authn-filter ............ SUCCESS [  0.012 s]
[INFO] org.gluufederation.commons.authn-filter.jaspi-runtime SUCCESS [  8.469 s]
[INFO] org.gluufederation.commons.json-web-token .......... SUCCESS [ 14.912 s]
[INFO] org.gluufederation.commons.authn-filter.jaspi-modules SUCCESS [  0.018 s]
[INFO] org.gluufederation.commons.authn-filter.jaspi-modules.jwt-session-module SUCCESS [  6.471 s]
[INFO] org.gluufederation.commons.authn-filter.jaspi-modules.openid-connect-module SUCCESS [  6.863 s]
[INFO] org.gluufederation.commons.authn-filter.jaspi-modules.iwa-module SUCCESS [  3.567 s]
[INFO] org.gluufederation.commons.authn-filter.jaspi-modules.openam-session-module SUCCESS [  5.439 s]
[INFO] org.gluufederation.commons.authn-filter.jaspi-functional-tests SUCCESS [ 14.246 s]
[INFO] org.gluufederation.commons.auth-filters.authz-filter SUCCESS [  0.015 s]
[INFO] org.gluufederation.commons.auth-filters.authz-filter.framework-api SUCCESS [  4.737 s]
[INFO] org.gluufederation.commons.auth-filters.authz-filter.framework SUCCESS [  4.661 s]
[INFO] org.gluufederation.commons.auth-filters.authz-filter.modules SUCCESS [  0.014 s]
[INFO] org.gluufederation.commons.auth-filters.authz-filter.modules.oauth2-module SUCCESS [  6.101 s]
[INFO] org.gluufederation.commons.auth-filters.authz-filter.framework-functional-tests SUCCESS [ 26.142 s]
[INFO] org.gluufederation.commons.http-framework.grizzly .. SUCCESS [  9.489 s]
[INFO] org.gluufederation.commons.http-framework.examples . SUCCESS [  0.020 s]
[INFO] org.gluufederation.commons.http-framework.examples.http-descriptor-example SUCCESS [  5.010 s]
[INFO] org.gluufederation.commons.http-framework.examples.servlet-example SUCCESS [  3.849 s]
[INFO] org.gluufederation.commons.http-framework.oauth2 ... SUCCESS [  7.317 s]
[INFO] org.gluufederation.commons.json-crypto ............. SUCCESS [  0.017 s]
[INFO] org.gluufederation.commons.json-crypto.core ........ SUCCESS [  5.668 s]
[INFO] org.gluufederation.commons.json-crypto.cli ......... SUCCESS [  5.504 s]
[INFO] org.gluufederation.commons.json-ref ................ SUCCESS [  0.014 s]
[INFO] org.gluufederation.commons.json-ref.core ........... SUCCESS [  4.415 s]
[INFO] org.gluufederation.commons.json-ref.jackson ........ SUCCESS [  4.964 s]
[INFO] org.gluufederation.commons.json-schema ............. SUCCESS [  0.013 s]
[INFO] org.gluufederation.commons.json-schema.core ........ SUCCESS [  6.685 s]
[INFO] org.gluufederation.commons.json-schema.cli ......... SUCCESS [  3.847 s]
[INFO] org.gluufederation.commons.rest-docbook ............ SUCCESS [  0.077 s]
[INFO] org.gluufederation.commons.openapi-war-overlay ..... SUCCESS [  0.252 s]
[INFO] org.gluufederation.commons.json-resource-examples .. SUCCESS [ 30.447 s]
[INFO] org.gluufederation.commons.selfservice ............. SUCCESS [  0.147 s]
[INFO] org.gluufederation.commons.selfservice.core ........ SUCCESS [  6.407 s]
[INFO] org.gluufederation.commons.selfservice.custom-stage  SUCCESS [  3.468 s]
[INFO] org.gluufederation.commons.selfservice.stages ...... SUCCESS [  9.221 s]
[INFO] org.gluufederation.commons.selfservice.json ........ SUCCESS [  5.574 s]
[INFO] org.gluufederation.commons.selfservice.example-ui .. SUCCESS [ 13.297 s]
[INFO] org.gluufederation.commons.selfservice.example ..... SUCCESS [ 10.353 s]
[INFO] org.gluufederation.commons.json-fluent ............. SUCCESS [  5.520 s]
[INFO] org.gluufederation.commons.doc-maven-plugin ........ SUCCESS [ 18.212 s]
[INFO] org.gluufederation.commons.doc-default-branding .... SUCCESS [  0.164 s]
[INFO] org.gluufederation.commons.doc-common-content ...... SUCCESS [  0.175 s]
[INFO] org.gluufederation.commons.xcite-maven-plugin ...... SUCCESS [  9.787 s]
[INFO] org.gluufederation.commons.launcher ................ SUCCESS [  0.019 s]
[INFO] org.gluufederation.commons.launcher.launcher ....... SUCCESS [  6.930 s]
[INFO] org.gluufederation.commons.launcher.launcher-zip ... SUCCESS [  1.412 s]
[INFO] org.gluufederation.commons.geo ..................... SUCCESS [ 22.050 s]
[INFO] org.gluufederation.commons.httpdump ................ SUCCESS [  5.737 s]
[INFO] org.gluufederation.commons.bloomfilter ............. SUCCESS [  0.019 s]
[INFO] org.gluufederation.commons.bloomfilter.core ........ SUCCESS [ 20.019 s]
[INFO] org.gluufederation.commons.bloomfilter.monitoring .. SUCCESS [ 12.179 s]
[INFO] org.gluufederation.commons.persistit ............... SUCCESS [  0.018 s]
[INFO] org.gluufederation.commons.persistit.core .......... FAILURE [08:33 min]
[INFO] org.gluufederation.commons.persistit.ui ............ SKIPPED
[INFO] org.gluufederation.commons.script .................. SKIPPED
[INFO] org.gluufederation.commons.script.common ........... SKIPPED
[INFO] org.gluufederation.commons.script.javascript ....... SKIPPED
[INFO] org.gluufederation.commons.script.groovy ........... SKIPPED
[INFO] ------------------------------------------------------------------------
[INFO] BUILD FAILURE
[INFO] ------------------------------------------------------------------------
[INFO] Total time:  20:13 min
[INFO] Finished at: 2021-07-21T12:28:28Z
[INFO] ------------------------------------------------------------------------
[ERROR] Failed to execute goal org.apache.maven.plugins:maven-surefire-plugin:2.18:test (default-test) on project core: There are test failures.
[ERROR] 
[ERROR] Please refer to /home/jenkins/.jenkins/jobs/gluu-opendj4/workspace/opendj-sdk/persistit/core/target/surefire-reports for the individual test results.
[ERROR] -> [Help 1]
[ERROR] 
[ERROR] To see the full stack trace of the errors, re-run Maven with the -e switch.
[ERROR] Re-run Maven using the -X switch to enable full debug logging.
[ERROR] 
[ERROR] For more information about the errors and possible solutions, please read the following articles:
[ERROR] [Help 1] http://cwiki.apache.org/confluence/display/MAVEN/MojoFailureException
[ERROR] 
[ERROR] After correcting the problems, you can resume the build with the command
[ERROR]   mvn <args> -rf org.gluufederation.commons.persistit:core
Build step 'Invoke top-level Maven targets' marked build as failure
Not sending mail to unregistered user Yuriy.Movchan@gmail.com
Sending e-mails to: support@gluu.org
ERROR: Couldn't connect to host, port: webmail.gluu.org, 465; timeout 60000
com.sun.mail.util.MailConnectException: Couldn't connect to host, port: webmail.gluu.org, 465; timeout 60000;
  nested exception is:
	java.net.SocketTimeoutException: connect timed out
	at com.sun.mail.smtp.SMTPTransport.openServer(SMTPTransport.java:2210)
	at com.sun.mail.smtp.SMTPTransport.protocolConnect(SMTPTransport.java:722)
	at javax.mail.Service.connect(Service.java:310)
	at javax.mail.Service.connect(Service.java:169)
	at javax.mail.Service.connect(Service.java:118)
	at javax.mail.Transport.send0(Transport.java:188)
	at javax.mail.Transport.send(Transport.java:118)
	at hudson.tasks.MailSender.run(MailSender.java:130)
	at hudson.tasks.Mailer.perform(Mailer.java:176)
	at hudson.tasks.Mailer.perform(Mailer.java:139)
	at hudson.tasks.BuildStepMonitor$1.perform(BuildStepMonitor.java:20)
	at hudson.model.AbstractBuild$AbstractBuildExecution.perform(AbstractBuild.java:741)
	at hudson.model.AbstractBuild$AbstractBuildExecution.performAllBuildSteps(AbstractBuild.java:690)
	at hudson.model.Build$BuildExecution.post2(Build.java:186)
	at hudson.model.AbstractBuild$AbstractBuildExecution.post(AbstractBuild.java:635)
	at hudson.model.Run.execute(Run.java:1905)
	at hudson.model.FreeStyleBuild.run(FreeStyleBuild.java:43)
	at hudson.model.ResourceController.execute(ResourceController.java:97)
	at hudson.model.Executor.run(Executor.java:428)
Caused by: java.net.SocketTimeoutException: connect timed out
	at java.net.PlainSocketImpl.socketConnect(Native Method)
	at java.net.AbstractPlainSocketImpl.doConnect(AbstractPlainSocketImpl.java:350)
	at java.net.AbstractPlainSocketImpl.connectToAddress(AbstractPlainSocketImpl.java:206)
	at java.net.AbstractPlainSocketImpl.connect(AbstractPlainSocketImpl.java:188)
	at java.net.SocksSocketImpl.connect(SocksSocketImpl.java:392)
	at java.net.Socket.connect(Socket.java:589)
	at com.sun.mail.util.SocketFetcher.createSocket(SocketFetcher.java:333)
	at com.sun.mail.util.SocketFetcher.getSocket(SocketFetcher.java:193)
	at com.sun.mail.smtp.SMTPTransport.openServer(SMTPTransport.java:2160)
	... 18 more
Finished: FAILURE