FailedConsole Output

Started by user Yuriy Movchan
Running as SYSTEM
Building on master in workspace /home/jenkins/.jenkins/jobs/gluu-opendj3/workspace
The recommended git tool is: NONE
No credentials specified
 > git rev-parse --is-inside-work-tree # timeout=10
Fetching changes from the remote Git repository
 > git config remote.origin.url https://github.com/GluuFederation/gluu-opendj3 # timeout=10
Fetching upstream changes from https://github.com/GluuFederation/gluu-opendj3
 > git --version # timeout=10
 > git --version # 'git version 1.8.3.1'
 > git fetch --tags --progress https://github.com/GluuFederation/gluu-opendj3 +refs/heads/*:refs/remotes/origin/* # timeout=10
 > git rev-parse refs/remotes/origin/4.0.0.M2.gluu^{commit} # timeout=10
 > git rev-parse refs/remotes/origin/origin/4.0.0.M2.gluu^{commit} # timeout=10
Checking out Revision 8492041efca60eb1f2392e478a88b0b4fb8980fb (refs/remotes/origin/4.0.0.M2.gluu)
 > git config core.sparsecheckout # timeout=10
 > git checkout -f 8492041efca60eb1f2392e478a88b0b4fb8980fb # timeout=10
Commit message: "Fix repositories"
 > git rev-list --no-walk 8492041efca60eb1f2392e478a88b0b4fb8980fb # timeout=10
[workspace] $ /home/jenkins/.jenkins/tools/hudson.tasks.Maven_MavenInstallation/maven_3.6.3/bin/mvn -f pom.xml -Dmaven.test.skip=true clean compile install
[INFO] Scanning for projects...
[INFO] ------------------------------------------------------------------------
[INFO] Reactor Build Order:
[INFO] 
[INFO] OpenDJ BOM                                                         [pom]
[INFO] OpenDJ Directory Services Project                                  [pom]
[INFO] OpenDJ Core APIs                                                [bundle]
[INFO] OpenDJ Doc Helper Maven Plugin                            [maven-plugin]
[INFO] OpenDJ Grizzly Transport Provider                               [bundle]
[INFO] OpenDJ CLI API                                                  [bundle]
[INFO] OpenDJ SDK Toolkit                                                 [jar]
[INFO] OpenDJ SDK Examples                                                [jar]
[INFO] OpenDJ Commons REST Adapter                                     [bundle]
[INFO] OpenDJ Maven Plugin                                       [maven-plugin]
[INFO] OpenDJ Configuration API                                        [bundle]
[INFO] OpenDJ Commons REST LDAP Gateway                                   [war]
[INFO] OpenDJ Server NG                                                   [jar]
[INFO] OpenDJ Server                                                      [jar]
[INFO] OpenDJ Server Example Plugin                                       [jar]
[INFO] OpenDJ Legacy                                                      [jar]
[INFO] OpenDJ DSML Gateway                                                [war]
[INFO] OpenDJ embedded server examples                                    [jar]
[INFO] OpenDJ account change notification handler for OpenIDM             [jar]
[INFO] OpenDJ Doc Generated References                                    [pom]
[INFO] 
[INFO] ------------------< org.forgerock.opendj:opendj-bom >-------------------
[INFO] Building OpenDJ BOM 4.0.0-SNAPSHOT                                [1/20]
[INFO] --------------------------------[ pom ]---------------------------------
[INFO] 
[INFO] --- maven-clean-plugin:3.1.0:clean (default-clean) @ opendj-bom ---
[INFO] 
[INFO] --- maven-enforcer-plugin:3.0.0-M1:enforce (enforce-plugin-versions) @ opendj-bom ---
[INFO] 
[INFO] --- maven-enforcer-plugin:3.0.0-M1:enforce (enforce-java-version) @ opendj-bom ---
[INFO] 
[INFO] --- maven-enforcer-plugin:3.0.0-M1:enforce (enforce-maven-version) @ opendj-bom ---
[INFO] 
[INFO] --- maven-enforcer-plugin:3.0.0-M1:enforce (enforce-plugin-versions) @ opendj-bom ---
[INFO] 
[INFO] --- maven-enforcer-plugin:3.0.0-M1:enforce (enforce-java-version) @ opendj-bom ---
[INFO] 
[INFO] --- maven-enforcer-plugin:3.0.0-M1:enforce (enforce-maven-version) @ opendj-bom ---
[INFO] 
[INFO] --- maven-javadoc-plugin:3.0.1:jar (default) @ opendj-bom ---
Downloading from gluu: http://ox.gluu.org/maven/org/forgerock/forgerock-build-tools/1.0.4/forgerock-build-tools-1.0.4.pom
Downloaded from gluu: http://ox.gluu.org/maven/org/forgerock/forgerock-build-tools/1.0.4/forgerock-build-tools-1.0.4.pom (0 B at 0 B/s)
Downloading from gluu: http://ox.gluu.org/maven/org/forgerock/forgerock-build-tools/1.0.4/forgerock-build-tools-1.0.4.jar
Downloaded from gluu: http://ox.gluu.org/maven/org/forgerock/forgerock-build-tools/1.0.4/forgerock-build-tools-1.0.4.jar (0 B at 0 B/s)
[INFO] Not executing Javadoc as the project is not a Java classpath-capable package
[INFO] 
[INFO] --- maven-install-plugin:3.0.0-M1:install (default-install) @ opendj-bom ---
[INFO] Installing /home/jenkins/.jenkins/jobs/gluu-opendj3/workspace/opendj-bom/pom.xml to /var/www/html/maven/org/forgerock/opendj/opendj-bom/4.0.0-SNAPSHOT/opendj-bom-4.0.0-SNAPSHOT.pom
[INFO] 
[INFO] -----------------< org.forgerock.opendj:opendj-parent >-----------------
[INFO] Building OpenDJ Directory Services Project 4.0.0-SNAPSHOT         [2/20]
[INFO] --------------------------------[ pom ]---------------------------------
Downloading from gluu: http://ox.gluu.org/maven/org/assertj/assertj-core/2.4.1/assertj-core-2.4.1.pom
Downloaded from gluu: http://ox.gluu.org/maven/org/assertj/assertj-core/2.4.1/assertj-core-2.4.1.pom (0 B at 0 B/s)
Downloading from gluu: http://ox.gluu.org/maven/org/slf4j/slf4j-jdk14/1.7.21/slf4j-jdk14-1.7.21.pom
Downloaded from gluu: http://ox.gluu.org/maven/org/slf4j/slf4j-jdk14/1.7.21/slf4j-jdk14-1.7.21.pom (0 B at 0 B/s)
[INFO] 
[INFO] --- maven-clean-plugin:3.1.0:clean (default-clean) @ opendj-parent ---
[INFO] 
[INFO] --- maven-enforcer-plugin:3.0.0-M1:enforce (enforce-plugin-versions) @ opendj-parent ---
[INFO] 
[INFO] --- maven-enforcer-plugin:3.0.0-M1:enforce (enforce-java-version) @ opendj-parent ---
[INFO] 
[INFO] --- maven-enforcer-plugin:3.0.0-M1:enforce (enforce-maven-version) @ opendj-parent ---
[INFO] 
[INFO] --- maven-enforcer-plugin:3.0.0-M1:enforce (enforce-plugin-versions) @ opendj-parent ---
[INFO] 
[INFO] --- maven-enforcer-plugin:3.0.0-M1:enforce (enforce-java-version) @ opendj-parent ---
[INFO] 
[INFO] --- maven-enforcer-plugin:3.0.0-M1:enforce (enforce-maven-version) @ opendj-parent ---
[INFO] 
[INFO] --- maven-javadoc-plugin:3.0.1:jar (default) @ opendj-parent ---
Downloading from gluu: http://ox.gluu.org/maven/org/forgerock/forgerock-build-tools/1.0.2/forgerock-build-tools-1.0.2.pom
Downloaded from gluu: http://ox.gluu.org/maven/org/forgerock/forgerock-build-tools/1.0.2/forgerock-build-tools-1.0.2.pom (0 B at 0 B/s)
Downloading from gluu: http://ox.gluu.org/maven/org/forgerock/forgerock-build-tools/1.0.2/forgerock-build-tools-1.0.2.jar
Downloaded from gluu: http://ox.gluu.org/maven/org/forgerock/forgerock-build-tools/1.0.2/forgerock-build-tools-1.0.2.jar (0 B at 0 B/s)
[INFO] Not executing Javadoc as the project is not a Java classpath-capable package
[INFO] 
[INFO] --- maven-install-plugin:3.0.0-M1:install (default-install) @ opendj-parent ---
[INFO] Installing /home/jenkins/.jenkins/jobs/gluu-opendj3/workspace/pom.xml to /var/www/html/maven/org/forgerock/opendj/opendj-parent/4.0.0-SNAPSHOT/opendj-parent-4.0.0-SNAPSHOT.pom
[INFO] 
[INFO] ------------------< org.forgerock.opendj:opendj-core >------------------
[INFO] Building OpenDJ Core APIs 4.0.0-SNAPSHOT                          [3/20]
[INFO] -------------------------------[ bundle ]-------------------------------
Downloading from gluu: http://ox.gluu.org/maven/org/apache/maven/plugins/maven-source-plugin/3.0.1/maven-source-plugin-3.0.1.pom
Downloading from mavencentral: https://repo1.maven.org/maven2/org/apache/maven/plugins/maven-source-plugin/3.0.1/maven-source-plugin-3.0.1.pom
Progress (1): 2.7/5.7 kB
Progress (1): 5.5/5.7 kB
Progress (1): 5.7 kB    
                    
Downloaded from mavencentral: https://repo1.maven.org/maven2/org/apache/maven/plugins/maven-source-plugin/3.0.1/maven-source-plugin-3.0.1.pom (5.7 kB at 92 kB/s)
Downloading from gluu: http://ox.gluu.org/maven/org/apache/maven/plugins/maven-source-plugin/3.0.1/maven-source-plugin-3.0.1.jar
Downloading from mavencentral: https://repo1.maven.org/maven2/org/apache/maven/plugins/maven-source-plugin/3.0.1/maven-source-plugin-3.0.1.jar
Progress (1): 2.7/31 kB
Progress (1): 5.5/31 kB
Progress (1): 8.2/31 kB
Progress (1): 11/31 kB 
Progress (1): 14/31 kB
Progress (1): 16/31 kB
Progress (1): 19/31 kB
Progress (1): 22/31 kB
Progress (1): 25/31 kB
Progress (1): 27/31 kB
Progress (1): 30/31 kB
Progress (1): 31 kB   
                   
Downloaded from mavencentral: https://repo1.maven.org/maven2/org/apache/maven/plugins/maven-source-plugin/3.0.1/maven-source-plugin-3.0.1.jar (31 kB at 1.0 MB/s)
Downloading from gluu: http://ox.gluu.org/maven/org/apache/maven/plugins/maven-jar-plugin/3.0.0/maven-jar-plugin-3.0.0.pom
Downloading from mavencentral: https://repo1.maven.org/maven2/org/apache/maven/plugins/maven-jar-plugin/3.0.0/maven-jar-plugin-3.0.0.pom
Progress (1): 2.7/6.2 kB
Progress (1): 5.5/6.2 kB
Progress (1): 6.2 kB    
                    
Downloaded from mavencentral: https://repo1.maven.org/maven2/org/apache/maven/plugins/maven-jar-plugin/3.0.0/maven-jar-plugin-3.0.0.pom (6.2 kB at 441 kB/s)
Downloading from gluu: http://ox.gluu.org/maven/org/apache/maven/plugins/maven-jar-plugin/3.0.0/maven-jar-plugin-3.0.0.jar
Downloading from mavencentral: https://repo1.maven.org/maven2/org/apache/maven/plugins/maven-jar-plugin/3.0.0/maven-jar-plugin-3.0.0.jar
Progress (1): 2.7/27 kB
Progress (1): 5.5/27 kB
Progress (1): 8.2/27 kB
Progress (1): 11/27 kB 
Progress (1): 14/27 kB
Progress (1): 16/27 kB
Progress (1): 19/27 kB
Progress (1): 22/27 kB
Progress (1): 25/27 kB
Progress (1): 27 kB   
                   
Downloaded from mavencentral: https://repo1.maven.org/maven2/org/apache/maven/plugins/maven-jar-plugin/3.0.0/maven-jar-plugin-3.0.0.jar (27 kB at 1.2 MB/s)
Downloading from gluu: http://ox.gluu.org/maven/org/codehaus/mojo/clirr-maven-plugin/2.8/clirr-maven-plugin-2.8.pom
Downloading from mavencentral: https://repo1.maven.org/maven2/org/codehaus/mojo/clirr-maven-plugin/2.8/clirr-maven-plugin-2.8.pom
Progress (1): 2.7/8.0 kB
Progress (1): 5.5/8.0 kB
Progress (1): 8.0 kB    
                    
Downloaded from mavencentral: https://repo1.maven.org/maven2/org/codehaus/mojo/clirr-maven-plugin/2.8/clirr-maven-plugin-2.8.pom (8.0 kB at 666 kB/s)
Downloading from gluu: http://ox.gluu.org/maven/org/codehaus/mojo/clirr-maven-plugin/2.8/clirr-maven-plugin-2.8.jar
Downloading from mavencentral: https://repo1.maven.org/maven2/org/codehaus/mojo/clirr-maven-plugin/2.8/clirr-maven-plugin-2.8.jar
Progress (1): 2.7/75 kB
Progress (1): 5.5/75 kB
Progress (1): 8.2/75 kB
Progress (1): 11/75 kB 
Progress (1): 14/75 kB
Progress (1): 16/75 kB
Progress (1): 19/75 kB
Progress (1): 22/75 kB
Progress (1): 25/75 kB
Progress (1): 27/75 kB
Progress (1): 30/75 kB
Progress (1): 33/75 kB
Progress (1): 36/75 kB
Progress (1): 38/75 kB
Progress (1): 41/75 kB
Progress (1): 44/75 kB
Progress (1): 47/75 kB
Progress (1): 49/75 kB
Progress (1): 52/75 kB
Progress (1): 55/75 kB
Progress (1): 58/75 kB
Progress (1): 60/75 kB
Progress (1): 63/75 kB
Progress (1): 66/75 kB
Progress (1): 69/75 kB
Progress (1): 71/75 kB
Progress (1): 74/75 kB
Progress (1): 75 kB   
                   
Downloaded from mavencentral: https://repo1.maven.org/maven2/org/codehaus/mojo/clirr-maven-plugin/2.8/clirr-maven-plugin-2.8.jar (75 kB at 2.2 MB/s)
Downloading from gluu: http://ox.gluu.org/maven/org/forgerock/commons/i18n-maven-plugin/1.4.2/i18n-maven-plugin-1.4.2.pom
Downloaded from gluu: http://ox.gluu.org/maven/org/forgerock/commons/i18n-maven-plugin/1.4.2/i18n-maven-plugin-1.4.2.pom (0 B at 0 B/s)
Downloading from gluu: http://ox.gluu.org/maven/org/forgerock/commons/i18n-framework/1.4.2/i18n-framework-1.4.2.pom
Downloaded from gluu: http://ox.gluu.org/maven/org/forgerock/commons/i18n-framework/1.4.2/i18n-framework-1.4.2.pom (0 B at 0 B/s)
Downloading from gluu: http://ox.gluu.org/maven/org/forgerock/commons/i18n-maven-plugin/1.4.2/i18n-maven-plugin-1.4.2.jar
Downloaded from gluu: http://ox.gluu.org/maven/org/forgerock/commons/i18n-maven-plugin/1.4.2/i18n-maven-plugin-1.4.2.jar (0 B at 0 B/s)
Downloading from gluu: http://ox.gluu.org/maven/org/apache/maven/plugins/maven-surefire-plugin/3.0.0-M1/maven-surefire-plugin-3.0.0-M1.pom
Downloading from mavencentral: https://repo1.maven.org/maven2/org/apache/maven/plugins/maven-surefire-plugin/3.0.0-M1/maven-surefire-plugin-3.0.0-M1.pom
Progress (1): 2.7/6.4 kB
Progress (1): 5.5/6.4 kB
Progress (1): 6.4 kB    
                    
Downloaded from mavencentral: https://repo1.maven.org/maven2/org/apache/maven/plugins/maven-surefire-plugin/3.0.0-M1/maven-surefire-plugin-3.0.0-M1.pom (6.4 kB at 490 kB/s)
Downloading from gluu: http://ox.gluu.org/maven/org/apache/maven/surefire/surefire/3.0.0-M1/surefire-3.0.0-M1.pom
Downloading from mavencentral: https://repo1.maven.org/maven2/org/apache/maven/surefire/surefire/3.0.0-M1/surefire-3.0.0-M1.pom
Progress (1): 2.7/22 kB
Progress (1): 5.5/22 kB
Progress (1): 8.2/22 kB
Progress (1): 11/22 kB 
Progress (1): 14/22 kB
Progress (1): 16/22 kB
Progress (1): 19/22 kB
Progress (1): 22/22 kB
Progress (1): 22 kB   
                   
Downloaded from mavencentral: https://repo1.maven.org/maven2/org/apache/maven/surefire/surefire/3.0.0-M1/surefire-3.0.0-M1.pom (22 kB at 927 kB/s)
Downloading from gluu: http://ox.gluu.org/maven/org/apache/maven/plugins/maven-surefire-plugin/3.0.0-M1/maven-surefire-plugin-3.0.0-M1.jar
Downloading from mavencentral: https://repo1.maven.org/maven2/org/apache/maven/plugins/maven-surefire-plugin/3.0.0-M1/maven-surefire-plugin-3.0.0-M1.jar
Progress (1): 2.7/40 kB
Progress (1): 5.5/40 kB
Progress (1): 8.2/40 kB
Progress (1): 11/40 kB 
Progress (1): 14/40 kB
Progress (1): 16/40 kB
Progress (1): 19/40 kB
Progress (1): 22/40 kB
Progress (1): 25/40 kB
Progress (1): 27/40 kB
Progress (1): 30/40 kB
Progress (1): 33/40 kB
Progress (1): 36/40 kB
Progress (1): 38/40 kB
Progress (1): 40 kB   
                   
Downloaded from mavencentral: https://repo1.maven.org/maven2/org/apache/maven/plugins/maven-surefire-plugin/3.0.0-M1/maven-surefire-plugin-3.0.0-M1.jar (40 kB at 1.4 MB/s)
Downloading from gluu: http://ox.gluu.org/maven/org/forgerock/commons/i18n-core/1.4.2/i18n-core-1.4.2.pom
Downloaded from gluu: http://ox.gluu.org/maven/org/forgerock/commons/i18n-core/1.4.2/i18n-core-1.4.2.pom (0 B at 0 B/s)
Downloading from gluu: http://ox.gluu.org/maven/org/forgerock/commons/forgerock-util/21.0.0-alpha-17/forgerock-util-21.0.0-alpha-17.pom
Downloaded from gluu: http://ox.gluu.org/maven/org/forgerock/commons/forgerock-util/21.0.0-alpha-17/forgerock-util-21.0.0-alpha-17.pom (0 B at 0 B/s)
Downloading from gluu: http://ox.gluu.org/maven/org/forgerock/commons/forgerock-utilities/21.0.0-alpha-17/forgerock-utilities-21.0.0-alpha-17.pom
Downloaded from gluu: http://ox.gluu.org/maven/org/forgerock/commons/forgerock-utilities/21.0.0-alpha-17/forgerock-utilities-21.0.0-alpha-17.pom (0 B at 0 B/s)
Downloading from gluu: http://ox.gluu.org/maven/org/forgerock/commons/commons-parent/21.0.0-alpha-17/commons-parent-21.0.0-alpha-17.pom
Downloaded from gluu: http://ox.gluu.org/maven/org/forgerock/commons/commons-parent/21.0.0-alpha-17/commons-parent-21.0.0-alpha-17.pom (0 B at 0 B/s)
Downloading from gluu: http://ox.gluu.org/maven/org/forgerock/commons/i18n-slf4j/1.4.2/i18n-slf4j-1.4.2.pom
Downloaded from gluu: http://ox.gluu.org/maven/org/forgerock/commons/i18n-slf4j/1.4.2/i18n-slf4j-1.4.2.pom (0 B at 0 B/s)
Downloading from gluu: http://ox.gluu.org/maven/org/forgerock/commons/i18n-core/1.4.2/i18n-core-1.4.2.jar
Downloading from gluu: http://ox.gluu.org/maven/org/forgerock/commons/i18n-slf4j/1.4.2/i18n-slf4j-1.4.2.jar
Downloading from gluu: http://ox.gluu.org/maven/org/forgerock/commons/forgerock-util/21.0.0-alpha-17/forgerock-util-21.0.0-alpha-17.jar
Downloading from gluu: http://ox.gluu.org/maven/org/assertj/assertj-core/2.4.1/assertj-core-2.4.1.jar
Downloading from gluu: http://ox.gluu.org/maven/org/slf4j/slf4j-jdk14/1.7.21/slf4j-jdk14-1.7.21.jar
Downloaded from gluu: http://ox.gluu.org/maven/org/forgerock/commons/i18n-core/1.4.2/i18n-core-1.4.2.jar (0 B at 0 B/s)
Downloaded from gluu: http://ox.gluu.org/maven/org/forgerock/commons/i18n-slf4j/1.4.2/i18n-slf4j-1.4.2.jar (0 B at 0 B/s)
Downloaded from gluu: http://ox.gluu.org/maven/org/forgerock/commons/forgerock-util/21.0.0-alpha-17/forgerock-util-21.0.0-alpha-17.jar (0 B at 0 B/s)
Downloaded from gluu: http://ox.gluu.org/maven/org/assertj/assertj-core/2.4.1/assertj-core-2.4.1.jar (0 B at 0 B/s)
Downloaded from gluu: http://ox.gluu.org/maven/org/slf4j/slf4j-jdk14/1.7.21/slf4j-jdk14-1.7.21.jar (0 B at 0 B/s)
[INFO] 
[INFO] --- maven-clean-plugin:3.1.0:clean (default-clean) @ opendj-core ---
[INFO] 
[INFO] --- maven-enforcer-plugin:3.0.0-M1:enforce (enforce-plugin-versions) @ opendj-core ---
[INFO] 
[INFO] --- maven-enforcer-plugin:3.0.0-M1:enforce (enforce-java-version) @ opendj-core ---
[INFO] 
[INFO] --- maven-enforcer-plugin:3.0.0-M1:enforce (enforce-maven-version) @ opendj-core ---
[INFO] 
[INFO] --- buildnumber-maven-plugin:1.4:create (generate-buildnumber) @ opendj-core ---
[INFO] Executing: /bin/sh -c cd '/home/jenkins/.jenkins/jobs/gluu-opendj3/workspace/opendj-core' && 'git' 'rev-parse' '--verify' 'HEAD'
[INFO] Working directory: /home/jenkins/.jenkins/jobs/gluu-opendj3/workspace/opendj-core
[INFO] Storing buildNumber: 8492041efca60eb1f2392e478a88b0b4fb8980fb at timestamp: 1600722561946
[WARNING] Cannot get the branch information from the git repository: 
Detecting the current branch failed: fatal: ref HEAD is not a symbolic ref

[INFO] Executing: /bin/sh -c cd '/home/jenkins/.jenkins/jobs/gluu-opendj3/workspace/opendj-core' && 'git' 'rev-parse' '--verify' 'HEAD'
[INFO] Working directory: /home/jenkins/.jenkins/jobs/gluu-opendj3/workspace/opendj-core
[INFO] Storing buildScmBranch: UNKNOWN
[INFO] 
[INFO] --- buildnumber-maven-plugin:1.4:create (generate-timestamp) @ opendj-core ---
[INFO] Storing buildNumber: 20200921210922 at timestamp: 1600722562030
[WARNING] Cannot get the branch information from the git repository: 
Detecting the current branch failed: fatal: ref HEAD is not a symbolic ref

[INFO] Executing: /bin/sh -c cd '/home/jenkins/.jenkins/jobs/gluu-opendj3/workspace/opendj-core' && 'git' 'rev-parse' '--verify' 'HEAD'
[INFO] Working directory: /home/jenkins/.jenkins/jobs/gluu-opendj3/workspace/opendj-core
[INFO] Storing buildScmBranch: UNKNOWN
[INFO] 
[INFO] --- i18n-maven-plugin:1.4.2:generate-messages (default) @ opendj-core ---
[INFO] Created message output directory: /home/jenkins/.jenkins/jobs/gluu-opendj3/workspace/opendj-core/target/generated-sources/messages
[INFO] Adding source directory: /home/jenkins/.jenkins/jobs/gluu-opendj3/workspace/opendj-core/target/generated-sources/messages
[INFO] Generating CoreMessages.java from core.properties
[INFO] Generating KeystoreMessages.java from keystore.properties
[INFO] 
[INFO] --- maven-resources-plugin:3.1.0:resources (default-resources) @ opendj-core ---
[INFO] Using 'UTF-8' encoding to copy filtered resources.
[INFO] Copying 18 resources
[INFO] 
[INFO] --- maven-compiler-plugin:3.8.0:compile (default-compile) @ opendj-core ---
[INFO] Changes detected - recompiling the module!
[INFO] Compiling 478 source files to /home/jenkins/.jenkins/jobs/gluu-opendj3/workspace/opendj-core/target/classes
[WARNING] bootstrap class path not set in conjunction with -source 1.7
[WARNING] /home/jenkins/.jenkins/jobs/gluu-opendj3/workspace/opendj-core/src/main/java/org/forgerock/opendj/ldap/RequestLoadBalancer.java:[178,117] unchecked cast
  required: org.forgerock.opendj.ldap.requests.ExtendedRequest<R>
  found:    org.forgerock.opendj.ldap.requests.Request
[WARNING] /home/jenkins/.jenkins/jobs/gluu-opendj3/workspace/opendj-core/src/main/java/org/forgerock/opendj/ldap/AttributeFilter.java:[339,29] isPlaceHolder() in org.forgerock.opendj.ldap.schema.ObjectClass has been deprecated
[INFO] 
[INFO] --- maven-enforcer-plugin:3.0.0-M1:enforce (enforce-plugin-versions) @ opendj-core ---
[INFO] 
[INFO] --- maven-enforcer-plugin:3.0.0-M1:enforce (enforce-java-version) @ opendj-core ---
[INFO] 
[INFO] --- maven-enforcer-plugin:3.0.0-M1:enforce (enforce-maven-version) @ opendj-core ---
[INFO] 
[INFO] --- buildnumber-maven-plugin:1.4:create (generate-buildnumber) @ opendj-core ---
[INFO] Executing: /bin/sh -c cd '/home/jenkins/.jenkins/jobs/gluu-opendj3/workspace/opendj-core' && 'git' 'rev-parse' '--verify' 'HEAD'
[INFO] Working directory: /home/jenkins/.jenkins/jobs/gluu-opendj3/workspace/opendj-core
[INFO] Storing buildNumber: 8492041efca60eb1f2392e478a88b0b4fb8980fb at timestamp: 1600722570506
[WARNING] Cannot get the branch information from the git repository: 
Detecting the current branch failed: fatal: ref HEAD is not a symbolic ref

[INFO] Executing: /bin/sh -c cd '/home/jenkins/.jenkins/jobs/gluu-opendj3/workspace/opendj-core' && 'git' 'rev-parse' '--verify' 'HEAD'
[INFO] Working directory: /home/jenkins/.jenkins/jobs/gluu-opendj3/workspace/opendj-core
[INFO] Storing buildScmBranch: UNKNOWN
[INFO] 
[INFO] --- buildnumber-maven-plugin:1.4:create (generate-timestamp) @ opendj-core ---
[INFO] Storing buildNumber: 20200921210930 at timestamp: 1600722570530
[WARNING] Cannot get the branch information from the git repository: 
Detecting the current branch failed: fatal: ref HEAD is not a symbolic ref

[INFO] Executing: /bin/sh -c cd '/home/jenkins/.jenkins/jobs/gluu-opendj3/workspace/opendj-core' && 'git' 'rev-parse' '--verify' 'HEAD'
[INFO] Working directory: /home/jenkins/.jenkins/jobs/gluu-opendj3/workspace/opendj-core
[INFO] Storing buildScmBranch: UNKNOWN
[INFO] 
[INFO] --- i18n-maven-plugin:1.4.2:generate-messages (default) @ opendj-core ---
[INFO] Adding source directory: /home/jenkins/.jenkins/jobs/gluu-opendj3/workspace/opendj-core/target/generated-sources/messages
[INFO] CoreMessages.java is up to date
[INFO] KeystoreMessages.java is up to date
[INFO] 
[INFO] --- maven-resources-plugin:3.1.0:resources (default-resources) @ opendj-core ---
[INFO] Using 'UTF-8' encoding to copy filtered resources.
[INFO] Copying 18 resources
[INFO] 
[INFO] --- maven-compiler-plugin:3.8.0:compile (default-compile) @ opendj-core ---
[INFO] Changes detected - recompiling the module!
[INFO] Compiling 478 source files to /home/jenkins/.jenkins/jobs/gluu-opendj3/workspace/opendj-core/target/classes
[WARNING] bootstrap class path not set in conjunction with -source 1.7
[WARNING] /home/jenkins/.jenkins/jobs/gluu-opendj3/workspace/opendj-core/src/main/java/org/forgerock/opendj/ldap/RequestLoadBalancer.java:[178,117] unchecked cast
  required: org.forgerock.opendj.ldap.requests.ExtendedRequest<R>
  found:    org.forgerock.opendj.ldap.requests.Request
[WARNING] /home/jenkins/.jenkins/jobs/gluu-opendj3/workspace/opendj-core/src/main/java/org/forgerock/opendj/ldap/AttributeFilter.java:[339,29] isPlaceHolder() in org.forgerock.opendj.ldap.schema.ObjectClass has been deprecated
[INFO] 
[INFO] --- maven-resources-plugin:3.1.0:testResources (default-testResources) @ opendj-core ---
[INFO] Not copying test resources
[INFO] 
[INFO] --- maven-compiler-plugin:3.8.0:testCompile (default-testCompile) @ opendj-core ---
[INFO] Not compiling test sources
[INFO] 
[INFO] --- maven-surefire-plugin:3.0.0-M1:test (default-test) @ opendj-core ---
Downloading from gluu: http://ox.gluu.org/maven/org/apache/maven/surefire/maven-surefire-common/3.0.0-M1/maven-surefire-common-3.0.0-M1.pom
Downloading from mavencentral: https://repo1.maven.org/maven2/org/apache/maven/surefire/maven-surefire-common/3.0.0-M1/maven-surefire-common-3.0.0-M1.pom
Progress (1): 4.1/9.7 kB
Progress (1): 8.2/9.7 kB
Progress (1): 9.7 kB    
                    
Downloaded from mavencentral: https://repo1.maven.org/maven2/org/apache/maven/surefire/maven-surefire-common/3.0.0-M1/maven-surefire-common-3.0.0-M1.pom (9.7 kB at 693 kB/s)
Downloading from gluu: http://ox.gluu.org/maven/org/apache/maven/surefire/surefire-api/3.0.0-M1/surefire-api-3.0.0-M1.pom
Downloading from mavencentral: https://repo1.maven.org/maven2/org/apache/maven/surefire/surefire-api/3.0.0-M1/surefire-api-3.0.0-M1.pom
Progress (1): 3.5 kB
                    
Downloaded from mavencentral: https://repo1.maven.org/maven2/org/apache/maven/surefire/surefire-api/3.0.0-M1/surefire-api-3.0.0-M1.pom (3.5 kB at 355 kB/s)
Downloading from gluu: http://ox.gluu.org/maven/org/apache/maven/surefire/surefire-logger-api/3.0.0-M1/surefire-logger-api-3.0.0-M1.pom
Downloading from mavencentral: https://repo1.maven.org/maven2/org/apache/maven/surefire/surefire-logger-api/3.0.0-M1/surefire-logger-api-3.0.0-M1.pom
Progress (1): 2.0 kB
                    
Downloaded from mavencentral: https://repo1.maven.org/maven2/org/apache/maven/surefire/surefire-logger-api/3.0.0-M1/surefire-logger-api-3.0.0-M1.pom (2.0 kB at 178 kB/s)
Downloading from gluu: http://ox.gluu.org/maven/org/apache/maven/surefire/surefire-booter/3.0.0-M1/surefire-booter-3.0.0-M1.pom
Downloading from mavencentral: https://repo1.maven.org/maven2/org/apache/maven/surefire/surefire-booter/3.0.0-M1/surefire-booter-3.0.0-M1.pom
Progress (1): 4.1/7.4 kB
Progress (1): 7.4 kB    
                    
Downloaded from mavencentral: https://repo1.maven.org/maven2/org/apache/maven/surefire/surefire-booter/3.0.0-M1/surefire-booter-3.0.0-M1.pom (7.4 kB at 567 kB/s)
Downloading from gluu: http://ox.gluu.org/maven/org/codehaus/plexus/plexus-java/0.9.11/plexus-java-0.9.11.pom
Downloading from mavencentral: https://repo1.maven.org/maven2/org/codehaus/plexus/plexus-java/0.9.11/plexus-java-0.9.11.pom
Progress (1): 4.1/4.6 kB
Progress (1): 4.6 kB    
                    
Downloaded from mavencentral: https://repo1.maven.org/maven2/org/codehaus/plexus/plexus-java/0.9.11/plexus-java-0.9.11.pom (4.6 kB at 420 kB/s)
Downloading from gluu: http://ox.gluu.org/maven/org/codehaus/plexus/plexus-languages/0.9.11/plexus-languages-0.9.11.pom
Downloading from mavencentral: https://repo1.maven.org/maven2/org/codehaus/plexus/plexus-languages/0.9.11/plexus-languages-0.9.11.pom
Progress (1): 4.1 kB
                    
Downloaded from mavencentral: https://repo1.maven.org/maven2/org/codehaus/plexus/plexus-languages/0.9.11/plexus-languages-0.9.11.pom (4.1 kB at 273 kB/s)
Downloading from gluu: http://ox.gluu.org/maven/org/apache/maven/surefire/maven-surefire-common/3.0.0-M1/maven-surefire-common-3.0.0-M1.jar
Downloading from gluu: http://ox.gluu.org/maven/org/apache/maven/surefire/surefire-logger-api/3.0.0-M1/surefire-logger-api-3.0.0-M1.jar
Downloading from gluu: http://ox.gluu.org/maven/org/apache/maven/surefire/surefire-booter/3.0.0-M1/surefire-booter-3.0.0-M1.jar
Downloading from gluu: http://ox.gluu.org/maven/org/apache/maven/surefire/surefire-api/3.0.0-M1/surefire-api-3.0.0-M1.jar
Downloading from gluu: http://ox.gluu.org/maven/org/codehaus/plexus/plexus-java/0.9.11/plexus-java-0.9.11.jar
Downloading from mavencentral: https://repo1.maven.org/maven2/org/apache/maven/surefire/maven-surefire-common/3.0.0-M1/maven-surefire-common-3.0.0-M1.jar
Downloading from mavencentral: https://repo1.maven.org/maven2/org/apache/maven/surefire/surefire-api/3.0.0-M1/surefire-api-3.0.0-M1.jar
Downloading from mavencentral: https://repo1.maven.org/maven2/org/apache/maven/surefire/surefire-logger-api/3.0.0-M1/surefire-logger-api-3.0.0-M1.jar
Downloading from mavencentral: https://repo1.maven.org/maven2/org/apache/maven/surefire/surefire-booter/3.0.0-M1/surefire-booter-3.0.0-M1.jar
Downloading from mavencentral: https://repo1.maven.org/maven2/org/codehaus/plexus/plexus-java/0.9.11/plexus-java-0.9.11.jar
Progress (1): 2.7/13 kB
Progress (1): 5.5/13 kB
Progress (1): 8.2/13 kB
Progress (2): 8.2/13 kB | 2.7/178 kB
Progress (2): 11/13 kB | 2.7/178 kB 
Progress (2): 11/13 kB | 5.5/178 kB
Progress (2): 13 kB | 5.5/178 kB   
Progress (3): 13 kB | 5.5/178 kB | 2.7/312 kB
Progress (3): 13 kB | 5.5/178 kB | 5.5/312 kB
Progress (3): 13 kB | 5.5/178 kB | 8.2/312 kB
Progress (3): 13 kB | 5.5/178 kB | 11/312 kB 
Progress (3): 13 kB | 5.5/178 kB | 14/312 kB
Progress (3): 13 kB | 5.5/178 kB | 16/312 kB
Progress (3): 13 kB | 5.5/178 kB | 19/312 kB
Progress (4): 13 kB | 5.5/178 kB | 19/312 kB | 2.7/50 kB
Progress (5): 13 kB | 5.5/178 kB | 19/312 kB | 2.7/50 kB | 4.1/625 kB
Progress (5): 13 kB | 5.5/178 kB | 19/312 kB | 5.5/50 kB | 4.1/625 kB
Progress (5): 13 kB | 5.5/178 kB | 22/312 kB | 5.5/50 kB | 4.1/625 kB
                                                                     
Downloaded from mavencentral: https://repo1.maven.org/maven2/org/apache/maven/surefire/surefire-logger-api/3.0.0-M1/surefire-logger-api-3.0.0-M1.jar (13 kB at 518 kB/s)
Progress (4): 8.2/178 kB | 22/312 kB | 5.5/50 kB | 4.1/625 kB
Progress (4): 11/178 kB | 22/312 kB | 5.5/50 kB | 4.1/625 kB 
Progress (4): 14/178 kB | 22/312 kB | 5.5/50 kB | 4.1/625 kB
Progress (4): 14/178 kB | 25/312 kB | 5.5/50 kB | 4.1/625 kB
Progress (4): 14/178 kB | 25/312 kB | 8.2/50 kB | 4.1/625 kB
Progress (4): 14/178 kB | 25/312 kB | 8.2/50 kB | 8.2/625 kB
Progress (4): 14/178 kB | 25/312 kB | 11/50 kB | 8.2/625 kB 
Progress (4): 14/178 kB | 27/312 kB | 11/50 kB | 8.2/625 kB
Progress (4): 16/178 kB | 27/312 kB | 11/50 kB | 8.2/625 kB
Progress (4): 16/178 kB | 30/312 kB | 11/50 kB | 8.2/625 kB
Progress (4): 16/178 kB | 30/312 kB | 14/50 kB | 8.2/625 kB
Progress (4): 16/178 kB | 30/312 kB | 14/50 kB | 12/625 kB 
Progress (4): 16/178 kB | 30/312 kB | 16/50 kB | 12/625 kB
Progress (4): 16/178 kB | 33/312 kB | 16/50 kB | 12/625 kB
Progress (4): 19/178 kB | 33/312 kB | 16/50 kB | 12/625 kB
Progress (4): 19/178 kB | 36/312 kB | 16/50 kB | 12/625 kB
Progress (4): 19/178 kB | 36/312 kB | 19/50 kB | 12/625 kB
Progress (4): 19/178 kB | 36/312 kB | 19/50 kB | 16/625 kB
Progress (4): 19/178 kB | 36/312 kB | 22/50 kB | 16/625 kB
Progress (4): 19/178 kB | 38/312 kB | 22/50 kB | 16/625 kB
Progress (4): 22/178 kB | 38/312 kB | 22/50 kB | 16/625 kB
Progress (4): 22/178 kB | 41/312 kB | 22/50 kB | 16/625 kB
Progress (4): 22/178 kB | 41/312 kB | 25/50 kB | 16/625 kB
Progress (4): 22/178 kB | 41/312 kB | 25/50 kB | 20/625 kB
Progress (4): 22/178 kB | 41/312 kB | 27/50 kB | 20/625 kB
Progress (4): 22/178 kB | 44/312 kB | 27/50 kB | 20/625 kB
Progress (4): 25/178 kB | 44/312 kB | 27/50 kB | 20/625 kB
Progress (4): 25/178 kB | 47/312 kB | 27/50 kB | 20/625 kB
Progress (4): 25/178 kB | 47/312 kB | 30/50 kB | 20/625 kB
Progress (4): 25/178 kB | 47/312 kB | 30/50 kB | 25/625 kB
Progress (4): 25/178 kB | 47/312 kB | 33/50 kB | 25/625 kB
Progress (4): 25/178 kB | 49/312 kB | 33/50 kB | 25/625 kB
Progress (4): 27/178 kB | 49/312 kB | 33/50 kB | 25/625 kB
Progress (4): 27/178 kB | 52/312 kB | 33/50 kB | 25/625 kB
Progress (4): 27/178 kB | 52/312 kB | 36/50 kB | 25/625 kB
Progress (4): 27/178 kB | 52/312 kB | 36/50 kB | 29/625 kB
Progress (4): 27/178 kB | 52/312 kB | 38/50 kB | 29/625 kB
Progress (4): 27/178 kB | 55/312 kB | 38/50 kB | 29/625 kB
Progress (4): 30/178 kB | 55/312 kB | 38/50 kB | 29/625 kB
Progress (4): 30/178 kB | 58/312 kB | 38/50 kB | 29/625 kB
Progress (4): 30/178 kB | 58/312 kB | 41/50 kB | 29/625 kB
Progress (4): 30/178 kB | 58/312 kB | 41/50 kB | 33/625 kB
Progress (4): 30/178 kB | 58/312 kB | 44/50 kB | 33/625 kB
Progress (4): 30/178 kB | 60/312 kB | 44/50 kB | 33/625 kB
Progress (4): 33/178 kB | 60/312 kB | 44/50 kB | 33/625 kB
Progress (4): 33/178 kB | 63/312 kB | 44/50 kB | 33/625 kB
Progress (4): 33/178 kB | 63/312 kB | 47/50 kB | 33/625 kB
Progress (4): 33/178 kB | 63/312 kB | 47/50 kB | 37/625 kB
Progress (4): 33/178 kB | 63/312 kB | 49/50 kB | 37/625 kB
Progress (4): 33/178 kB | 66/312 kB | 49/50 kB | 37/625 kB
Progress (4): 36/178 kB | 66/312 kB | 49/50 kB | 37/625 kB
Progress (4): 36/178 kB | 69/312 kB | 49/50 kB | 37/625 kB
Progress (4): 36/178 kB | 69/312 kB | 50 kB | 37/625 kB   
Progress (4): 36/178 kB | 69/312 kB | 50 kB | 41/625 kB
Progress (4): 36/178 kB | 71/312 kB | 50 kB | 41/625 kB
Progress (4): 38/178 kB | 71/312 kB | 50 kB | 41/625 kB
Progress (4): 38/178 kB | 74/312 kB | 50 kB | 41/625 kB
Progress (4): 38/178 kB | 74/312 kB | 50 kB | 45/625 kB
Progress (4): 38/178 kB | 77/312 kB | 50 kB | 45/625 kB
Progress (4): 41/178 kB | 77/312 kB | 50 kB | 45/625 kB
Progress (4): 41/178 kB | 80/312 kB | 50 kB | 45/625 kB
Progress (4): 41/178 kB | 80/312 kB | 50 kB | 49/625 kB
Progress (4): 41/178 kB | 82/312 kB | 50 kB | 49/625 kB
Progress (4): 41/178 kB | 82/312 kB | 50 kB | 53/625 kB
Progress (4): 41/178 kB | 82/312 kB | 50 kB | 57/625 kB
Progress (4): 44/178 kB | 82/312 kB | 50 kB | 57/625 kB
Progress (4): 44/178 kB | 82/312 kB | 50 kB | 61/625 kB
Progress (4): 44/178 kB | 85/312 kB | 50 kB | 61/625 kB
Progress (4): 44/178 kB | 85/312 kB | 50 kB | 66/625 kB
Progress (4): 47/178 kB | 85/312 kB | 50 kB | 66/625 kB
                                                       
Downloaded from mavencentral: https://repo1.maven.org/maven2/org/codehaus/plexus/plexus-java/0.9.11/plexus-java-0.9.11.jar (50 kB at 698 kB/s)
Progress (3): 47/178 kB | 88/312 kB | 66/625 kB
Progress (3): 47/178 kB | 88/312 kB | 70/625 kB
Progress (3): 49/178 kB | 88/312 kB | 70/625 kB
Progress (3): 49/178 kB | 88/312 kB | 74/625 kB
Progress (3): 52/178 kB | 88/312 kB | 74/625 kB
Progress (3): 52/178 kB | 90/312 kB | 74/625 kB
Progress (3): 55/178 kB | 90/312 kB | 74/625 kB
Progress (3): 55/178 kB | 93/312 kB | 74/625 kB
Progress (3): 55/178 kB | 96/312 kB | 74/625 kB
Progress (3): 55/178 kB | 96/312 kB | 78/625 kB
Progress (3): 55/178 kB | 99/312 kB | 78/625 kB
Progress (3): 58/178 kB | 99/312 kB | 78/625 kB
Progress (3): 58/178 kB | 99/312 kB | 82/625 kB
Progress (3): 60/178 kB | 99/312 kB | 82/625 kB
Progress (3): 60/178 kB | 101/312 kB | 82/625 kB
Progress (3): 63/178 kB | 101/312 kB | 82/625 kB
Progress (3): 63/178 kB | 104/312 kB | 82/625 kB
Progress (3): 63/178 kB | 104/312 kB | 86/625 kB
Progress (3): 66/178 kB | 104/312 kB | 86/625 kB
Progress (3): 66/178 kB | 104/312 kB | 90/625 kB
Progress (3): 66/178 kB | 107/312 kB | 90/625 kB
Progress (3): 66/178 kB | 107/312 kB | 94/625 kB
Progress (3): 69/178 kB | 107/312 kB | 94/625 kB
Progress (3): 69/178 kB | 107/312 kB | 98/625 kB
Progress (3): 69/178 kB | 110/312 kB | 98/625 kB
Progress (3): 71/178 kB | 110/312 kB | 98/625 kB
Progress (3): 71/178 kB | 112/312 kB | 98/625 kB
Progress (3): 71/178 kB | 112/312 kB | 102/625 kB
Progress (3): 74/178 kB | 112/312 kB | 102/625 kB
Progress (3): 74/178 kB | 115/312 kB | 102/625 kB
Progress (3): 74/178 kB | 115/312 kB | 106/625 kB
Progress (3): 74/178 kB | 118/312 kB | 106/625 kB
Progress (3): 77/178 kB | 118/312 kB | 106/625 kB
Progress (3): 77/178 kB | 121/312 kB | 106/625 kB
Progress (3): 77/178 kB | 121/312 kB | 111/625 kB
Progress (3): 80/178 kB | 121/312 kB | 111/625 kB
Progress (3): 80/178 kB | 123/312 kB | 111/625 kB
Progress (3): 80/178 kB | 123/312 kB | 115/625 kB
Progress (3): 82/178 kB | 123/312 kB | 115/625 kB
Progress (3): 82/178 kB | 126/312 kB | 115/625 kB
Progress (3): 85/178 kB | 126/312 kB | 115/625 kB
Progress (3): 85/178 kB | 129/312 kB | 115/625 kB
Progress (3): 85/178 kB | 129/312 kB | 119/625 kB
Progress (3): 88/178 kB | 129/312 kB | 119/625 kB
Progress (3): 88/178 kB | 129/312 kB | 123/625 kB
Progress (3): 88/178 kB | 132/312 kB | 123/625 kB
Progress (3): 88/178 kB | 132/312 kB | 127/625 kB
Progress (3): 90/178 kB | 132/312 kB | 127/625 kB
Progress (3): 90/178 kB | 134/312 kB | 127/625 kB
Progress (3): 90/178 kB | 134/312 kB | 131/625 kB
Progress (3): 93/178 kB | 134/312 kB | 131/625 kB
Progress (3): 93/178 kB | 137/312 kB | 131/625 kB
Progress (3): 96/178 kB | 137/312 kB | 131/625 kB
Progress (3): 96/178 kB | 137/312 kB | 135/625 kB
Progress (3): 99/178 kB | 137/312 kB | 135/625 kB
Progress (3): 99/178 kB | 140/312 kB | 135/625 kB
Progress (3): 101/178 kB | 140/312 kB | 135/625 kB
Progress (3): 101/178 kB | 140/312 kB | 139/625 kB
Progress (3): 104/178 kB | 140/312 kB | 139/625 kB
Progress (3): 104/178 kB | 143/312 kB | 139/625 kB
Progress (3): 107/178 kB | 143/312 kB | 139/625 kB
Progress (3): 107/178 kB | 143/312 kB | 143/625 kB
Progress (3): 110/178 kB | 143/312 kB | 143/625 kB
Progress (3): 110/178 kB | 145/312 kB | 143/625 kB
Progress (3): 112/178 kB | 145/312 kB | 143/625 kB
Progress (3): 112/178 kB | 145/312 kB | 147/625 kB
Progress (3): 115/178 kB | 145/312 kB | 147/625 kB
Progress (3): 115/178 kB | 148/312 kB | 147/625 kB
Progress (3): 118/178 kB | 148/312 kB | 147/625 kB
Progress (3): 118/178 kB | 151/312 kB | 147/625 kB
Progress (3): 118/178 kB | 151/312 kB | 152/625 kB
Progress (3): 118/178 kB | 154/312 kB | 152/625 kB
Progress (3): 121/178 kB | 154/312 kB | 152/625 kB
Progress (3): 121/178 kB | 154/312 kB | 156/625 kB
Progress (3): 123/178 kB | 154/312 kB | 156/625 kB
Progress (3): 123/178 kB | 156/312 kB | 156/625 kB
Progress (3): 126/178 kB | 156/312 kB | 156/625 kB
Progress (3): 126/178 kB | 159/312 kB | 156/625 kB
Progress (3): 126/178 kB | 159/312 kB | 160/625 kB
Progress (3): 129/178 kB | 159/312 kB | 160/625 kB
Progress (3): 129/178 kB | 159/312 kB | 164/625 kB
Progress (3): 129/178 kB | 162/312 kB | 164/625 kB
Progress (3): 132/178 kB | 162/312 kB | 164/625 kB
Progress (3): 132/178 kB | 165/312 kB | 164/625 kB
Progress (3): 134/178 kB | 165/312 kB | 164/625 kB
Progress (3): 134/178 kB | 165/312 kB | 168/625 kB
Progress (3): 137/178 kB | 165/312 kB | 168/625 kB
Progress (3): 137/178 kB | 167/312 kB | 168/625 kB
Progress (3): 140/178 kB | 167/312 kB | 168/625 kB
Progress (3): 140/178 kB | 167/312 kB | 172/625 kB
Progress (3): 143/178 kB | 167/312 kB | 172/625 kB
Progress (3): 143/178 kB | 170/312 kB | 172/625 kB
Progress (3): 145/178 kB | 170/312 kB | 172/625 kB
Progress (3): 145/178 kB | 170/312 kB | 176/625 kB
Progress (3): 148/178 kB | 170/312 kB | 176/625 kB
Progress (3): 148/178 kB | 173/312 kB | 176/625 kB
Progress (3): 151/178 kB | 173/312 kB | 176/625 kB
Progress (3): 151/178 kB | 175/312 kB | 176/625 kB
Progress (3): 154/178 kB | 175/312 kB | 176/625 kB
Progress (3): 154/178 kB | 178/312 kB | 176/625 kB
Progress (3): 154/178 kB | 178/312 kB | 180/625 kB
Progress (3): 154/178 kB | 181/312 kB | 180/625 kB
Progress (3): 156/178 kB | 181/312 kB | 180/625 kB
Progress (3): 156/178 kB | 184/312 kB | 180/625 kB
Progress (3): 156/178 kB | 184/312 kB | 184/625 kB
Progress (3): 156/178 kB | 186/312 kB | 184/625 kB
Progress (3): 159/178 kB | 186/312 kB | 184/625 kB
Progress (3): 159/178 kB | 189/312 kB | 184/625 kB
Progress (3): 162/178 kB | 189/312 kB | 184/625 kB
Progress (3): 162/178 kB | 192/312 kB | 184/625 kB
Progress (3): 162/178 kB | 192/312 kB | 188/625 kB
Progress (3): 162/178 kB | 195/312 kB | 188/625 kB
Progress (3): 165/178 kB | 195/312 kB | 188/625 kB
Progress (3): 165/178 kB | 197/312 kB | 188/625 kB
Progress (3): 165/178 kB | 197/312 kB | 193/625 kB
Progress (3): 165/178 kB | 200/312 kB | 193/625 kB
Progress (3): 167/178 kB | 200/312 kB | 193/625 kB
Progress (3): 167/178 kB | 203/312 kB | 193/625 kB
Progress (3): 167/178 kB | 203/312 kB | 197/625 kB
Progress (3): 167/178 kB | 206/312 kB | 197/625 kB
Progress (3): 170/178 kB | 206/312 kB | 197/625 kB
Progress (3): 170/178 kB | 208/312 kB | 197/625 kB
Progress (3): 173/178 kB | 208/312 kB | 197/625 kB
Progress (3): 173/178 kB | 211/312 kB | 197/625 kB
Progress (3): 173/178 kB | 211/312 kB | 201/625 kB
Progress (3): 173/178 kB | 214/312 kB | 201/625 kB
Progress (3): 175/178 kB | 214/312 kB | 201/625 kB
Progress (3): 175/178 kB | 217/312 kB | 201/625 kB
Progress (3): 175/178 kB | 217/312 kB | 205/625 kB
Progress (3): 175/178 kB | 219/312 kB | 205/625 kB
Progress (3): 178 kB | 219/312 kB | 205/625 kB    
Progress (3): 178 kB | 222/312 kB | 205/625 kB
Progress (3): 178 kB | 222/312 kB | 209/625 kB
Progress (3): 178 kB | 225/312 kB | 209/625 kB
Progress (3): 178 kB | 225/312 kB | 213/625 kB
Progress (3): 178 kB | 228/312 kB | 213/625 kB
Progress (3): 178 kB | 230/312 kB | 213/625 kB
Progress (3): 178 kB | 230/312 kB | 217/625 kB
Progress (3): 178 kB | 233/312 kB | 217/625 kB
Progress (3): 178 kB | 236/312 kB | 217/625 kB
Progress (3): 178 kB | 239/312 kB | 217/625 kB
                                              
Downloaded from mavencentral: https://repo1.maven.org/maven2/org/apache/maven/surefire/surefire-api/3.0.0-M1/surefire-api-3.0.0-M1.jar (178 kB at 1.4 MB/s)
Progress (2): 239/312 kB | 221/625 kB
Progress (2): 241/312 kB | 221/625 kB
Progress (2): 241/312 kB | 225/625 kB
Progress (2): 241/312 kB | 229/625 kB
Progress (2): 244/312 kB | 229/625 kB
Progress (2): 247/312 kB | 229/625 kB
Progress (2): 247/312 kB | 233/625 kB
Progress (2): 250/312 kB | 233/625 kB
Progress (2): 250/312 kB | 238/625 kB
Progress (2): 252/312 kB | 238/625 kB
Progress (2): 252/312 kB | 242/625 kB
Progress (2): 255/312 kB | 242/625 kB
Progress (2): 255/312 kB | 246/625 kB
Progress (2): 258/312 kB | 246/625 kB
Progress (2): 260/312 kB | 246/625 kB
Progress (2): 260/312 kB | 250/625 kB
Progress (2): 263/312 kB | 250/625 kB
Progress (2): 263/312 kB | 254/625 kB
Progress (2): 266/312 kB | 254/625 kB
Progress (2): 266/312 kB | 258/625 kB
Progress (2): 269/312 kB | 258/625 kB
Progress (2): 269/312 kB | 262/625 kB
Progress (2): 271/312 kB | 262/625 kB
Progress (2): 274/312 kB | 262/625 kB
Progress (2): 274/312 kB | 266/625 kB
Progress (2): 277/312 kB | 266/625 kB
Progress (2): 277/312 kB | 270/625 kB
Progress (2): 280/312 kB | 270/625 kB
Progress (2): 280/312 kB | 274/625 kB
Progress (2): 282/312 kB | 274/625 kB
Progress (2): 282/312 kB | 279/625 kB
Progress (2): 285/312 kB | 279/625 kB
Progress (2): 288/312 kB | 279/625 kB
Progress (2): 288/312 kB | 283/625 kB
Progress (2): 291/312 kB | 283/625 kB
Progress (2): 291/312 kB | 287/625 kB
Progress (2): 293/312 kB | 287/625 kB
Progress (2): 293/312 kB | 291/625 kB
Progress (2): 293/312 kB | 295/625 kB
Progress (2): 296/312 kB | 295/625 kB
Progress (2): 299/312 kB | 295/625 kB
Progress (2): 299/312 kB | 299/625 kB
Progress (2): 302/312 kB | 299/625 kB
Progress (2): 302/312 kB | 303/625 kB
Progress (2): 304/312 kB | 303/625 kB
Progress (2): 304/312 kB | 307/625 kB
Progress (2): 307/312 kB | 307/625 kB
Progress (2): 307/312 kB | 311/625 kB
Progress (2): 310/312 kB | 311/625 kB
Progress (2): 312 kB | 311/625 kB    
Progress (2): 312 kB | 315/625 kB
Progress (2): 312 kB | 319/625 kB
Progress (2): 312 kB | 324/625 kB
Progress (2): 312 kB | 328/625 kB
Progress (2): 312 kB | 332/625 kB
Progress (2): 312 kB | 336/625 kB
Progress (2): 312 kB | 340/625 kB
Progress (2): 312 kB | 344/625 kB
Progress (2): 312 kB | 348/625 kB
                                 
Downloaded from mavencentral: https://repo1.maven.org/maven2/org/apache/maven/surefire/surefire-booter/3.0.0-M1/surefire-booter-3.0.0-M1.jar (312 kB at 2.0 MB/s)
Progress (1): 352/625 kB
Progress (1): 356/625 kB
Progress (1): 360/625 kB
Progress (1): 365/625 kB
Progress (1): 369/625 kB
Progress (1): 373/625 kB
Progress (1): 377/625 kB
Progress (1): 381/625 kB
Progress (1): 385/625 kB
Progress (1): 389/625 kB
Progress (1): 393/625 kB
Progress (1): 397/625 kB
Progress (1): 401/625 kB
Progress (1): 406/625 kB
Progress (1): 410/625 kB
Progress (1): 414/625 kB
Progress (1): 418/625 kB
Progress (1): 422/625 kB
Progress (1): 426/625 kB
Progress (1): 430/625 kB
Progress (1): 434/625 kB
Progress (1): 438/625 kB
Progress (1): 442/625 kB
Progress (1): 446/625 kB
Progress (1): 451/625 kB
Progress (1): 455/625 kB
Progress (1): 459/625 kB
Progress (1): 463/625 kB
Progress (1): 467/625 kB
Progress (1): 471/625 kB
Progress (1): 475/625 kB
Progress (1): 479/625 kB
Progress (1): 483/625 kB
Progress (1): 487/625 kB
Progress (1): 492/625 kB
Progress (1): 496/625 kB
Progress (1): 500/625 kB
Progress (1): 504/625 kB
Progress (1): 508/625 kB
Progress (1): 512/625 kB
Progress (1): 516/625 kB
Progress (1): 520/625 kB
Progress (1): 524/625 kB
Progress (1): 528/625 kB
Progress (1): 532/625 kB
Progress (1): 537/625 kB
Progress (1): 541/625 kB
Progress (1): 545/625 kB
Progress (1): 549/625 kB
Progress (1): 553/625 kB
Progress (1): 557/625 kB
Progress (1): 561/625 kB
Progress (1): 565/625 kB
Progress (1): 569/625 kB
Progress (1): 573/625 kB
Progress (1): 578/625 kB
Progress (1): 582/625 kB
Progress (1): 586/625 kB
Progress (1): 590/625 kB
Progress (1): 594/625 kB
Progress (1): 598/625 kB
Progress (1): 602/625 kB
Progress (1): 606/625 kB
Progress (1): 610/625 kB
Progress (1): 614/625 kB
Progress (1): 618/625 kB
Progress (1): 623/625 kB
Progress (1): 625 kB    
                    
Downloaded from mavencentral: https://repo1.maven.org/maven2/org/apache/maven/surefire/maven-surefire-common/3.0.0-M1/maven-surefire-common-3.0.0-M1.jar (625 kB at 3.3 MB/s)
[INFO] Tests are skipped.
[INFO] 
[INFO] --- maven-bundle-plugin:2.3.7:bundle (default-bundle) @ opendj-core ---
[INFO] 
[INFO] --- maven-javadoc-plugin:3.0.1:jar (default) @ opendj-core ---
[INFO] 
73 errors
8 warnings
[INFO] ------------------------------------------------------------------------
[INFO] Reactor Summary for OpenDJ Directory Services Project 4.0.0-SNAPSHOT:
[INFO] 
[INFO] OpenDJ BOM ......................................... SUCCESS [  2.194 s]
[INFO] OpenDJ Directory Services Project .................. SUCCESS [  0.631 s]
[INFO] OpenDJ Core APIs ................................... FAILURE [ 26.971 s]
[INFO] OpenDJ Doc Helper Maven Plugin ..................... SKIPPED
[INFO] OpenDJ Grizzly Transport Provider .................. SKIPPED
[INFO] OpenDJ CLI API ..................................... SKIPPED
[INFO] OpenDJ SDK Toolkit ................................. SKIPPED
[INFO] OpenDJ SDK Examples ................................ SKIPPED
[INFO] OpenDJ Commons REST Adapter ........................ SKIPPED
[INFO] OpenDJ Maven Plugin ................................ SKIPPED
[INFO] OpenDJ Configuration API ........................... SKIPPED
[INFO] OpenDJ Commons REST LDAP Gateway ................... SKIPPED
[INFO] OpenDJ Server NG ................................... SKIPPED
[INFO] OpenDJ Server ...................................... SKIPPED
[INFO] OpenDJ Server Example Plugin ....................... SKIPPED
[INFO] OpenDJ Legacy ...................................... SKIPPED
[INFO] OpenDJ DSML Gateway ................................ SKIPPED
[INFO] OpenDJ embedded server examples .................... SKIPPED
[INFO] OpenDJ account change notification handler for OpenIDM SKIPPED
[INFO] OpenDJ Doc Generated References .................... SKIPPED
[INFO] ------------------------------------------------------------------------
[INFO] BUILD FAILURE
[INFO] ------------------------------------------------------------------------
[INFO] Total time:  30.706 s
[INFO] Finished at: 2020-09-21T21:09:47Z
[INFO] ------------------------------------------------------------------------
[ERROR] Failed to execute goal org.apache.maven.plugins:maven-javadoc-plugin:3.0.1:jar (default) on project opendj-core: MavenReportException: Error while generating Javadoc: 
[ERROR] Exit code: 1 - /home/jenkins/.jenkins/jobs/gluu-opendj3/workspace/opendj-core/src/main/java/org/forgerock/opendj/ldap/ByteSequenceReader.java:302: error: malformed HTML
[ERROR]      * depending on its value (i.e: if value < 128, value will be encoded using one byte only).
[ERROR]                                              ^
[ERROR] /home/jenkins/.jenkins/jobs/gluu-opendj3/workspace/opendj-core/src/main/java/org/forgerock/opendj/ldap/ByteSequenceReader.java:324: error: malformed HTML
[ERROR]      * depending on its value (i.e: if value < 128, value will be encoded using one byte only).
[ERROR]                                              ^
[ERROR] /home/jenkins/.jenkins/jobs/gluu-opendj3/workspace/opendj-core/src/main/java/org/forgerock/opendj/ldap/ByteStringBuilder.java:303: error: bad HTML entity
[ERROR]      * int i8bits = i & 0xFF;
[ERROR]                       ^
[ERROR] /home/jenkins/.jenkins/jobs/gluu-opendj3/workspace/opendj-core/src/main/java/org/forgerock/opendj/ldap/ByteStringBuilder.java:646: error: bad HTML entity
[ERROR]      * int i16bits = i & 0xFFFF;
[ERROR]                        ^
[ERROR] /home/jenkins/.jenkins/jobs/gluu-opendj3/workspace/opendj-core/src/main/java/org/forgerock/opendj/ldap/Connection.java:48: warning: empty <p> tag
[ERROR]  * <p>
[ERROR]    ^
[ERROR] /home/jenkins/.jenkins/jobs/gluu-opendj3/workspace/opendj-core/src/main/java/org/forgerock/opendj/ldap/Connection.java:54: warning: empty <p> tag
[ERROR]  * <p>
[ERROR]    ^
[ERROR] /home/jenkins/.jenkins/jobs/gluu-opendj3/workspace/opendj-core/src/main/java/org/forgerock/opendj/ldap/Connection.java:67: warning: empty <p> tag
[ERROR]  * <p>
[ERROR]    ^
[ERROR] /home/jenkins/.jenkins/jobs/gluu-opendj3/workspace/opendj-core/src/main/java/org/forgerock/opendj/ldap/Connection.java:118: warning: empty <p> tag
[ERROR]  * <p>
[ERROR]    ^
[ERROR] /home/jenkins/.jenkins/jobs/gluu-opendj3/workspace/opendj-core/src/main/java/org/forgerock/opendj/ldap/Connection.java:130: warning: empty <p> tag
[ERROR]  * <p>
[ERROR]    ^
[ERROR] /home/jenkins/.jenkins/jobs/gluu-opendj3/workspace/opendj-core/src/main/java/org/forgerock/opendj/ldap/Connections.java:410: error: self-closing element not allowed
[ERROR]      * <p/>
[ERROR]        ^
[ERROR] /home/jenkins/.jenkins/jobs/gluu-opendj3/workspace/opendj-core/src/main/java/org/forgerock/opendj/ldap/Connections.java:415: error: self-closing element not allowed
[ERROR]      * <p/>
[ERROR]        ^
[ERROR] /home/jenkins/.jenkins/jobs/gluu-opendj3/workspace/opendj-core/src/main/java/org/forgerock/opendj/ldap/Connections.java:420: error: self-closing element not allowed
[ERROR]      * <p/>
[ERROR]        ^
[ERROR] /home/jenkins/.jenkins/jobs/gluu-opendj3/workspace/opendj-core/src/main/java/org/forgerock/opendj/ldap/Connections.java:473: error: self-closing element not allowed
[ERROR]      * <p/>
[ERROR]        ^
[ERROR] /home/jenkins/.jenkins/jobs/gluu-opendj3/workspace/opendj-core/src/main/java/org/forgerock/opendj/ldap/Connections.java:478: error: self-closing element not allowed
[ERROR]      * <p/>
[ERROR]        ^
[ERROR] /home/jenkins/.jenkins/jobs/gluu-opendj3/workspace/opendj-core/src/main/java/org/forgerock/opendj/ldap/Connections.java:483: error: self-closing element not allowed
[ERROR]      * <p/>
[ERROR]        ^
[ERROR] /home/jenkins/.jenkins/jobs/gluu-opendj3/workspace/opendj-core/src/main/java/org/forgerock/opendj/ldap/Connections.java:488: error: self-closing element not allowed
[ERROR]      * <p/>
[ERROR]        ^
[ERROR] /home/jenkins/.jenkins/jobs/gluu-opendj3/workspace/opendj-core/src/main/java/org/forgerock/opendj/ldap/Connections.java:524: error: self-closing element not allowed
[ERROR]      * <p/>
[ERROR]        ^
[ERROR] /home/jenkins/.jenkins/jobs/gluu-opendj3/workspace/opendj-core/src/main/java/org/forgerock/opendj/ldap/Connections.java:531: error: self-closing element not allowed
[ERROR]      * <p/>
[ERROR]        ^
[ERROR] /home/jenkins/.jenkins/jobs/gluu-opendj3/workspace/opendj-core/src/main/java/org/forgerock/opendj/ldap/Connections.java:536: error: self-closing element not allowed
[ERROR]      * <p/>
[ERROR]        ^
[ERROR] /home/jenkins/.jenkins/jobs/gluu-opendj3/workspace/opendj-core/src/main/java/org/forgerock/opendj/ldap/Connections.java:540: error: self-closing element not allowed
[ERROR]      * <p/>
[ERROR]        ^
[ERROR] /home/jenkins/.jenkins/jobs/gluu-opendj3/workspace/opendj-core/src/main/java/org/forgerock/opendj/ldap/Connections.java:642: error: self-closing element not allowed
[ERROR]      * <p/>
[ERROR]        ^
[ERROR] /home/jenkins/.jenkins/jobs/gluu-opendj3/workspace/opendj-core/src/main/java/org/forgerock/opendj/ldap/Connections.java:647: error: self-closing element not allowed
[ERROR]      * <p/>
[ERROR]        ^
[ERROR] /home/jenkins/.jenkins/jobs/gluu-opendj3/workspace/opendj-core/src/main/java/org/forgerock/opendj/ldap/Connections.java:652: error: self-closing element not allowed
[ERROR]      * <p/>
[ERROR]        ^
[ERROR] /home/jenkins/.jenkins/jobs/gluu-opendj3/workspace/opendj-core/src/main/java/org/forgerock/opendj/ldap/Connections.java:656: error: self-closing element not allowed
[ERROR]      * <p/>
[ERROR]        ^
[ERROR] /home/jenkins/.jenkins/jobs/gluu-opendj3/workspace/opendj-core/src/main/java/org/forgerock/opendj/ldap/DN.java:826: error: bad use of '>'
[ERROR]      * DN.valueOf("ou=people,dc=example,dc=com").rdn(0) => "ou=people"
[ERROR]                                                          ^
[ERROR] /home/jenkins/.jenkins/jobs/gluu-opendj3/workspace/opendj-core/src/main/java/org/forgerock/opendj/ldap/DN.java:827: error: bad use of '>'
[ERROR]      * DN.valueOf("ou=people,dc=example,dc=com").rdn(1) => "dc=example"
[ERROR]                                                          ^
[ERROR] /home/jenkins/.jenkins/jobs/gluu-opendj3/workspace/opendj-core/src/main/java/org/forgerock/opendj/ldap/DN.java:828: error: bad use of '>'
[ERROR]      * DN.valueOf("ou=people,dc=example,dc=com").rdn(2) => "dc=com"
[ERROR]                                                          ^
[ERROR] /home/jenkins/.jenkins/jobs/gluu-opendj3/workspace/opendj-core/src/main/java/org/forgerock/opendj/ldap/DN.java:829: error: bad use of '>'
[ERROR]      * DN.valueOf("ou=people,dc=example,dc=com").rdn(3) => null
[ERROR]                                                          ^
[ERROR] /home/jenkins/.jenkins/jobs/gluu-opendj3/workspace/opendj-core/src/main/java/org/forgerock/opendj/ldap/Filter.java:56: error: bad HTML entity
[ERROR]  * Filter filter = Filter.format("(&(cn=%s)(age>=%s))", "bjensen", 21);
[ERROR]                                    ^
[ERROR] /home/jenkins/.jenkins/jobs/gluu-opendj3/workspace/opendj-core/src/main/java/org/forgerock/opendj/ldap/Filter.java:56: error: bad use of '>'
[ERROR]  * Filter filter = Filter.format("(&(cn=%s)(age>=%s))", "bjensen", 21);
[ERROR]                                                ^
[ERROR] /home/jenkins/.jenkins/jobs/gluu-opendj3/workspace/opendj-core/src/main/java/org/forgerock/opendj/ldap/RDN.java:92: error: malformed HTML
[ERROR]      * SortedMap<DN, Entry> entries = ...;
[ERROR]                 ^
[ERROR] /home/jenkins/.jenkins/jobs/gluu-opendj3/workspace/opendj-core/src/main/java/org/forgerock/opendj/ldap/RDN.java:92: error: bad use of '>'
[ERROR]      * SortedMap<DN, Entry> entries = ...;
[ERROR]                           ^
[ERROR] /home/jenkins/.jenkins/jobs/gluu-opendj3/workspace/opendj-core/src/main/java/org/forgerock/opendj/ldap/RDN.java:96: error: malformed HTML
[ERROR]      * SortedMap<DN,Entry> subtree = entries.subMap(
[ERROR]                 ^
[ERROR] /home/jenkins/.jenkins/jobs/gluu-opendj3/workspace/opendj-core/src/main/java/org/forgerock/opendj/ldap/RDN.java:96: error: bad use of '>'
[ERROR]      * SortedMap<DN,Entry> subtree = entries.subMap(
[ERROR]                          ^
[ERROR] /home/jenkins/.jenkins/jobs/gluu-opendj3/workspace/opendj-core/src/main/java/org/forgerock/opendj/ldap/RDN.java:116: error: malformed HTML
[ERROR]      * SortedMap<DN, Entry> entries = ...;
[ERROR]                 ^
[ERROR] /home/jenkins/.jenkins/jobs/gluu-opendj3/workspace/opendj-core/src/main/java/org/forgerock/opendj/ldap/RDN.java:116: error: bad use of '>'
[ERROR]      * SortedMap<DN, Entry> entries = ...;
[ERROR]                           ^
[ERROR] /home/jenkins/.jenkins/jobs/gluu-opendj3/workspace/opendj-core/src/main/java/org/forgerock/opendj/ldap/RDN.java:120: error: malformed HTML
[ERROR]      * SortedMap<DN,Entry> subtree = entries.subMap(baseDN, baseDN.child(RDN.maxValue()));
[ERROR]                 ^
[ERROR] /home/jenkins/.jenkins/jobs/gluu-opendj3/workspace/opendj-core/src/main/java/org/forgerock/opendj/ldap/RDN.java:120: error: bad use of '>'
[ERROR]      * SortedMap<DN,Entry> subtree = entries.subMap(baseDN, baseDN.child(RDN.maxValue()));
[ERROR]                          ^
[ERROR] /home/jenkins/.jenkins/jobs/gluu-opendj3/workspace/opendj-core/src/main/java/org/forgerock/opendj/ldap/SortKey.java:50: error: bad use of '>'
[ERROR]  * Comparator&lt;Entry> comparator = SortKey.comparator("cn");
[ERROR]                       ^
[ERROR] /home/jenkins/.jenkins/jobs/gluu-opendj3/workspace/opendj-core/src/main/java/org/forgerock/opendj/ldap/SortKey.java:51: error: bad use of '>'
[ERROR]  * Set&lt;SearchResultEntry>; results = new TreeSet&lt;SearchResultEntry>(comparator);
[ERROR]                            ^
[ERROR] /home/jenkins/.jenkins/jobs/gluu-opendj3/workspace/opendj-core/src/main/java/org/forgerock/opendj/ldap/SortKey.java:51: error: bad use of '>'
[ERROR]  * Set&lt;SearchResultEntry>; results = new TreeSet&lt;SearchResultEntry>(comparator);
[ERROR]                                                                         ^
[ERROR] /home/jenkins/.jenkins/jobs/gluu-opendj3/workspace/opendj-core/src/main/java/org/forgerock/opendj/ldap/controls/ADNotificationRequestControl.java:24: error: self-closing element not allowed
[ERROR]  * <br/>
[ERROR]    ^
[ERROR] /home/jenkins/.jenkins/jobs/gluu-opendj3/workspace/opendj-core/src/main/java/org/forgerock/opendj/ldap/controls/ADNotificationRequestControl.java:42: error: bad HTML entity
[ERROR]  *         if (isDeleted != null && isDeleted) {
[ERROR]                                  ^
[ERROR] /home/jenkins/.jenkins/jobs/gluu-opendj3/workspace/opendj-core/src/main/java/org/forgerock/opendj/ldap/controls/ADNotificationRequestControl.java:42: error: bad HTML entity
[ERROR]  *         if (isDeleted != null && isDeleted) {
[ERROR]                                   ^
[ERROR] /home/jenkins/.jenkins/jobs/gluu-opendj3/workspace/opendj-core/src/main/java/org/forgerock/opendj/ldap/controls/ADNotificationRequestControl.java:47: error: bad HTML entity
[ERROR]  *         if (whenCreated != null && whenChanged != null) {
[ERROR]                                    ^
[ERROR] /home/jenkins/.jenkins/jobs/gluu-opendj3/workspace/opendj-core/src/main/java/org/forgerock/opendj/ldap/controls/ADNotificationRequestControl.java:47: error: bad HTML entity
[ERROR]  *         if (whenCreated != null && whenChanged != null) {
[ERROR]                                     ^
[ERROR] /home/jenkins/.jenkins/jobs/gluu-opendj3/workspace/opendj-core/src/main/java/org/forgerock/opendj/ldap/controls/Control.java:38: error: bad HTML entity
[ERROR]  * if (supported != null && !supported.isEmpty() && supported.contains(OID)) {
[ERROR]                          ^
[ERROR] /home/jenkins/.jenkins/jobs/gluu-opendj3/workspace/opendj-core/src/main/java/org/forgerock/opendj/ldap/controls/Control.java:38: error: bad HTML entity
[ERROR]  * if (supported != null && !supported.isEmpty() && supported.contains(OID)) {
[ERROR]                           ^
[ERROR] /home/jenkins/.jenkins/jobs/gluu-opendj3/workspace/opendj-core/src/main/java/org/forgerock/opendj/ldap/controls/Control.java:38: error: bad HTML entity
[ERROR]  * if (supported != null && !supported.isEmpty() && supported.contains(OID)) {
[ERROR]                                                  ^
[ERROR] /home/jenkins/.jenkins/jobs/gluu-opendj3/workspace/opendj-core/src/main/java/org/forgerock/opendj/ldap/controls/Control.java:38: error: bad HTML entity
[ERROR]  * if (supported != null && !supported.isEmpty() && supported.contains(OID)) {
[ERROR]                                                   ^
[ERROR] /home/jenkins/.jenkins/jobs/gluu-opendj3/workspace/opendj-core/src/main/java/org/forgerock/opendj/ldap/controls/PasswordExpiredResponseControl.java:48: error: bad HTML entity
[ERROR]  *         if (!(control == null) && control.hasValue()) {
[ERROR]                                   ^
[ERROR] /home/jenkins/.jenkins/jobs/gluu-opendj3/workspace/opendj-core/src/main/java/org/forgerock/opendj/ldap/controls/PasswordExpiredResponseControl.java:48: error: bad HTML entity
[ERROR]  *         if (!(control == null) && control.hasValue()) {
[ERROR]                                    ^
[ERROR] /home/jenkins/.jenkins/jobs/gluu-opendj3/workspace/opendj-core/src/main/java/org/forgerock/opendj/ldap/controls/PasswordExpiringResponseControl.java:46: error: bad HTML entity
[ERROR]  *     if (!(control == null) && control.hasValue()) {
[ERROR]                               ^
[ERROR] /home/jenkins/.jenkins/jobs/gluu-opendj3/workspace/opendj-core/src/main/java/org/forgerock/opendj/ldap/controls/PasswordExpiringResponseControl.java:46: error: bad HTML entity
[ERROR]  *     if (!(control == null) && control.hasValue()) {
[ERROR]                                ^
[ERROR] /home/jenkins/.jenkins/jobs/gluu-opendj3/workspace/opendj-core/src/main/java/org/forgerock/opendj/ldap/controls/PasswordPolicyRequestControl.java:52: error: bad HTML entity
[ERROR]  *     if (!(control == null) && !(control.getWarningType() == null)) {
[ERROR]                               ^
[ERROR] /home/jenkins/.jenkins/jobs/gluu-opendj3/workspace/opendj-core/src/main/java/org/forgerock/opendj/ldap/controls/PasswordPolicyRequestControl.java:52: error: bad HTML entity
[ERROR]  *     if (!(control == null) && !(control.getWarningType() == null)) {
[ERROR]                                ^
[ERROR] /home/jenkins/.jenkins/jobs/gluu-opendj3/workspace/opendj-core/src/main/java/org/forgerock/opendj/ldap/controls/PasswordPolicyResponseControl.java:54: error: bad HTML entity
[ERROR]  *     if (!(control == null) && !(control.getWarningType() == null)) {
[ERROR]                               ^
[ERROR] /home/jenkins/.jenkins/jobs/gluu-opendj3/workspace/opendj-core/src/main/java/org/forgerock/opendj/ldap/controls/PasswordPolicyResponseControl.java:54: error: bad HTML entity
[ERROR]  *     if (!(control == null) && !(control.getWarningType() == null)) {
[ERROR]                                ^
[ERROR] /home/jenkins/.jenkins/jobs/gluu-opendj3/workspace/opendj-core/src/main/java/org/forgerock/opendj/ldap/controls/ServerSideSortRequestControl.java:69: error: bad HTML entity
[ERROR]  * if (control != null && control.getResult() == ResultCode.SUCCESS) {
[ERROR]                        ^
[ERROR] /home/jenkins/.jenkins/jobs/gluu-opendj3/workspace/opendj-core/src/main/java/org/forgerock/opendj/ldap/controls/ServerSideSortRequestControl.java:69: error: bad HTML entity
[ERROR]  * if (control != null && control.getResult() == ResultCode.SUCCESS) {
[ERROR]                         ^
[ERROR] /home/jenkins/.jenkins/jobs/gluu-opendj3/workspace/opendj-core/src/main/java/org/forgerock/opendj/ldap/controls/ServerSideSortResponseControl.java:63: error: bad HTML entity
[ERROR]  * if (control != null && control.getResult() == ResultCode.SUCCESS) {
[ERROR]                        ^
[ERROR] /home/jenkins/.jenkins/jobs/gluu-opendj3/workspace/opendj-core/src/main/java/org/forgerock/opendj/ldap/controls/ServerSideSortResponseControl.java:63: error: bad HTML entity
[ERROR]  * if (control != null && control.getResult() == ResultCode.SUCCESS) {
[ERROR]                         ^
[ERROR] /home/jenkins/.jenkins/jobs/gluu-opendj3/workspace/opendj-core/src/main/java/org/forgerock/opendj/ldap/requests/ExtendedRequest.java:46: error: bad HTML entity
[ERROR]  * if (supported != null && !supported.isEmpty() && supported.contains(OID)) {
[ERROR]                          ^
[ERROR] /home/jenkins/.jenkins/jobs/gluu-opendj3/workspace/opendj-core/src/main/java/org/forgerock/opendj/ldap/requests/ExtendedRequest.java:46: error: bad HTML entity
[ERROR]  * if (supported != null && !supported.isEmpty() && supported.contains(OID)) {
[ERROR]                           ^
[ERROR] /home/jenkins/.jenkins/jobs/gluu-opendj3/workspace/opendj-core/src/main/java/org/forgerock/opendj/ldap/requests/ExtendedRequest.java:46: error: bad HTML entity
[ERROR]  * if (supported != null && !supported.isEmpty() && supported.contains(OID)) {
[ERROR]                                                  ^
[ERROR] /home/jenkins/.jenkins/jobs/gluu-opendj3/workspace/opendj-core/src/main/java/org/forgerock/opendj/ldap/requests/ExtendedRequest.java:46: error: bad HTML entity
[ERROR]  * if (supported != null && !supported.isEmpty() && supported.contains(OID)) {
[ERROR]                                                   ^
[ERROR] /home/jenkins/.jenkins/jobs/gluu-opendj3/workspace/opendj-core/src/main/java/org/forgerock/opendj/ldap/requests/PasswordModifyExtendedRequest.java:39: error: bad use of '>'
[ERROR]  * String userIdentity = ...; // For example, u:&lt;uid> or dn:&lt;DN>
[ERROR]                                                        ^
[ERROR] /home/jenkins/.jenkins/jobs/gluu-opendj3/workspace/opendj-core/src/main/java/org/forgerock/opendj/ldap/requests/PasswordModifyExtendedRequest.java:39: error: bad use of '>'
[ERROR]  * String userIdentity = ...; // For example, u:&lt;uid> or dn:&lt;DN>
[ERROR]                                                                      ^
[ERROR] /home/jenkins/.jenkins/jobs/gluu-opendj3/workspace/opendj-core/src/main/java/org/forgerock/opendj/ldap/requests/PlainSASLBindRequest.java:38: error: bad use of '>'
[ERROR]  * String authcid = ...;        // Authentication ID, e.g. dn:&lt;dn>, u:&lt;uid>
[ERROR]                                                                     ^
[ERROR] /home/jenkins/.jenkins/jobs/gluu-opendj3/workspace/opendj-core/src/main/java/org/forgerock/opendj/ldap/requests/PlainSASLBindRequest.java:38: error: bad use of '>'
[ERROR]  * String authcid = ...;        // Authentication ID, e.g. dn:&lt;dn>, u:&lt;uid>
[ERROR]                                                                                 ^
[ERROR] /home/jenkins/.jenkins/jobs/gluu-opendj3/workspace/opendj-core/src/main/java/org/forgerock/opendj/ldap/requests/PlainSASLBindRequest.java:39: error: bad use of '>'
[ERROR]  * String authzid = ...;        // Authorization ID, e.g. dn:&lt;dn>, u:&lt;uid>
[ERROR]                                                                    ^
[ERROR] /home/jenkins/.jenkins/jobs/gluu-opendj3/workspace/opendj-core/src/main/java/org/forgerock/opendj/ldap/requests/PlainSASLBindRequest.java:39: error: bad use of '>'
[ERROR]  * String authzid = ...;        // Authorization ID, e.g. dn:&lt;dn>, u:&lt;uid>
[ERROR]                                                                                ^
[ERROR] /home/jenkins/.jenkins/jobs/gluu-opendj3/workspace/opendj-core/src/main/java/org/forgerock/opendj/ldap/requests/SASLBindRequest.java:33: error: unknown tag: TODO
[ERROR]  * <TODO>finish doc.
[ERROR]    ^
[ERROR] /home/jenkins/.jenkins/jobs/gluu-opendj3/workspace/opendj-core/src/main/java/org/forgerock/opendj/ldap/spi/LDAPConnectionImpl.java:119: error: self-closing element not allowed
[ERROR]      * <p/>
[ERROR]        ^
[ERROR] /home/jenkins/.jenkins/jobs/gluu-opendj3/workspace/opendj-core/src/main/java/org/forgerock/opendj/ldap/spi/LDAPConnectionImpl.java:128: error: self-closing element not allowed
[ERROR]      * <p/>
[ERROR]        ^
[ERROR] /home/jenkins/.jenkins/jobs/gluu-opendj3/workspace/opendj-core/src/main/java/org/forgerock/opendj/ldif/LDIF.java:293: error: unknown tag: Entry
[ERROR]      * List<Entry> smiths = TestCaseUtils.makeEntries(
[ERROR]            ^
[ERROR] /home/jenkins/.jenkins/jobs/gluu-opendj3/workspace/opendj-core/src/main/java/org/forgerock/opendj/security/KeyStoreParameters.java:45: error: self-closing element not allowed
[ERROR]      * <p/>
[ERROR]        ^
[ERROR] /home/jenkins/.jenkins/jobs/gluu-opendj3/workspace/opendj-core/src/main/java/org/forgerock/opendj/security/package-info.java:22: warning: empty <p> tag
[ERROR]  * <p>
[ERROR]    ^
[ERROR] /home/jenkins/.jenkins/jobs/gluu-opendj3/workspace/opendj-core/src/main/java/org/forgerock/opendj/security/package-info.java:33: warning: empty <p> tag
[ERROR]  * <p>
[ERROR]    ^
[ERROR] /home/jenkins/.jenkins/jobs/gluu-opendj3/workspace/opendj-core/src/main/java/org/forgerock/opendj/security/package-info.java:58: warning: empty <p> tag
[ERROR]  * <p>
[ERROR]    ^
[ERROR] /home/jenkins/.jenkins/jobs/gluu-opendj3/workspace/opendj-core/src/main/java/org/forgerock/opendj/ldap/LDAPConnectionFactory.java:681: error: bad use of '>'
[ERROR]      *     <li> LOCKED_SHARED(>0) - the synchronizer is held shared and cannot be acquired exclusively. N shared locks
[ERROR]                               ^
[ERROR] 
[ERROR] Command line was: /usr/lib/jvm/java-1.8.0-openjdk-1.8.0.222.b10-0.el7_6.x86_64/jre/../bin/javadoc @options @packages
[ERROR] 
[ERROR] Refer to the generated Javadoc files in '/home/jenkins/.jenkins/jobs/gluu-opendj3/workspace/opendj-core/target/apidocs' dir.
[ERROR] 
[ERROR] -> [Help 1]
[ERROR] 
[ERROR] To see the full stack trace of the errors, re-run Maven with the -e switch.
[ERROR] Re-run Maven using the -X switch to enable full debug logging.
[ERROR] 
[ERROR] For more information about the errors and possible solutions, please read the following articles:
[ERROR] [Help 1] http://cwiki.apache.org/confluence/display/MAVEN/MojoExecutionException
[ERROR] 
[ERROR] After correcting the problems, you can resume the build with the command
[ERROR]   mvn <args> -rf :opendj-core
Build step 'Invoke top-level Maven targets' marked build as failure
Not sending mail to unregistered user Yuriy.Movchan@gmail.com
Sending e-mails to: support@gluu.org
Finished: FAILURE