AbortedConsole Output

Started by user Yuriy Movchan
Building on master in workspace /home/tomcat/.jenkins/jobs/gluu-jdbc-cb/workspace
No credentials specified
 > git rev-parse --is-inside-work-tree # timeout=10
Fetching changes from the remote Git repository
 > git config remote.origin.url https://github.com/GluuFederation/gluu-jdbc-cb # timeout=10
Fetching upstream changes from https://github.com/GluuFederation/gluu-jdbc-cb
 > git --version # timeout=10
 > git fetch --tags --progress https://github.com/GluuFederation/gluu-jdbc-cb +refs/heads/*:refs/remotes/origin/*
 > git rev-parse refs/remotes/origin/master^{commit} # timeout=10
 > git rev-parse refs/remotes/origin/origin/master^{commit} # timeout=10
Checking out Revision b382f9eeef4b5c94e1c7f5c1b74e6d33f5f8a28a (refs/remotes/origin/master)
 > git config core.sparsecheckout # timeout=10
 > git checkout -f b382f9eeef4b5c94e1c7f5c1b74e6d33f5f8a28a
Commit message: "Add prefix to lib name"
 > git rev-list --no-walk 9fd0c43ac018a3a069c24d7cf45c7ef8b48763b7 # timeout=10
[workspace] $ /home/tomcat/.jenkins/tools/hudson.tasks.Maven_MavenInstallation/maven_3.3.9/bin/mvn -DVERSION_NAME=master -DMAVEN_SKIP_TESTS=true -Dmaven.test.skip=true clean compile install findbugs:findbugs
[INFO] Scanning for projects...
[INFO]                                                                         
[INFO] ------------------------------------------------------------------------
[INFO] Building Couchbase JDBC-JSON Driver 1.0.0.Final
[INFO] ------------------------------------------------------------------------
[INFO] 
[INFO] --- maven-clean-plugin:2.5:clean (default-clean) @ gluu-jdbc-n1ql ---
[INFO] Deleting /home/tomcat/.jenkins/jobs/gluu-jdbc-cb/workspace/target
[INFO] 
[INFO] --- maven-enforcer-plugin:1.0:enforce (enforce-maven) @ gluu-jdbc-n1ql ---
[INFO] 
[INFO] --- maven-resources-plugin:2.6:resources (default-resources) @ gluu-jdbc-n1ql ---
[INFO] Using 'UTF-8' encoding to copy filtered resources.
[INFO] Copying 1 resource
[INFO] 
[INFO] --- maven-compiler-plugin:3.3:compile (default-compile) @ gluu-jdbc-n1ql ---
[INFO] Changes detected - recompiling the module!
[INFO] Compiling 29 source files to /home/tomcat/.jenkins/jobs/gluu-jdbc-cb/workspace/target/classes
[INFO] /home/tomcat/.jenkins/jobs/gluu-jdbc-cb/workspace/src/main/java/com/couchbase/jdbc/CBConnection.java: Some input files use or override a deprecated API.
[INFO] /home/tomcat/.jenkins/jobs/gluu-jdbc-cb/workspace/src/main/java/com/couchbase/jdbc/CBConnection.java: Recompile with -Xlint:deprecation for details.
[INFO] /home/tomcat/.jenkins/jobs/gluu-jdbc-cb/workspace/src/main/java/com/couchbase/jdbc/CBResultSet.java: Some input files use unchecked or unsafe operations.
[INFO] /home/tomcat/.jenkins/jobs/gluu-jdbc-cb/workspace/src/main/java/com/couchbase/jdbc/CBResultSet.java: Recompile with -Xlint:unchecked for details.
[INFO] 
[INFO] --- maven-enforcer-plugin:1.0:enforce (enforce-maven) @ gluu-jdbc-n1ql ---
[INFO] 
[INFO] --- maven-resources-plugin:2.6:resources (default-resources) @ gluu-jdbc-n1ql ---
[INFO] Using 'UTF-8' encoding to copy filtered resources.
[INFO] Copying 1 resource
[INFO] 
[INFO] --- maven-compiler-plugin:3.3:compile (default-compile) @ gluu-jdbc-n1ql ---
[INFO] Nothing to compile - all classes are up to date
[INFO] 
[INFO] --- maven-resources-plugin:2.6:testResources (default-testResources) @ gluu-jdbc-n1ql ---
[INFO] Not copying test resources
[INFO] 
[INFO] --- maven-compiler-plugin:3.3:testCompile (default-testCompile) @ gluu-jdbc-n1ql ---
[INFO] Not compiling test sources
[INFO] 
[INFO] --- maven-surefire-plugin:2.12.4:test (default-test) @ gluu-jdbc-n1ql ---
[INFO] Tests are skipped.
[INFO] 
[INFO] --- maven-jar-plugin:2.4:jar (default-jar) @ gluu-jdbc-n1ql ---
[INFO] Building jar: /home/tomcat/.jenkins/jobs/gluu-jdbc-cb/workspace/target/gluu-jdbc-n1ql-1.0.0.Final.jar
[INFO] 
[INFO] --- maven-shade-plugin:2.4:shade (default) @ gluu-jdbc-n1ql ---
[INFO] Including org.apache.httpcomponents:httpclient:jar:4.5.3 in the shaded jar.
[INFO] Including org.apache.httpcomponents:httpcore:jar:4.4.6 in the shaded jar.
[INFO] Including commons-logging:commons-logging:jar:1.2 in the shaded jar.
[INFO] Including commons-codec:commons-codec:jar:1.9 in the shaded jar.
[INFO] Including com.googlecode.json-simple:json-simple:jar:1.1.1 in the shaded jar.
[INFO] Including org.slf4j:slf4j-api:jar:1.7.25 in the shaded jar.
[INFO] Including ch.qos.logback:logback-classic:jar:1.2.3 in the shaded jar.
[INFO] Including ch.qos.logback:logback-core:jar:1.2.3 in the shaded jar.
[INFO] Including io.fastjson:boon:jar:0.34 in the shaded jar.
[INFO] Replacing original artifact with shaded artifact.
[INFO] Replacing /home/tomcat/.jenkins/jobs/gluu-jdbc-cb/workspace/target/gluu-jdbc-n1ql-1.0.0.Final.jar with /home/tomcat/.jenkins/jobs/gluu-jdbc-cb/workspace/target/gluu-jdbc-n1ql-1.0.0.Final-shaded.jar
[INFO] Dependency-reduced POM written at: /home/tomcat/.jenkins/jobs/gluu-jdbc-cb/workspace/dependency-reduced-pom.xml
[INFO] Dependency-reduced POM written at: /home/tomcat/.jenkins/jobs/gluu-jdbc-cb/workspace/dependency-reduced-pom.xml
[INFO] 
[INFO] --- maven-install-plugin:2.4:install (default-install) @ gluu-jdbc-n1ql ---
[INFO] Installing /home/tomcat/.jenkins/jobs/gluu-jdbc-cb/workspace/target/gluu-jdbc-n1ql-1.0.0.Final.jar to /var/www/html/maven/org/gluu/jdbc/gluu-jdbc-n1ql/1.0.0.Final/gluu-jdbc-n1ql-1.0.0.Final.jar
[INFO] Installing /home/tomcat/.jenkins/jobs/gluu-jdbc-cb/workspace/dependency-reduced-pom.xml to /var/www/html/maven/org/gluu/jdbc/gluu-jdbc-n1ql/1.0.0.Final/gluu-jdbc-n1ql-1.0.0.Final.pom
[INFO] 
[INFO] --- findbugs-maven-plugin:3.0.5:findbugs (default-cli) @ gluu-jdbc-n1ql ---
[INFO] Fork Value is true
[INFO] ------------------------------------------------------------------------
[INFO] BUILD FAILURE
[INFO] ------------------------------------------------------------------------
[INFO] Total time: 14.056 s
[INFO] Finished at: 2019-05-20T11:13:06-04:00
[INFO] Final Memory: 34M/453M
[INFO] ------------------------------------------------------------------------
[ERROR] Failed to execute goal org.codehaus.mojo:findbugs-maven-plugin:3.0.5:findbugs (default-cli) on project gluu-jdbc-n1ql: Execution default-cli of goal org.codehaus.mojo:findbugs-maven-plugin:3.0.5:findbugs failed: Java returned: 143 -> [Help 1]
[ERROR] 
[ERROR] To see the full stack trace of the errors, re-run Maven with the -e switch.
[ERROR] Re-run Maven using the -X switch to enable full debug logging.
[ERROR] 
[ERROR] For more information about the errors and possible solutions, please read the following articles:
[ERROR] [Help 1] http://cwiki.apache.org/confluence/display/MAVEN/PluginExecutionException
Build was aborted
Aborted by Yuriy Movchan
[FINDBUGS] Skipping publisher since build result is ABORTED
Build Aborted. Not looking for any TestNG results.
Finished: ABORTED