FailedConsole Output

Skipping 2,956 KB.. Full Log
e.run(ReflectiveCallable.java:12)
	at org.junit.runners.model.FrameworkMethod.invokeExplosively(FrameworkMethod.java:47)
	at org.junit.internal.runners.statements.RunBefores.evaluate(RunBefores.java:24)
	at org.junit.internal.runners.statements.RunAfters.evaluate(RunAfters.java:27)
	at org.junit.runners.ParentRunner.runLeaf(ParentRunner.java:325)
	at org.junit.runners.BlockJUnit4ClassRunner.runChild(BlockJUnit4ClassRunner.java:78)
	at org.junit.runners.BlockJUnit4ClassRunner.runChild(BlockJUnit4ClassRunner.java:57)
	at org.junit.runners.ParentRunner$3.run(ParentRunner.java:290)
	at org.junit.runners.ParentRunner$1.schedule(ParentRunner.java:71)
	at org.junit.runners.ParentRunner.runChildren(ParentRunner.java:288)
	at org.junit.runners.ParentRunner.access$000(ParentRunner.java:58)
	at org.junit.runners.ParentRunner$2.evaluate(ParentRunner.java:268)
	at org.junit.internal.runners.statements.RunBefores.evaluate(RunBefores.java:26)
	at org.junit.runners.ParentRunner.run(ParentRunner.java:363)
	at org.apache.maven.surefire.junit4.JUnit4Provider.execute(JUnit4Provider.java:252)
	at org.apache.maven.surefire.junit4.JUnit4Provider.executeTestSet(JUnit4Provider.java:141)
	at org.apache.maven.surefire.junit4.JUnit4Provider.invoke(JUnit4Provider.java:112)
	at sun.reflect.NativeMethodAccessorImpl.invoke0(Native Method)
	at sun.reflect.NativeMethodAccessorImpl.invoke(NativeMethodAccessorImpl.java:62)
	at sun.reflect.DelegatingMethodAccessorImpl.invoke(DelegatingMethodAccessorImpl.java:43)
	at java.lang.reflect.Method.invoke(Method.java:498)
	at org.apache.maven.surefire.util.ReflectionUtils.invokeMethodWithArray(ReflectionUtils.java:189)
	at org.apache.maven.surefire.booter.ProviderFactory$ProviderProxy.invoke(ProviderFactory.java:165)
	at org.apache.maven.surefire.booter.ProviderFactory.invokeProvider(ProviderFactory.java:85)
	at org.apache.maven.surefire.booter.ForkedBooter.runSuitesInProcess(ForkedBooter.java:115)
	at org.apache.maven.surefire.booter.ForkedBooter.main(ForkedBooter.java:75)
Caused by: org.apache.http.conn.HttpHostConnectException: Connect to localhost:8093 [localhost/127.0.0.1, localhost/0:0:0:0:0:0:0:1] failed: Connection refused (Connection refused)
	at org.apache.http.impl.conn.DefaultHttpClientConnectionOperator.connect(DefaultHttpClientConnectionOperator.java:159)
	at org.apache.http.impl.conn.PoolingHttpClientConnectionManager.connect(PoolingHttpClientConnectionManager.java:359)
	at org.apache.http.impl.execchain.MainClientExec.establishRoute(MainClientExec.java:381)
	at org.apache.http.impl.execchain.MainClientExec.execute(MainClientExec.java:237)
	at org.apache.http.impl.execchain.ProtocolExec.execute(ProtocolExec.java:185)
	at org.apache.http.impl.execchain.RetryExec.execute(RetryExec.java:89)
	at org.apache.http.impl.execchain.RedirectExec.execute(RedirectExec.java:111)
	at org.apache.http.impl.client.InternalHttpClient.doExecute(InternalHttpClient.java:185)
	at org.apache.http.impl.client.CloseableHttpClient.execute(CloseableHttpClient.java:83)
	at org.apache.http.impl.client.CloseableHttpClient.execute(CloseableHttpClient.java:108)
	at com.couchbase.jdbc.core.ProtocolImpl.pollCluster(ProtocolImpl.java:977)
	at com.couchbase.jdbc.core.ProtocolImpl.connect(ProtocolImpl.java:238)
	at com.couchbase.jdbc.CBConnection.<init>(CBConnection.java:73)
	... 34 more
Caused by: java.net.ConnectException: Connection refused (Connection refused)
	at java.net.PlainSocketImpl.socketConnect(Native Method)
	at java.net.AbstractPlainSocketImpl.doConnect(AbstractPlainSocketImpl.java:350)
	at java.net.AbstractPlainSocketImpl.connectToAddress(AbstractPlainSocketImpl.java:206)
	at java.net.AbstractPlainSocketImpl.connect(AbstractPlainSocketImpl.java:188)
	at java.net.SocksSocketImpl.connect(SocksSocketImpl.java:392)
	at java.net.Socket.connect(Socket.java:589)
	at org.apache.http.conn.socket.PlainConnectionSocketFactory.connectSocket(PlainConnectionSocketFactory.java:75)
	at org.apache.http.impl.conn.DefaultHttpClientConnectionOperator.connect(DefaultHttpClientConnectionOperator.java:142)
	... 46 more

testGetMaxBinaryLiteralLength(com.couchbase.jdbc.CBDatabaseMetaDataTest)  Time elapsed: 0.003 sec  <<< ERROR!
java.lang.NullPointerException
	at com.couchbase.jdbc.CBDatabaseMetaDataTest.close(CBDatabaseMetaDataTest.java:63)
	at sun.reflect.GeneratedMethodAccessor6.invoke(Unknown Source)
	at sun.reflect.DelegatingMethodAccessorImpl.invoke(DelegatingMethodAccessorImpl.java:43)
	at java.lang.reflect.Method.invoke(Method.java:498)
	at org.junit.runners.model.FrameworkMethod$1.runReflectiveCall(FrameworkMethod.java:50)
	at org.junit.internal.runners.model.ReflectiveCallable.run(ReflectiveCallable.java:12)
	at org.junit.runners.model.FrameworkMethod.invokeExplosively(FrameworkMethod.java:47)
	at org.junit.internal.runners.statements.RunAfters.evaluate(RunAfters.java:33)
	at org.junit.runners.ParentRunner.runLeaf(ParentRunner.java:325)
	at org.junit.runners.BlockJUnit4ClassRunner.runChild(BlockJUnit4ClassRunner.java:78)
	at org.junit.runners.BlockJUnit4ClassRunner.runChild(BlockJUnit4ClassRunner.java:57)
	at org.junit.runners.ParentRunner$3.run(ParentRunner.java:290)
	at org.junit.runners.ParentRunner$1.schedule(ParentRunner.java:71)
	at org.junit.runners.ParentRunner.runChildren(ParentRunner.java:288)
	at org.junit.runners.ParentRunner.access$000(ParentRunner.java:58)
	at org.junit.runners.ParentRunner$2.evaluate(ParentRunner.java:268)
	at org.junit.internal.runners.statements.RunBefores.evaluate(RunBefores.java:26)
	at org.junit.runners.ParentRunner.run(ParentRunner.java:363)
	at org.apache.maven.surefire.junit4.JUnit4Provider.execute(JUnit4Provider.java:252)
	at org.apache.maven.surefire.junit4.JUnit4Provider.executeTestSet(JUnit4Provider.java:141)
	at org.apache.maven.surefire.junit4.JUnit4Provider.invoke(JUnit4Provider.java:112)
	at sun.reflect.NativeMethodAccessorImpl.invoke0(Native Method)
	at sun.reflect.NativeMethodAccessorImpl.invoke(NativeMethodAccessorImpl.java:62)
	at sun.reflect.DelegatingMethodAccessorImpl.invoke(DelegatingMethodAccessorImpl.java:43)
	at java.lang.reflect.Method.invoke(Method.java:498)
	at org.apache.maven.surefire.util.ReflectionUtils.invokeMethodWithArray(ReflectionUtils.java:189)
	at org.apache.maven.surefire.booter.ProviderFactory$ProviderProxy.invoke(ProviderFactory.java:165)
	at org.apache.maven.surefire.booter.ProviderFactory.invokeProvider(ProviderFactory.java:85)
	at org.apache.maven.surefire.booter.ForkedBooter.runSuitesInProcess(ForkedBooter.java:115)
	at org.apache.maven.surefire.booter.ForkedBooter.main(ForkedBooter.java:75)

testSupportsSchemasInDataManipulation(com.couchbase.jdbc.CBDatabaseMetaDataTest)  Time elapsed: 0.002 sec  <<< ERROR!
java.sql.SQLException: Error opening connection
	at com.couchbase.jdbc.CBConnection.<init>(CBConnection.java:79)
	at com.couchbase.jdbc.CBDriver.connect(CBDriver.java:94)
	at java.sql.DriverManager.getConnection(DriverManager.java:664)
	at java.sql.DriverManager.getConnection(DriverManager.java:208)
	at com.couchbase.jdbc.CBDatabaseMetaDataTest.openConnection(CBDatabaseMetaDataTest.java:54)
	at sun.reflect.GeneratedMethodAccessor5.invoke(Unknown Source)
	at sun.reflect.DelegatingMethodAccessorImpl.invoke(DelegatingMethodAccessorImpl.java:43)
	at java.lang.reflect.Method.invoke(Method.java:498)
	at org.junit.runners.model.FrameworkMethod$1.runReflectiveCall(FrameworkMethod.java:50)
	at org.junit.internal.runners.model.ReflectiveCallable.run(ReflectiveCallable.java:12)
	at org.junit.runners.model.FrameworkMethod.invokeExplosively(FrameworkMethod.java:47)
	at org.junit.internal.runners.statements.RunBefores.evaluate(RunBefores.java:24)
	at org.junit.internal.runners.statements.RunAfters.evaluate(RunAfters.java:27)
	at org.junit.runners.ParentRunner.runLeaf(ParentRunner.java:325)
	at org.junit.runners.BlockJUnit4ClassRunner.runChild(BlockJUnit4ClassRunner.java:78)
	at org.junit.runners.BlockJUnit4ClassRunner.runChild(BlockJUnit4ClassRunner.java:57)
	at org.junit.runners.ParentRunner$3.run(ParentRunner.java:290)
	at org.junit.runners.ParentRunner$1.schedule(ParentRunner.java:71)
	at org.junit.runners.ParentRunner.runChildren(ParentRunner.java:288)
	at org.junit.runners.ParentRunner.access$000(ParentRunner.java:58)
	at org.junit.runners.ParentRunner$2.evaluate(ParentRunner.java:268)
	at org.junit.internal.runners.statements.RunBefores.evaluate(RunBefores.java:26)
	at org.junit.runners.ParentRunner.run(ParentRunner.java:363)
	at org.apache.maven.surefire.junit4.JUnit4Provider.execute(JUnit4Provider.java:252)
	at org.apache.maven.surefire.junit4.JUnit4Provider.executeTestSet(JUnit4Provider.java:141)
	at org.apache.maven.surefire.junit4.JUnit4Provider.invoke(JUnit4Provider.java:112)
	at sun.reflect.NativeMethodAccessorImpl.invoke0(Native Method)
	at sun.reflect.NativeMethodAccessorImpl.invoke(NativeMethodAccessorImpl.java:62)
	at sun.reflect.DelegatingMethodAccessorImpl.invoke(DelegatingMethodAccessorImpl.java:43)
	at java.lang.reflect.Method.invoke(Method.java:498)
	at org.apache.maven.surefire.util.ReflectionUtils.invokeMethodWithArray(ReflectionUtils.java:189)
	at org.apache.maven.surefire.booter.ProviderFactory$ProviderProxy.invoke(ProviderFactory.java:165)
	at org.apache.maven.surefire.booter.ProviderFactory.invokeProvider(ProviderFactory.java:85)
	at org.apache.maven.surefire.booter.ForkedBooter.runSuitesInProcess(ForkedBooter.java:115)
	at org.apache.maven.surefire.booter.ForkedBooter.main(ForkedBooter.java:75)
Caused by: org.apache.http.conn.HttpHostConnectException: Connect to localhost:8093 [localhost/127.0.0.1, localhost/0:0:0:0:0:0:0:1] failed: Connection refused (Connection refused)
	at org.apache.http.impl.conn.DefaultHttpClientConnectionOperator.connect(DefaultHttpClientConnectionOperator.java:159)
	at org.apache.http.impl.conn.PoolingHttpClientConnectionManager.connect(PoolingHttpClientConnectionManager.java:359)
	at org.apache.http.impl.execchain.MainClientExec.establishRoute(MainClientExec.java:381)
	at org.apache.http.impl.execchain.MainClientExec.execute(MainClientExec.java:237)
	at org.apache.http.impl.execchain.ProtocolExec.execute(ProtocolExec.java:185)
	at org.apache.http.impl.execchain.RetryExec.execute(RetryExec.java:89)
	at org.apache.http.impl.execchain.RedirectExec.execute(RedirectExec.java:111)
	at org.apache.http.impl.client.InternalHttpClient.doExecute(InternalHttpClient.java:185)
	at org.apache.http.impl.client.CloseableHttpClient.execute(CloseableHttpClient.java:83)
	at org.apache.http.impl.client.CloseableHttpClient.execute(CloseableHttpClient.java:108)
	at com.couchbase.jdbc.core.ProtocolImpl.pollCluster(ProtocolImpl.java:977)
	at com.couchbase.jdbc.core.ProtocolImpl.connect(ProtocolImpl.java:238)
	at com.couchbase.jdbc.CBConnection.<init>(CBConnection.java:73)
	... 34 more
Caused by: java.net.ConnectException: Connection refused (Connection refused)
	at java.net.PlainSocketImpl.socketConnect(Native Method)
	at java.net.AbstractPlainSocketImpl.doConnect(AbstractPlainSocketImpl.java:350)
	at java.net.AbstractPlainSocketImpl.connectToAddress(AbstractPlainSocketImpl.java:206)
	at java.net.AbstractPlainSocketImpl.connect(AbstractPlainSocketImpl.java:188)
	at java.net.SocksSocketImpl.connect(SocksSocketImpl.java:392)
	at java.net.Socket.connect(Socket.java:589)
	at org.apache.http.conn.socket.PlainConnectionSocketFactory.connectSocket(PlainConnectionSocketFactory.java:75)
	at org.apache.http.impl.conn.DefaultHttpClientConnectionOperator.connect(DefaultHttpClientConnectionOperator.java:142)
	... 46 more

testSupportsSchemasInDataManipulation(com.couchbase.jdbc.CBDatabaseMetaDataTest)  Time elapsed: 0.003 sec  <<< ERROR!
java.lang.NullPointerException
	at com.couchbase.jdbc.CBDatabaseMetaDataTest.close(CBDatabaseMetaDataTest.java:63)
	at sun.reflect.GeneratedMethodAccessor6.invoke(Unknown Source)
	at sun.reflect.DelegatingMethodAccessorImpl.invoke(DelegatingMethodAccessorImpl.java:43)
	at java.lang.reflect.Method.invoke(Method.java:498)
	at org.junit.runners.model.FrameworkMethod$1.runReflectiveCall(FrameworkMethod.java:50)
	at org.junit.internal.runners.model.ReflectiveCallable.run(ReflectiveCallable.java:12)
	at org.junit.runners.model.FrameworkMethod.invokeExplosively(FrameworkMethod.java:47)
	at org.junit.internal.runners.statements.RunAfters.evaluate(RunAfters.java:33)
	at org.junit.runners.ParentRunner.runLeaf(ParentRunner.java:325)
	at org.junit.runners.BlockJUnit4ClassRunner.runChild(BlockJUnit4ClassRunner.java:78)
	at org.junit.runners.BlockJUnit4ClassRunner.runChild(BlockJUnit4ClassRunner.java:57)
	at org.junit.runners.ParentRunner$3.run(ParentRunner.java:290)
	at org.junit.runners.ParentRunner$1.schedule(ParentRunner.java:71)
	at org.junit.runners.ParentRunner.runChildren(ParentRunner.java:288)
	at org.junit.runners.ParentRunner.access$000(ParentRunner.java:58)
	at org.junit.runners.ParentRunner$2.evaluate(ParentRunner.java:268)
	at org.junit.internal.runners.statements.RunBefores.evaluate(RunBefores.java:26)
	at org.junit.runners.ParentRunner.run(ParentRunner.java:363)
	at org.apache.maven.surefire.junit4.JUnit4Provider.execute(JUnit4Provider.java:252)
	at org.apache.maven.surefire.junit4.JUnit4Provider.executeTestSet(JUnit4Provider.java:141)
	at org.apache.maven.surefire.junit4.JUnit4Provider.invoke(JUnit4Provider.java:112)
	at sun.reflect.NativeMethodAccessorImpl.invoke0(Native Method)
	at sun.reflect.NativeMethodAccessorImpl.invoke(NativeMethodAccessorImpl.java:62)
	at sun.reflect.DelegatingMethodAccessorImpl.invoke(DelegatingMethodAccessorImpl.java:43)
	at java.lang.reflect.Method.invoke(Method.java:498)
	at org.apache.maven.surefire.util.ReflectionUtils.invokeMethodWithArray(ReflectionUtils.java:189)
	at org.apache.maven.surefire.booter.ProviderFactory$ProviderProxy.invoke(ProviderFactory.java:165)
	at org.apache.maven.surefire.booter.ProviderFactory.invokeProvider(ProviderFactory.java:85)
	at org.apache.maven.surefire.booter.ForkedBooter.runSuitesInProcess(ForkedBooter.java:115)
	at org.apache.maven.surefire.booter.ForkedBooter.main(ForkedBooter.java:75)

testStoresUpperCaseIdentifiers(com.couchbase.jdbc.CBDatabaseMetaDataTest)  Time elapsed: 0.003 sec  <<< ERROR!
java.sql.SQLException: Error opening connection
	at com.couchbase.jdbc.CBConnection.<init>(CBConnection.java:79)
	at com.couchbase.jdbc.CBDriver.connect(CBDriver.java:94)
	at java.sql.DriverManager.getConnection(DriverManager.java:664)
	at java.sql.DriverManager.getConnection(DriverManager.java:208)
	at com.couchbase.jdbc.CBDatabaseMetaDataTest.openConnection(CBDatabaseMetaDataTest.java:54)
	at sun.reflect.GeneratedMethodAccessor5.invoke(Unknown Source)
	at sun.reflect.DelegatingMethodAccessorImpl.invoke(DelegatingMethodAccessorImpl.java:43)
	at java.lang.reflect.Method.invoke(Method.java:498)
	at org.junit.runners.model.FrameworkMethod$1.runReflectiveCall(FrameworkMethod.java:50)
	at org.junit.internal.runners.model.ReflectiveCallable.run(ReflectiveCallable.java:12)
	at org.junit.runners.model.FrameworkMethod.invokeExplosively(FrameworkMethod.java:47)
	at org.junit.internal.runners.statements.RunBefores.evaluate(RunBefores.java:24)
	at org.junit.internal.runners.statements.RunAfters.evaluate(RunAfters.java:27)
	at org.junit.runners.ParentRunner.runLeaf(ParentRunner.java:325)
	at org.junit.runners.BlockJUnit4ClassRunner.runChild(BlockJUnit4ClassRunner.java:78)
	at org.junit.runners.BlockJUnit4ClassRunner.runChild(BlockJUnit4ClassRunner.java:57)
	at org.junit.runners.ParentRunner$3.run(ParentRunner.java:290)
	at org.junit.runners.ParentRunner$1.schedule(ParentRunner.java:71)
	at org.junit.runners.ParentRunner.runChildren(ParentRunner.java:288)
	at org.junit.runners.ParentRunner.access$000(ParentRunner.java:58)
	at org.junit.runners.ParentRunner$2.evaluate(ParentRunner.java:268)
	at org.junit.internal.runners.statements.RunBefores.evaluate(RunBefores.java:26)
	at org.junit.runners.ParentRunner.run(ParentRunner.java:363)
	at org.apache.maven.surefire.junit4.JUnit4Provider.execute(JUnit4Provider.java:252)
	at org.apache.maven.surefire.junit4.JUnit4Provider.executeTestSet(JUnit4Provider.java:141)
	at org.apache.maven.surefire.junit4.JUnit4Provider.invoke(JUnit4Provider.java:112)
	at sun.reflect.NativeMethodAccessorImpl.invoke0(Native Method)
	at sun.reflect.NativeMethodAccessorImpl.invoke(NativeMethodAccessorImpl.java:62)
	at sun.reflect.DelegatingMethodAccessorImpl.invoke(DelegatingMethodAccessorImpl.java:43)
	at java.lang.reflect.Method.invoke(Method.java:498)
	at org.apache.maven.surefire.util.ReflectionUtils.invokeMethodWithArray(ReflectionUtils.java:189)
	at org.apache.maven.surefire.booter.ProviderFactory$ProviderProxy.invoke(ProviderFactory.java:165)
	at org.apache.maven.surefire.booter.ProviderFactory.invokeProvider(ProviderFactory.java:85)
	at org.apache.maven.surefire.booter.ForkedBooter.runSuitesInProcess(ForkedBooter.java:115)
	at org.apache.maven.surefire.booter.ForkedBooter.main(ForkedBooter.java:75)
Caused by: org.apache.http.conn.HttpHostConnectException: Connect to localhost:8093 [localhost/127.0.0.1, localhost/0:0:0:0:0:0:0:1] failed: Connection refused (Connection refused)
	at org.apache.http.impl.conn.DefaultHttpClientConnectionOperator.connect(DefaultHttpClientConnectionOperator.java:159)
	at org.apache.http.impl.conn.PoolingHttpClientConnectionManager.connect(PoolingHttpClientConnectionManager.java:359)
	at org.apache.http.impl.execchain.MainClientExec.establishRoute(MainClientExec.java:381)
	at org.apache.http.impl.execchain.MainClientExec.execute(MainClientExec.java:237)
	at org.apache.http.impl.execchain.ProtocolExec.execute(ProtocolExec.java:185)
	at org.apache.http.impl.execchain.RetryExec.execute(RetryExec.java:89)
	at org.apache.http.impl.execchain.RedirectExec.execute(RedirectExec.java:111)
	at org.apache.http.impl.client.InternalHttpClient.doExecute(InternalHttpClient.java:185)
	at org.apache.http.impl.client.CloseableHttpClient.execute(CloseableHttpClient.java:83)
	at org.apache.http.impl.client.CloseableHttpClient.execute(CloseableHttpClient.java:108)
	at com.couchbase.jdbc.core.ProtocolImpl.pollCluster(ProtocolImpl.java:977)
	at com.couchbase.jdbc.core.ProtocolImpl.connect(ProtocolImpl.java:238)
	at com.couchbase.jdbc.CBConnection.<init>(CBConnection.java:73)
	... 34 more
Caused by: java.net.ConnectException: Connection refused (Connection refused)
	at java.net.PlainSocketImpl.socketConnect(Native Method)
	at java.net.AbstractPlainSocketImpl.doConnect(AbstractPlainSocketImpl.java:350)
	at java.net.AbstractPlainSocketImpl.connectToAddress(AbstractPlainSocketImpl.java:206)
	at java.net.AbstractPlainSocketImpl.connect(AbstractPlainSocketImpl.java:188)
	at java.net.SocksSocketImpl.connect(SocksSocketImpl.java:392)
	at java.net.Socket.connect(Socket.java:589)
	at org.apache.http.conn.socket.PlainConnectionSocketFactory.connectSocket(PlainConnectionSocketFactory.java:75)
	at org.apache.http.impl.conn.DefaultHttpClientConnectionOperator.connect(DefaultHttpClientConnectionOperator.java:142)
	... 46 more

testStoresUpperCaseIdentifiers(com.couchbase.jdbc.CBDatabaseMetaDataTest)  Time elapsed: 0.003 sec  <<< ERROR!
java.lang.NullPointerException
	at com.couchbase.jdbc.CBDatabaseMetaDataTest.close(CBDatabaseMetaDataTest.java:63)
	at sun.reflect.GeneratedMethodAccessor6.invoke(Unknown Source)
	at sun.reflect.DelegatingMethodAccessorImpl.invoke(DelegatingMethodAccessorImpl.java:43)
	at java.lang.reflect.Method.invoke(Method.java:498)
	at org.junit.runners.model.FrameworkMethod$1.runReflectiveCall(FrameworkMethod.java:50)
	at org.junit.internal.runners.model.ReflectiveCallable.run(ReflectiveCallable.java:12)
	at org.junit.runners.model.FrameworkMethod.invokeExplosively(FrameworkMethod.java:47)
	at org.junit.internal.runners.statements.RunAfters.evaluate(RunAfters.java:33)
	at org.junit.runners.ParentRunner.runLeaf(ParentRunner.java:325)
	at org.junit.runners.BlockJUnit4ClassRunner.runChild(BlockJUnit4ClassRunner.java:78)
	at org.junit.runners.BlockJUnit4ClassRunner.runChild(BlockJUnit4ClassRunner.java:57)
	at org.junit.runners.ParentRunner$3.run(ParentRunner.java:290)
	at org.junit.runners.ParentRunner$1.schedule(ParentRunner.java:71)
	at org.junit.runners.ParentRunner.runChildren(ParentRunner.java:288)
	at org.junit.runners.ParentRunner.access$000(ParentRunner.java:58)
	at org.junit.runners.ParentRunner$2.evaluate(ParentRunner.java:268)
	at org.junit.internal.runners.statements.RunBefores.evaluate(RunBefores.java:26)
	at org.junit.runners.ParentRunner.run(ParentRunner.java:363)
	at org.apache.maven.surefire.junit4.JUnit4Provider.execute(JUnit4Provider.java:252)
	at org.apache.maven.surefire.junit4.JUnit4Provider.executeTestSet(JUnit4Provider.java:141)
	at org.apache.maven.surefire.junit4.JUnit4Provider.invoke(JUnit4Provider.java:112)
	at sun.reflect.NativeMethodAccessorImpl.invoke0(Native Method)
	at sun.reflect.NativeMethodAccessorImpl.invoke(NativeMethodAccessorImpl.java:62)
	at sun.reflect.DelegatingMethodAccessorImpl.invoke(DelegatingMethodAccessorImpl.java:43)
	at java.lang.reflect.Method.invoke(Method.java:498)
	at org.apache.maven.surefire.util.ReflectionUtils.invokeMethodWithArray(ReflectionUtils.java:189)
	at org.apache.maven.surefire.booter.ProviderFactory$ProviderProxy.invoke(ProviderFactory.java:165)
	at org.apache.maven.surefire.booter.ProviderFactory.invokeProvider(ProviderFactory.java:85)
	at org.apache.maven.surefire.booter.ForkedBooter.runSuitesInProcess(ForkedBooter.java:115)
	at org.apache.maven.surefire.booter.ForkedBooter.main(ForkedBooter.java:75)

testGetDriverMinorVersion(com.couchbase.jdbc.CBDatabaseMetaDataTest)  Time elapsed: 0.003 sec  <<< ERROR!
java.sql.SQLException: Error opening connection
	at com.couchbase.jdbc.CBConnection.<init>(CBConnection.java:79)
	at com.couchbase.jdbc.CBDriver.connect(CBDriver.java:94)
	at java.sql.DriverManager.getConnection(DriverManager.java:664)
	at java.sql.DriverManager.getConnection(DriverManager.java:208)
	at com.couchbase.jdbc.CBDatabaseMetaDataTest.openConnection(CBDatabaseMetaDataTest.java:54)
	at sun.reflect.GeneratedMethodAccessor5.invoke(Unknown Source)
	at sun.reflect.DelegatingMethodAccessorImpl.invoke(DelegatingMethodAccessorImpl.java:43)
	at java.lang.reflect.Method.invoke(Method.java:498)
	at org.junit.runners.model.FrameworkMethod$1.runReflectiveCall(FrameworkMethod.java:50)
	at org.junit.internal.runners.model.ReflectiveCallable.run(ReflectiveCallable.java:12)
	at org.junit.runners.model.FrameworkMethod.invokeExplosively(FrameworkMethod.java:47)
	at org.junit.internal.runners.statements.RunBefores.evaluate(RunBefores.java:24)
	at org.junit.internal.runners.statements.RunAfters.evaluate(RunAfters.java:27)
	at org.junit.runners.ParentRunner.runLeaf(ParentRunner.java:325)
	at org.junit.runners.BlockJUnit4ClassRunner.runChild(BlockJUnit4ClassRunner.java:78)
	at org.junit.runners.BlockJUnit4ClassRunner.runChild(BlockJUnit4ClassRunner.java:57)
	at org.junit.runners.ParentRunner$3.run(ParentRunner.java:290)
	at org.junit.runners.ParentRunner$1.schedule(ParentRunner.java:71)
	at org.junit.runners.ParentRunner.runChildren(ParentRunner.java:288)
	at org.junit.runners.ParentRunner.access$000(ParentRunner.java:58)
	at org.junit.runners.ParentRunner$2.evaluate(ParentRunner.java:268)
	at org.junit.internal.runners.statements.RunBefores.evaluate(RunBefores.java:26)
	at org.junit.runners.ParentRunner.run(ParentRunner.java:363)
	at org.apache.maven.surefire.junit4.JUnit4Provider.execute(JUnit4Provider.java:252)
	at org.apache.maven.surefire.junit4.JUnit4Provider.executeTestSet(JUnit4Provider.java:141)
	at org.apache.maven.surefire.junit4.JUnit4Provider.invoke(JUnit4Provider.java:112)
	at sun.reflect.NativeMethodAccessorImpl.invoke0(Native Method)
	at sun.reflect.NativeMethodAccessorImpl.invoke(NativeMethodAccessorImpl.java:62)
	at sun.reflect.DelegatingMethodAccessorImpl.invoke(DelegatingMethodAccessorImpl.java:43)
	at java.lang.reflect.Method.invoke(Method.java:498)
	at org.apache.maven.surefire.util.ReflectionUtils.invokeMethodWithArray(ReflectionUtils.java:189)
	at org.apache.maven.surefire.booter.ProviderFactory$ProviderProxy.invoke(ProviderFactory.java:165)
	at org.apache.maven.surefire.booter.ProviderFactory.invokeProvider(ProviderFactory.java:85)
	at org.apache.maven.surefire.booter.ForkedBooter.runSuitesInProcess(ForkedBooter.java:115)
	at org.apache.maven.surefire.booter.ForkedBooter.main(ForkedBooter.java:75)
Caused by: org.apache.http.conn.HttpHostConnectException: Connect to localhost:8093 [localhost/127.0.0.1, localhost/0:0:0:0:0:0:0:1] failed: Connection refused (Connection refused)
	at org.apache.http.impl.conn.DefaultHttpClientConnectionOperator.connect(DefaultHttpClientConnectionOperator.java:159)
	at org.apache.http.impl.conn.PoolingHttpClientConnectionManager.connect(PoolingHttpClientConnectionManager.java:359)
	at org.apache.http.impl.execchain.MainClientExec.establishRoute(MainClientExec.java:381)
	at org.apache.http.impl.execchain.MainClientExec.execute(MainClientExec.java:237)
	at org.apache.http.impl.execchain.ProtocolExec.execute(ProtocolExec.java:185)
	at org.apache.http.impl.execchain.RetryExec.execute(RetryExec.java:89)
	at org.apache.http.impl.execchain.RedirectExec.execute(RedirectExec.java:111)
	at org.apache.http.impl.client.InternalHttpClient.doExecute(InternalHttpClient.java:185)
	at org.apache.http.impl.client.CloseableHttpClient.execute(CloseableHttpClient.java:83)
	at org.apache.http.impl.client.CloseableHttpClient.execute(CloseableHttpClient.java:108)
	at com.couchbase.jdbc.core.ProtocolImpl.pollCluster(ProtocolImpl.java:977)
	at com.couchbase.jdbc.core.ProtocolImpl.connect(ProtocolImpl.java:238)
	at com.couchbase.jdbc.CBConnection.<init>(CBConnection.java:73)
	... 34 more
Caused by: java.net.ConnectException: Connection refused (Connection refused)
	at java.net.PlainSocketImpl.socketConnect(Native Method)
	at java.net.AbstractPlainSocketImpl.doConnect(AbstractPlainSocketImpl.java:350)
	at java.net.AbstractPlainSocketImpl.connectToAddress(AbstractPlainSocketImpl.java:206)
	at java.net.AbstractPlainSocketImpl.connect(AbstractPlainSocketImpl.java:188)
	at java.net.SocksSocketImpl.connect(SocksSocketImpl.java:392)
	at java.net.Socket.connect(Socket.java:589)
	at org.apache.http.conn.socket.PlainConnectionSocketFactory.connectSocket(PlainConnectionSocketFactory.java:75)
	at org.apache.http.impl.conn.DefaultHttpClientConnectionOperator.connect(DefaultHttpClientConnectionOperator.java:142)
	... 46 more

testGetDriverMinorVersion(com.couchbase.jdbc.CBDatabaseMetaDataTest)  Time elapsed: 0.003 sec  <<< ERROR!
java.lang.NullPointerException
	at com.couchbase.jdbc.CBDatabaseMetaDataTest.close(CBDatabaseMetaDataTest.java:63)
	at sun.reflect.GeneratedMethodAccessor6.invoke(Unknown Source)
	at sun.reflect.DelegatingMethodAccessorImpl.invoke(DelegatingMethodAccessorImpl.java:43)
	at java.lang.reflect.Method.invoke(Method.java:498)
	at org.junit.runners.model.FrameworkMethod$1.runReflectiveCall(FrameworkMethod.java:50)
	at org.junit.internal.runners.model.ReflectiveCallable.run(ReflectiveCallable.java:12)
	at org.junit.runners.model.FrameworkMethod.invokeExplosively(FrameworkMethod.java:47)
	at org.junit.internal.runners.statements.RunAfters.evaluate(RunAfters.java:33)
	at org.junit.runners.ParentRunner.runLeaf(ParentRunner.java:325)
	at org.junit.runners.BlockJUnit4ClassRunner.runChild(BlockJUnit4ClassRunner.java:78)
	at org.junit.runners.BlockJUnit4ClassRunner.runChild(BlockJUnit4ClassRunner.java:57)
	at org.junit.runners.ParentRunner$3.run(ParentRunner.java:290)
	at org.junit.runners.ParentRunner$1.schedule(ParentRunner.java:71)
	at org.junit.runners.ParentRunner.runChildren(ParentRunner.java:288)
	at org.junit.runners.ParentRunner.access$000(ParentRunner.java:58)
	at org.junit.runners.ParentRunner$2.evaluate(ParentRunner.java:268)
	at org.junit.internal.runners.statements.RunBefores.evaluate(RunBefores.java:26)
	at org.junit.runners.ParentRunner.run(ParentRunner.java:363)
	at org.apache.maven.surefire.junit4.JUnit4Provider.execute(JUnit4Provider.java:252)
	at org.apache.maven.surefire.junit4.JUnit4Provider.executeTestSet(JUnit4Provider.java:141)
	at org.apache.maven.surefire.junit4.JUnit4Provider.invoke(JUnit4Provider.java:112)
	at sun.reflect.NativeMethodAccessorImpl.invoke0(Native Method)
	at sun.reflect.NativeMethodAccessorImpl.invoke(NativeMethodAccessorImpl.java:62)
	at sun.reflect.DelegatingMethodAccessorImpl.invoke(DelegatingMethodAccessorImpl.java:43)
	at java.lang.reflect.Method.invoke(Method.java:498)
	at org.apache.maven.surefire.util.ReflectionUtils.invokeMethodWithArray(ReflectionUtils.java:189)
	at org.apache.maven.surefire.booter.ProviderFactory$ProviderProxy.invoke(ProviderFactory.java:165)
	at org.apache.maven.surefire.booter.ProviderFactory.invokeProvider(ProviderFactory.java:85)
	at org.apache.maven.surefire.booter.ForkedBooter.runSuitesInProcess(ForkedBooter.java:115)
	at org.apache.maven.surefire.booter.ForkedBooter.main(ForkedBooter.java:75)

testSupportsTableCorrelationNames(com.couchbase.jdbc.CBDatabaseMetaDataTest)  Time elapsed: 0.003 sec  <<< ERROR!
java.sql.SQLException: Error opening connection
	at com.couchbase.jdbc.CBConnection.<init>(CBConnection.java:79)
	at com.couchbase.jdbc.CBDriver.connect(CBDriver.java:94)
	at java.sql.DriverManager.getConnection(DriverManager.java:664)
	at java.sql.DriverManager.getConnection(DriverManager.java:208)
	at com.couchbase.jdbc.CBDatabaseMetaDataTest.openConnection(CBDatabaseMetaDataTest.java:54)
	at sun.reflect.GeneratedMethodAccessor5.invoke(Unknown Source)
	at sun.reflect.DelegatingMethodAccessorImpl.invoke(DelegatingMethodAccessorImpl.java:43)
	at java.lang.reflect.Method.invoke(Method.java:498)
	at org.junit.runners.model.FrameworkMethod$1.runReflectiveCall(FrameworkMethod.java:50)
	at org.junit.internal.runners.model.ReflectiveCallable.run(ReflectiveCallable.java:12)
	at org.junit.runners.model.FrameworkMethod.invokeExplosively(FrameworkMethod.java:47)
	at org.junit.internal.runners.statements.RunBefores.evaluate(RunBefores.java:24)
	at org.junit.internal.runners.statements.RunAfters.evaluate(RunAfters.java:27)
	at org.junit.runners.ParentRunner.runLeaf(ParentRunner.java:325)
	at org.junit.runners.BlockJUnit4ClassRunner.runChild(BlockJUnit4ClassRunner.java:78)
	at org.junit.runners.BlockJUnit4ClassRunner.runChild(BlockJUnit4ClassRunner.java:57)
	at org.junit.runners.ParentRunner$3.run(ParentRunner.java:290)
	at org.junit.runners.ParentRunner$1.schedule(ParentRunner.java:71)
	at org.junit.runners.ParentRunner.runChildren(ParentRunner.java:288)
	at org.junit.runners.ParentRunner.access$000(ParentRunner.java:58)
	at org.junit.runners.ParentRunner$2.evaluate(ParentRunner.java:268)
	at org.junit.internal.runners.statements.RunBefores.evaluate(RunBefores.java:26)
	at org.junit.runners.ParentRunner.run(ParentRunner.java:363)
	at org.apache.maven.surefire.junit4.JUnit4Provider.execute(JUnit4Provider.java:252)
	at org.apache.maven.surefire.junit4.JUnit4Provider.executeTestSet(JUnit4Provider.java:141)
	at org.apache.maven.surefire.junit4.JUnit4Provider.invoke(JUnit4Provider.java:112)
	at sun.reflect.NativeMethodAccessorImpl.invoke0(Native Method)
	at sun.reflect.NativeMethodAccessorImpl.invoke(NativeMethodAccessorImpl.java:62)
	at sun.reflect.DelegatingMethodAccessorImpl.invoke(DelegatingMethodAccessorImpl.java:43)
	at java.lang.reflect.Method.invoke(Method.java:498)
	at org.apache.maven.surefire.util.ReflectionUtils.invokeMethodWithArray(ReflectionUtils.java:189)
	at org.apache.maven.surefire.booter.ProviderFactory$ProviderProxy.invoke(ProviderFactory.java:165)
	at org.apache.maven.surefire.booter.ProviderFactory.invokeProvider(ProviderFactory.java:85)
	at org.apache.maven.surefire.booter.ForkedBooter.runSuitesInProcess(ForkedBooter.java:115)
	at org.apache.maven.surefire.booter.ForkedBooter.main(ForkedBooter.java:75)
Caused by: org.apache.http.conn.HttpHostConnectException: Connect to localhost:8093 [localhost/127.0.0.1, localhost/0:0:0:0:0:0:0:1] failed: Connection refused (Connection refused)
	at org.apache.http.impl.conn.DefaultHttpClientConnectionOperator.connect(DefaultHttpClientConnectionOperator.java:159)
	at org.apache.http.impl.conn.PoolingHttpClientConnectionManager.connect(PoolingHttpClientConnectionManager.java:359)
	at org.apache.http.impl.execchain.MainClientExec.establishRoute(MainClientExec.java:381)
	at org.apache.http.impl.execchain.MainClientExec.execute(MainClientExec.java:237)
	at org.apache.http.impl.execchain.ProtocolExec.execute(ProtocolExec.java:185)
	at org.apache.http.impl.execchain.RetryExec.execute(RetryExec.java:89)
	at org.apache.http.impl.execchain.RedirectExec.execute(RedirectExec.java:111)
	at org.apache.http.impl.client.InternalHttpClient.doExecute(InternalHttpClient.java:185)
	at org.apache.http.impl.client.CloseableHttpClient.execute(CloseableHttpClient.java:83)
	at org.apache.http.impl.client.CloseableHttpClient.execute(CloseableHttpClient.java:108)
	at com.couchbase.jdbc.core.ProtocolImpl.pollCluster(ProtocolImpl.java:977)
	at com.couchbase.jdbc.core.ProtocolImpl.connect(ProtocolImpl.java:238)
	at com.couchbase.jdbc.CBConnection.<init>(CBConnection.java:73)
	... 34 more
Caused by: java.net.ConnectException: Connection refused (Connection refused)
	at java.net.PlainSocketImpl.socketConnect(Native Method)
	at java.net.AbstractPlainSocketImpl.doConnect(AbstractPlainSocketImpl.java:350)
	at java.net.AbstractPlainSocketImpl.connectToAddress(AbstractPlainSocketImpl.java:206)
	at java.net.AbstractPlainSocketImpl.connect(AbstractPlainSocketImpl.java:188)
	at java.net.SocksSocketImpl.connect(SocksSocketImpl.java:392)
	at java.net.Socket.connect(Socket.java:589)
	at org.apache.http.conn.socket.PlainConnectionSocketFactory.connectSocket(PlainConnectionSocketFactory.java:75)
	at org.apache.http.impl.conn.DefaultHttpClientConnectionOperator.connect(DefaultHttpClientConnectionOperator.java:142)
	... 46 more

testSupportsTableCorrelationNames(com.couchbase.jdbc.CBDatabaseMetaDataTest)  Time elapsed: 0.004 sec  <<< ERROR!
java.lang.NullPointerException
	at com.couchbase.jdbc.CBDatabaseMetaDataTest.close(CBDatabaseMetaDataTest.java:63)
	at sun.reflect.GeneratedMethodAccessor6.invoke(Unknown Source)
	at sun.reflect.DelegatingMethodAccessorImpl.invoke(DelegatingMethodAccessorImpl.java:43)
	at java.lang.reflect.Method.invoke(Method.java:498)
	at org.junit.runners.model.FrameworkMethod$1.runReflectiveCall(FrameworkMethod.java:50)
	at org.junit.internal.runners.model.ReflectiveCallable.run(ReflectiveCallable.java:12)
	at org.junit.runners.model.FrameworkMethod.invokeExplosively(FrameworkMethod.java:47)
	at org.junit.internal.runners.statements.RunAfters.evaluate(RunAfters.java:33)
	at org.junit.runners.ParentRunner.runLeaf(ParentRunner.java:325)
	at org.junit.runners.BlockJUnit4ClassRunner.runChild(BlockJUnit4ClassRunner.java:78)
	at org.junit.runners.BlockJUnit4ClassRunner.runChild(BlockJUnit4ClassRunner.java:57)
	at org.junit.runners.ParentRunner$3.run(ParentRunner.java:290)
	at org.junit.runners.ParentRunner$1.schedule(ParentRunner.java:71)
	at org.junit.runners.ParentRunner.runChildren(ParentRunner.java:288)
	at org.junit.runners.ParentRunner.access$000(ParentRunner.java:58)
	at org.junit.runners.ParentRunner$2.evaluate(ParentRunner.java:268)
	at org.junit.internal.runners.statements.RunBefores.evaluate(RunBefores.java:26)
	at org.junit.runners.ParentRunner.run(ParentRunner.java:363)
	at org.apache.maven.surefire.junit4.JUnit4Provider.execute(JUnit4Provider.java:252)
	at org.apache.maven.surefire.junit4.JUnit4Provider.executeTestSet(JUnit4Provider.java:141)
	at org.apache.maven.surefire.junit4.JUnit4Provider.invoke(JUnit4Provider.java:112)
	at sun.reflect.NativeMethodAccessorImpl.invoke0(Native Method)
	at sun.reflect.NativeMethodAccessorImpl.invoke(NativeMethodAccessorImpl.java:62)
	at sun.reflect.DelegatingMethodAccessorImpl.invoke(DelegatingMethodAccessorImpl.java:43)
	at java.lang.reflect.Method.invoke(Method.java:498)
	at org.apache.maven.surefire.util.ReflectionUtils.invokeMethodWithArray(ReflectionUtils.java:189)
	at org.apache.maven.surefire.booter.ProviderFactory$ProviderProxy.invoke(ProviderFactory.java:165)
	at org.apache.maven.surefire.booter.ProviderFactory.invokeProvider(ProviderFactory.java:85)
	at org.apache.maven.surefire.booter.ForkedBooter.runSuitesInProcess(ForkedBooter.java:115)
	at org.apache.maven.surefire.booter.ForkedBooter.main(ForkedBooter.java:75)

testIsReadOnly(com.couchbase.jdbc.CBDatabaseMetaDataTest)  Time elapsed: 0.003 sec  <<< ERROR!
java.sql.SQLException: Error opening connection
	at com.couchbase.jdbc.CBConnection.<init>(CBConnection.java:79)
	at com.couchbase.jdbc.CBDriver.connect(CBDriver.java:94)
	at java.sql.DriverManager.getConnection(DriverManager.java:664)
	at java.sql.DriverManager.getConnection(DriverManager.java:208)
	at com.couchbase.jdbc.CBDatabaseMetaDataTest.openConnection(CBDatabaseMetaDataTest.java:54)
	at sun.reflect.GeneratedMethodAccessor5.invoke(Unknown Source)
	at sun.reflect.DelegatingMethodAccessorImpl.invoke(DelegatingMethodAccessorImpl.java:43)
	at java.lang.reflect.Method.invoke(Method.java:498)
	at org.junit.runners.model.FrameworkMethod$1.runReflectiveCall(FrameworkMethod.java:50)
	at org.junit.internal.runners.model.ReflectiveCallable.run(ReflectiveCallable.java:12)
	at org.junit.runners.model.FrameworkMethod.invokeExplosively(FrameworkMethod.java:47)
	at org.junit.internal.runners.statements.RunBefores.evaluate(RunBefores.java:24)
	at org.junit.internal.runners.statements.RunAfters.evaluate(RunAfters.java:27)
	at org.junit.runners.ParentRunner.runLeaf(ParentRunner.java:325)
	at org.junit.runners.BlockJUnit4ClassRunner.runChild(BlockJUnit4ClassRunner.java:78)
	at org.junit.runners.BlockJUnit4ClassRunner.runChild(BlockJUnit4ClassRunner.java:57)
	at org.junit.runners.ParentRunner$3.run(ParentRunner.java:290)
	at org.junit.runners.ParentRunner$1.schedule(ParentRunner.java:71)
	at org.junit.runners.ParentRunner.runChildren(ParentRunner.java:288)
	at org.junit.runners.ParentRunner.access$000(ParentRunner.java:58)
	at org.junit.runners.ParentRunner$2.evaluate(ParentRunner.java:268)
	at org.junit.internal.runners.statements.RunBefores.evaluate(RunBefores.java:26)
	at org.junit.runners.ParentRunner.run(ParentRunner.java:363)
	at org.apache.maven.surefire.junit4.JUnit4Provider.execute(JUnit4Provider.java:252)
	at org.apache.maven.surefire.junit4.JUnit4Provider.executeTestSet(JUnit4Provider.java:141)
	at org.apache.maven.surefire.junit4.JUnit4Provider.invoke(JUnit4Provider.java:112)
	at sun.reflect.NativeMethodAccessorImpl.invoke0(Native Method)
	at sun.reflect.NativeMethodAccessorImpl.invoke(NativeMethodAccessorImpl.java:62)
	at sun.reflect.DelegatingMethodAccessorImpl.invoke(DelegatingMethodAccessorImpl.java:43)
	at java.lang.reflect.Method.invoke(Method.java:498)
	at org.apache.maven.surefire.util.ReflectionUtils.invokeMethodWithArray(ReflectionUtils.java:189)
	at org.apache.maven.surefire.booter.ProviderFactory$ProviderProxy.invoke(ProviderFactory.java:165)
	at org.apache.maven.surefire.booter.ProviderFactory.invokeProvider(ProviderFactory.java:85)
	at org.apache.maven.surefire.booter.ForkedBooter.runSuitesInProcess(ForkedBooter.java:115)
	at org.apache.maven.surefire.booter.ForkedBooter.main(ForkedBooter.java:75)
Caused by: org.apache.http.conn.HttpHostConnectException: Connect to localhost:8093 [localhost/127.0.0.1, localhost/0:0:0:0:0:0:0:1] failed: Connection refused (Connection refused)
	at org.apache.http.impl.conn.DefaultHttpClientConnectionOperator.connect(DefaultHttpClientConnectionOperator.java:159)
	at org.apache.http.impl.conn.PoolingHttpClientConnectionManager.connect(PoolingHttpClientConnectionManager.java:359)
	at org.apache.http.impl.execchain.MainClientExec.establishRoute(MainClientExec.java:381)
	at org.apache.http.impl.execchain.MainClientExec.execute(MainClientExec.java:237)
	at org.apache.http.impl.execchain.ProtocolExec.execute(ProtocolExec.java:185)
	at org.apache.http.impl.execchain.RetryExec.execute(RetryExec.java:89)
	at org.apache.http.impl.execchain.RedirectExec.execute(RedirectExec.java:111)
	at org.apache.http.impl.client.InternalHttpClient.doExecute(InternalHttpClient.java:185)
	at org.apache.http.impl.client.CloseableHttpClient.execute(CloseableHttpClient.java:83)
	at org.apache.http.impl.client.CloseableHttpClient.execute(CloseableHttpClient.java:108)
	at com.couchbase.jdbc.core.ProtocolImpl.pollCluster(ProtocolImpl.java:977)
	at com.couchbase.jdbc.core.ProtocolImpl.connect(ProtocolImpl.java:238)
	at com.couchbase.jdbc.CBConnection.<init>(CBConnection.java:73)
	... 34 more
Caused by: java.net.ConnectException: Connection refused (Connection refused)
	at java.net.PlainSocketImpl.socketConnect(Native Method)
	at java.net.AbstractPlainSocketImpl.doConnect(AbstractPlainSocketImpl.java:350)
	at java.net.AbstractPlainSocketImpl.connectToAddress(AbstractPlainSocketImpl.java:206)
	at java.net.AbstractPlainSocketImpl.connect(AbstractPlainSocketImpl.java:188)
	at java.net.SocksSocketImpl.connect(SocksSocketImpl.java:392)
	at java.net.Socket.connect(Socket.java:589)
	at org.apache.http.conn.socket.PlainConnectionSocketFactory.connectSocket(PlainConnectionSocketFactory.java:75)
	at org.apache.http.impl.conn.DefaultHttpClientConnectionOperator.connect(DefaultHttpClientConnectionOperator.java:142)
	... 46 more

testIsReadOnly(com.couchbase.jdbc.CBDatabaseMetaDataTest)  Time elapsed: 0.003 sec  <<< ERROR!
java.lang.NullPointerException
	at com.couchbase.jdbc.CBDatabaseMetaDataTest.close(CBDatabaseMetaDataTest.java:63)
	at sun.reflect.GeneratedMethodAccessor6.invoke(Unknown Source)
	at sun.reflect.DelegatingMethodAccessorImpl.invoke(DelegatingMethodAccessorImpl.java:43)
	at java.lang.reflect.Method.invoke(Method.java:498)
	at org.junit.runners.model.FrameworkMethod$1.runReflectiveCall(FrameworkMethod.java:50)
	at org.junit.internal.runners.model.ReflectiveCallable.run(ReflectiveCallable.java:12)
	at org.junit.runners.model.FrameworkMethod.invokeExplosively(FrameworkMethod.java:47)
	at org.junit.internal.runners.statements.RunAfters.evaluate(RunAfters.java:33)
	at org.junit.runners.ParentRunner.runLeaf(ParentRunner.java:325)
	at org.junit.runners.BlockJUnit4ClassRunner.runChild(BlockJUnit4ClassRunner.java:78)
	at org.junit.runners.BlockJUnit4ClassRunner.runChild(BlockJUnit4ClassRunner.java:57)
	at org.junit.runners.ParentRunner$3.run(ParentRunner.java:290)
	at org.junit.runners.ParentRunner$1.schedule(ParentRunner.java:71)
	at org.junit.runners.ParentRunner.runChildren(ParentRunner.java:288)
	at org.junit.runners.ParentRunner.access$000(ParentRunner.java:58)
	at org.junit.runners.ParentRunner$2.evaluate(ParentRunner.java:268)
	at org.junit.internal.runners.statements.RunBefores.evaluate(RunBefores.java:26)
	at org.junit.runners.ParentRunner.run(ParentRunner.java:363)
	at org.apache.maven.surefire.junit4.JUnit4Provider.execute(JUnit4Provider.java:252)
	at org.apache.maven.surefire.junit4.JUnit4Provider.executeTestSet(JUnit4Provider.java:141)
	at org.apache.maven.surefire.junit4.JUnit4Provider.invoke(JUnit4Provider.java:112)
	at sun.reflect.NativeMethodAccessorImpl.invoke0(Native Method)
	at sun.reflect.NativeMethodAccessorImpl.invoke(NativeMethodAccessorImpl.java:62)
	at sun.reflect.DelegatingMethodAccessorImpl.invoke(DelegatingMethodAccessorImpl.java:43)
	at java.lang.reflect.Method.invoke(Method.java:498)
	at org.apache.maven.surefire.util.ReflectionUtils.invokeMethodWithArray(ReflectionUtils.java:189)
	at org.apache.maven.surefire.booter.ProviderFactory$ProviderProxy.invoke(ProviderFactory.java:165)
	at org.apache.maven.surefire.booter.ProviderFactory.invokeProvider(ProviderFactory.java:85)
	at org.apache.maven.surefire.booter.ForkedBooter.runSuitesInProcess(ForkedBooter.java:115)
	at org.apache.maven.surefire.booter.ForkedBooter.main(ForkedBooter.java:75)

testSupportsANSI92IntermediateSQL(com.couchbase.jdbc.CBDatabaseMetaDataTest)  Time elapsed: 0.003 sec  <<< ERROR!
java.sql.SQLException: Error opening connection
	at com.couchbase.jdbc.CBConnection.<init>(CBConnection.java:79)
	at com.couchbase.jdbc.CBDriver.connect(CBDriver.java:94)
	at java.sql.DriverManager.getConnection(DriverManager.java:664)
	at java.sql.DriverManager.getConnection(DriverManager.java:208)
	at com.couchbase.jdbc.CBDatabaseMetaDataTest.openConnection(CBDatabaseMetaDataTest.java:54)
	at sun.reflect.GeneratedMethodAccessor5.invoke(Unknown Source)
	at sun.reflect.DelegatingMethodAccessorImpl.invoke(DelegatingMethodAccessorImpl.java:43)
	at java.lang.reflect.Method.invoke(Method.java:498)
	at org.junit.runners.model.FrameworkMethod$1.runReflectiveCall(FrameworkMethod.java:50)
	at org.junit.internal.runners.model.ReflectiveCallable.run(ReflectiveCallable.java:12)
	at org.junit.runners.model.FrameworkMethod.invokeExplosively(FrameworkMethod.java:47)
	at org.junit.internal.runners.statements.RunBefores.evaluate(RunBefores.java:24)
	at org.junit.internal.runners.statements.RunAfters.evaluate(RunAfters.java:27)
	at org.junit.runners.ParentRunner.runLeaf(ParentRunner.java:325)
	at org.junit.runners.BlockJUnit4ClassRunner.runChild(BlockJUnit4ClassRunner.java:78)
	at org.junit.runners.BlockJUnit4ClassRunner.runChild(BlockJUnit4ClassRunner.java:57)
	at org.junit.runners.ParentRunner$3.run(ParentRunner.java:290)
	at org.junit.runners.ParentRunner$1.schedule(ParentRunner.java:71)
	at org.junit.runners.ParentRunner.runChildren(ParentRunner.java:288)
	at org.junit.runners.ParentRunner.access$000(ParentRunner.java:58)
	at org.junit.runners.ParentRunner$2.evaluate(ParentRunner.java:268)
	at org.junit.internal.runners.statements.RunBefores.evaluate(RunBefores.java:26)
	at org.junit.runners.ParentRunner.run(ParentRunner.java:363)
	at org.apache.maven.surefire.junit4.JUnit4Provider.execute(JUnit4Provider.java:252)
	at org.apache.maven.surefire.junit4.JUnit4Provider.executeTestSet(JUnit4Provider.java:141)
	at org.apache.maven.surefire.junit4.JUnit4Provider.invoke(JUnit4Provider.java:112)
	at sun.reflect.NativeMethodAccessorImpl.invoke0(Native Method)
	at sun.reflect.NativeMethodAccessorImpl.invoke(NativeMethodAccessorImpl.java:62)
	at sun.reflect.DelegatingMethodAccessorImpl.invoke(DelegatingMethodAccessorImpl.java:43)
	at java.lang.reflect.Method.invoke(Method.java:498)
	at org.apache.maven.surefire.util.ReflectionUtils.invokeMethodWithArray(ReflectionUtils.java:189)
	at org.apache.maven.surefire.booter.ProviderFactory$ProviderProxy.invoke(ProviderFactory.java:165)
	at org.apache.maven.surefire.booter.ProviderFactory.invokeProvider(ProviderFactory.java:85)
	at org.apache.maven.surefire.booter.ForkedBooter.runSuitesInProcess(ForkedBooter.java:115)
	at org.apache.maven.surefire.booter.ForkedBooter.main(ForkedBooter.java:75)
Caused by: org.apache.http.conn.HttpHostConnectException: Connect to localhost:8093 [localhost/127.0.0.1, localhost/0:0:0:0:0:0:0:1] failed: Connection refused (Connection refused)
	at org.apache.http.impl.conn.DefaultHttpClientConnectionOperator.connect(DefaultHttpClientConnectionOperator.java:159)
	at org.apache.http.impl.conn.PoolingHttpClientConnectionManager.connect(PoolingHttpClientConnectionManager.java:359)
	at org.apache.http.impl.execchain.MainClientExec.establishRoute(MainClientExec.java:381)
	at org.apache.http.impl.execchain.MainClientExec.execute(MainClientExec.java:237)
	at org.apache.http.impl.execchain.ProtocolExec.execute(ProtocolExec.java:185)
	at org.apache.http.impl.execchain.RetryExec.execute(RetryExec.java:89)
	at org.apache.http.impl.execchain.RedirectExec.execute(RedirectExec.java:111)
	at org.apache.http.impl.client.InternalHttpClient.doExecute(InternalHttpClient.java:185)
	at org.apache.http.impl.client.CloseableHttpClient.execute(CloseableHttpClient.java:83)
	at org.apache.http.impl.client.CloseableHttpClient.execute(CloseableHttpClient.java:108)
	at com.couchbase.jdbc.core.ProtocolImpl.pollCluster(ProtocolImpl.java:977)
	at com.couchbase.jdbc.core.ProtocolImpl.connect(ProtocolImpl.java:238)
	at com.couchbase.jdbc.CBConnection.<init>(CBConnection.java:73)
	... 34 more
Caused by: java.net.ConnectException: Connection refused (Connection refused)
	at java.net.PlainSocketImpl.socketConnect(Native Method)
	at java.net.AbstractPlainSocketImpl.doConnect(AbstractPlainSocketImpl.java:350)
	at java.net.AbstractPlainSocketImpl.connectToAddress(AbstractPlainSocketImpl.java:206)
	at java.net.AbstractPlainSocketImpl.connect(AbstractPlainSocketImpl.java:188)
	at java.net.SocksSocketImpl.connect(SocksSocketImpl.java:392)
	at java.net.Socket.connect(Socket.java:589)
	at org.apache.http.conn.socket.PlainConnectionSocketFactory.connectSocket(PlainConnectionSocketFactory.java:75)
	at org.apache.http.impl.conn.DefaultHttpClientConnectionOperator.connect(DefaultHttpClientConnectionOperator.java:142)
	... 46 more

testSupportsANSI92IntermediateSQL(com.couchbase.jdbc.CBDatabaseMetaDataTest)  Time elapsed: 0.004 sec  <<< ERROR!
java.lang.NullPointerException
	at com.couchbase.jdbc.CBDatabaseMetaDataTest.close(CBDatabaseMetaDataTest.java:63)
	at sun.reflect.GeneratedMethodAccessor6.invoke(Unknown Source)
	at sun.reflect.DelegatingMethodAccessorImpl.invoke(DelegatingMethodAccessorImpl.java:43)
	at java.lang.reflect.Method.invoke(Method.java:498)
	at org.junit.runners.model.FrameworkMethod$1.runReflectiveCall(FrameworkMethod.java:50)
	at org.junit.internal.runners.model.ReflectiveCallable.run(ReflectiveCallable.java:12)
	at org.junit.runners.model.FrameworkMethod.invokeExplosively(FrameworkMethod.java:47)
	at org.junit.internal.runners.statements.RunAfters.evaluate(RunAfters.java:33)
	at org.junit.runners.ParentRunner.runLeaf(ParentRunner.java:325)
	at org.junit.runners.BlockJUnit4ClassRunner.runChild(BlockJUnit4ClassRunner.java:78)
	at org.junit.runners.BlockJUnit4ClassRunner.runChild(BlockJUnit4ClassRunner.java:57)
	at org.junit.runners.ParentRunner$3.run(ParentRunner.java:290)
	at org.junit.runners.ParentRunner$1.schedule(ParentRunner.java:71)
	at org.junit.runners.ParentRunner.runChildren(ParentRunner.java:288)
	at org.junit.runners.ParentRunner.access$000(ParentRunner.java:58)
	at org.junit.runners.ParentRunner$2.evaluate(ParentRunner.java:268)
	at org.junit.internal.runners.statements.RunBefores.evaluate(RunBefores.java:26)
	at org.junit.runners.ParentRunner.run(ParentRunner.java:363)
	at org.apache.maven.surefire.junit4.JUnit4Provider.execute(JUnit4Provider.java:252)
	at org.apache.maven.surefire.junit4.JUnit4Provider.executeTestSet(JUnit4Provider.java:141)
	at org.apache.maven.surefire.junit4.JUnit4Provider.invoke(JUnit4Provider.java:112)
	at sun.reflect.NativeMethodAccessorImpl.invoke0(Native Method)
	at sun.reflect.NativeMethodAccessorImpl.invoke(NativeMethodAccessorImpl.java:62)
	at sun.reflect.DelegatingMethodAccessorImpl.invoke(DelegatingMethodAccessorImpl.java:43)
	at java.lang.reflect.Method.invoke(Method.java:498)
	at org.apache.maven.surefire.util.ReflectionUtils.invokeMethodWithArray(ReflectionUtils.java:189)
	at org.apache.maven.surefire.booter.ProviderFactory$ProviderProxy.invoke(ProviderFactory.java:165)
	at org.apache.maven.surefire.booter.ProviderFactory.invokeProvider(ProviderFactory.java:85)
	at org.apache.maven.surefire.booter.ForkedBooter.runSuitesInProcess(ForkedBooter.java:115)
	at org.apache.maven.surefire.booter.ForkedBooter.main(ForkedBooter.java:75)

testGetAttributes(com.couchbase.jdbc.CBDatabaseMetaDataTest)  Time elapsed: 0.003 sec  <<< ERROR!
java.sql.SQLException: Error opening connection
	at com.couchbase.jdbc.CBConnection.<init>(CBConnection.java:79)
	at com.couchbase.jdbc.CBDriver.connect(CBDriver.java:94)
	at java.sql.DriverManager.getConnection(DriverManager.java:664)
	at java.sql.DriverManager.getConnection(DriverManager.java:208)
	at com.couchbase.jdbc.CBDatabaseMetaDataTest.openConnection(CBDatabaseMetaDataTest.java:54)
	at sun.reflect.GeneratedMethodAccessor5.invoke(Unknown Source)
	at sun.reflect.DelegatingMethodAccessorImpl.invoke(DelegatingMethodAccessorImpl.java:43)
	at java.lang.reflect.Method.invoke(Method.java:498)
	at org.junit.runners.model.FrameworkMethod$1.runReflectiveCall(FrameworkMethod.java:50)
	at org.junit.internal.runners.model.ReflectiveCallable.run(ReflectiveCallable.java:12)
	at org.junit.runners.model.FrameworkMethod.invokeExplosively(FrameworkMethod.java:47)
	at org.junit.internal.runners.statements.RunBefores.evaluate(RunBefores.java:24)
	at org.junit.internal.runners.statements.RunAfters.evaluate(RunAfters.java:27)
	at org.junit.runners.ParentRunner.runLeaf(ParentRunner.java:325)
	at org.junit.runners.BlockJUnit4ClassRunner.runChild(BlockJUnit4ClassRunner.java:78)
	at org.junit.runners.BlockJUnit4ClassRunner.runChild(BlockJUnit4ClassRunner.java:57)
	at org.junit.runners.ParentRunner$3.run(ParentRunner.java:290)
	at org.junit.runners.ParentRunner$1.schedule(ParentRunner.java:71)
	at org.junit.runners.ParentRunner.runChildren(ParentRunner.java:288)
	at org.junit.runners.ParentRunner.access$000(ParentRunner.java:58)
	at org.junit.runners.ParentRunner$2.evaluate(ParentRunner.java:268)
	at org.junit.internal.runners.statements.RunBefores.evaluate(RunBefores.java:26)
	at org.junit.runners.ParentRunner.run(ParentRunner.java:363)
	at org.apache.maven.surefire.junit4.JUnit4Provider.execute(JUnit4Provider.java:252)
	at org.apache.maven.surefire.junit4.JUnit4Provider.executeTestSet(JUnit4Provider.java:141)
	at org.apache.maven.surefire.junit4.JUnit4Provider.invoke(JUnit4Provider.java:112)
	at sun.reflect.NativeMethodAccessorImpl.invoke0(Native Method)
	at sun.reflect.NativeMethodAccessorImpl.invoke(NativeMethodAccessorImpl.java:62)
	at sun.reflect.DelegatingMethodAccessorImpl.invoke(DelegatingMethodAccessorImpl.java:43)
	at java.lang.reflect.Method.invoke(Method.java:498)
	at org.apache.maven.surefire.util.ReflectionUtils.invokeMethodWithArray(ReflectionUtils.java:189)
	at org.apache.maven.surefire.booter.ProviderFactory$ProviderProxy.invoke(ProviderFactory.java:165)
	at org.apache.maven.surefire.booter.ProviderFactory.invokeProvider(ProviderFactory.java:85)
	at org.apache.maven.surefire.booter.ForkedBooter.runSuitesInProcess(ForkedBooter.java:115)
	at org.apache.maven.surefire.booter.ForkedBooter.main(ForkedBooter.java:75)
Caused by: org.apache.http.conn.HttpHostConnectException: Connect to localhost:8093 [localhost/127.0.0.1, localhost/0:0:0:0:0:0:0:1] failed: Connection refused (Connection refused)
	at org.apache.http.impl.conn.DefaultHttpClientConnectionOperator.connect(DefaultHttpClientConnectionOperator.java:159)
	at org.apache.http.impl.conn.PoolingHttpClientConnectionManager.connect(PoolingHttpClientConnectionManager.java:359)
	at org.apache.http.impl.execchain.MainClientExec.establishRoute(MainClientExec.java:381)
	at org.apache.http.impl.execchain.MainClientExec.execute(MainClientExec.java:237)
	at org.apache.http.impl.execchain.ProtocolExec.execute(ProtocolExec.java:185)
	at org.apache.http.impl.execchain.RetryExec.execute(RetryExec.java:89)
	at org.apache.http.impl.execchain.RedirectExec.execute(RedirectExec.java:111)
	at org.apache.http.impl.client.InternalHttpClient.doExecute(InternalHttpClient.java:185)
	at org.apache.http.impl.client.CloseableHttpClient.execute(CloseableHttpClient.java:83)
	at org.apache.http.impl.client.CloseableHttpClient.execute(CloseableHttpClient.java:108)
	at com.couchbase.jdbc.core.ProtocolImpl.pollCluster(ProtocolImpl.java:977)
	at com.couchbase.jdbc.core.ProtocolImpl.connect(ProtocolImpl.java:238)
	at com.couchbase.jdbc.CBConnection.<init>(CBConnection.java:73)
	... 34 more
Caused by: java.net.ConnectException: Connection refused (Connection refused)
	at java.net.PlainSocketImpl.socketConnect(Native Method)
	at java.net.AbstractPlainSocketImpl.doConnect(AbstractPlainSocketImpl.java:350)
	at java.net.AbstractPlainSocketImpl.connectToAddress(AbstractPlainSocketImpl.java:206)
	at java.net.AbstractPlainSocketImpl.connect(AbstractPlainSocketImpl.java:188)
	at java.net.SocksSocketImpl.connect(SocksSocketImpl.java:392)
	at java.net.Socket.connect(Socket.java:589)
	at org.apache.http.conn.socket.PlainConnectionSocketFactory.connectSocket(PlainConnectionSocketFactory.java:75)
	at org.apache.http.impl.conn.DefaultHttpClientConnectionOperator.connect(DefaultHttpClientConnectionOperator.java:142)
	... 46 more

testGetAttributes(com.couchbase.jdbc.CBDatabaseMetaDataTest)  Time elapsed: 0.003 sec  <<< ERROR!
java.lang.NullPointerException
	at com.couchbase.jdbc.CBDatabaseMetaDataTest.close(CBDatabaseMetaDataTest.java:63)
	at sun.reflect.GeneratedMethodAccessor6.invoke(Unknown Source)
	at sun.reflect.DelegatingMethodAccessorImpl.invoke(DelegatingMethodAccessorImpl.java:43)
	at java.lang.reflect.Method.invoke(Method.java:498)
	at org.junit.runners.model.FrameworkMethod$1.runReflectiveCall(FrameworkMethod.java:50)
	at org.junit.internal.runners.model.ReflectiveCallable.run(ReflectiveCallable.java:12)
	at org.junit.runners.model.FrameworkMethod.invokeExplosively(FrameworkMethod.java:47)
	at org.junit.internal.runners.statements.RunAfters.evaluate(RunAfters.java:33)
	at org.junit.runners.ParentRunner.runLeaf(ParentRunner.java:325)
	at org.junit.runners.BlockJUnit4ClassRunner.runChild(BlockJUnit4ClassRunner.java:78)
	at org.junit.runners.BlockJUnit4ClassRunner.runChild(BlockJUnit4ClassRunner.java:57)
	at org.junit.runners.ParentRunner$3.run(ParentRunner.java:290)
	at org.junit.runners.ParentRunner$1.schedule(ParentRunner.java:71)
	at org.junit.runners.ParentRunner.runChildren(ParentRunner.java:288)
	at org.junit.runners.ParentRunner.access$000(ParentRunner.java:58)
	at org.junit.runners.ParentRunner$2.evaluate(ParentRunner.java:268)
	at org.junit.internal.runners.statements.RunBefores.evaluate(RunBefores.java:26)
	at org.junit.runners.ParentRunner.run(ParentRunner.java:363)
	at org.apache.maven.surefire.junit4.JUnit4Provider.execute(JUnit4Provider.java:252)
	at org.apache.maven.surefire.junit4.JUnit4Provider.executeTestSet(JUnit4Provider.java:141)
	at org.apache.maven.surefire.junit4.JUnit4Provider.invoke(JUnit4Provider.java:112)
	at sun.reflect.NativeMethodAccessorImpl.invoke0(Native Method)
	at sun.reflect.NativeMethodAccessorImpl.invoke(NativeMethodAccessorImpl.java:62)
	at sun.reflect.DelegatingMethodAccessorImpl.invoke(DelegatingMethodAccessorImpl.java:43)
	at java.lang.reflect.Method.invoke(Method.java:498)
	at org.apache.maven.surefire.util.ReflectionUtils.invokeMethodWithArray(ReflectionUtils.java:189)
	at org.apache.maven.surefire.booter.ProviderFactory$ProviderProxy.invoke(ProviderFactory.java:165)
	at org.apache.maven.surefire.booter.ProviderFactory.invokeProvider(ProviderFactory.java:85)
	at org.apache.maven.surefire.booter.ForkedBooter.runSuitesInProcess(ForkedBooter.java:115)
	at org.apache.maven.surefire.booter.ForkedBooter.main(ForkedBooter.java:75)

testGetProcedures(com.couchbase.jdbc.CBDatabaseMetaDataTest)  Time elapsed: 0.003 sec  <<< ERROR!
java.sql.SQLException: Error opening connection
	at com.couchbase.jdbc.CBConnection.<init>(CBConnection.java:79)
	at com.couchbase.jdbc.CBDriver.connect(CBDriver.java:94)
	at java.sql.DriverManager.getConnection(DriverManager.java:664)
	at java.sql.DriverManager.getConnection(DriverManager.java:208)
	at com.couchbase.jdbc.CBDatabaseMetaDataTest.openConnection(CBDatabaseMetaDataTest.java:54)
	at sun.reflect.GeneratedMethodAccessor5.invoke(Unknown Source)
	at sun.reflect.DelegatingMethodAccessorImpl.invoke(DelegatingMethodAccessorImpl.java:43)
	at java.lang.reflect.Method.invoke(Method.java:498)
	at org.junit.runners.model.FrameworkMethod$1.runReflectiveCall(FrameworkMethod.java:50)
	at org.junit.internal.runners.model.ReflectiveCallable.run(ReflectiveCallable.java:12)
	at org.junit.runners.model.FrameworkMethod.invokeExplosively(FrameworkMethod.java:47)
	at org.junit.internal.runners.statements.RunBefores.evaluate(RunBefores.java:24)
	at org.junit.internal.runners.statements.RunAfters.evaluate(RunAfters.java:27)
	at org.junit.runners.ParentRunner.runLeaf(ParentRunner.java:325)
	at org.junit.runners.BlockJUnit4ClassRunner.runChild(BlockJUnit4ClassRunner.java:78)
	at org.junit.runners.BlockJUnit4ClassRunner.runChild(BlockJUnit4ClassRunner.java:57)
	at org.junit.runners.ParentRunner$3.run(ParentRunner.java:290)
	at org.junit.runners.ParentRunner$1.schedule(ParentRunner.java:71)
	at org.junit.runners.ParentRunner.runChildren(ParentRunner.java:288)
	at org.junit.runners.ParentRunner.access$000(ParentRunner.java:58)
	at org.junit.runners.ParentRunner$2.evaluate(ParentRunner.java:268)
	at org.junit.internal.runners.statements.RunBefores.evaluate(RunBefores.java:26)
	at org.junit.runners.ParentRunner.run(ParentRunner.java:363)
	at org.apache.maven.surefire.junit4.JUnit4Provider.execute(JUnit4Provider.java:252)
	at org.apache.maven.surefire.junit4.JUnit4Provider.executeTestSet(JUnit4Provider.java:141)
	at org.apache.maven.surefire.junit4.JUnit4Provider.invoke(JUnit4Provider.java:112)
	at sun.reflect.NativeMethodAccessorImpl.invoke0(Native Method)
	at sun.reflect.NativeMethodAccessorImpl.invoke(NativeMethodAccessorImpl.java:62)
	at sun.reflect.DelegatingMethodAccessorImpl.invoke(DelegatingMethodAccessorImpl.java:43)
	at java.lang.reflect.Method.invoke(Method.java:498)
	at org.apache.maven.surefire.util.ReflectionUtils.invokeMethodWithArray(ReflectionUtils.java:189)
	at org.apache.maven.surefire.booter.ProviderFactory$ProviderProxy.invoke(ProviderFactory.java:165)
	at org.apache.maven.surefire.booter.ProviderFactory.invokeProvider(ProviderFactory.java:85)
	at org.apache.maven.surefire.booter.ForkedBooter.runSuitesInProcess(ForkedBooter.java:115)
	at org.apache.maven.surefire.booter.ForkedBooter.main(ForkedBooter.java:75)
Caused by: org.apache.http.conn.HttpHostConnectException: Connect to localhost:8093 [localhost/127.0.0.1, localhost/0:0:0:0:0:0:0:1] failed: Connection refused (Connection refused)
	at org.apache.http.impl.conn.DefaultHttpClientConnectionOperator.connect(DefaultHttpClientConnectionOperator.java:159)
	at org.apache.http.impl.conn.PoolingHttpClientConnectionManager.connect(PoolingHttpClientConnectionManager.java:359)
	at org.apache.http.impl.execchain.MainClientExec.establishRoute(MainClientExec.java:381)
	at org.apache.http.impl.execchain.MainClientExec.execute(MainClientExec.java:237)
	at org.apache.http.impl.execchain.ProtocolExec.execute(ProtocolExec.java:185)
	at org.apache.http.impl.execchain.RetryExec.execute(RetryExec.java:89)
	at org.apache.http.impl.execchain.RedirectExec.execute(RedirectExec.java:111)
	at org.apache.http.impl.client.InternalHttpClient.doExecute(InternalHttpClient.java:185)
	at org.apache.http.impl.client.CloseableHttpClient.execute(CloseableHttpClient.java:83)
	at org.apache.http.impl.client.CloseableHttpClient.execute(CloseableHttpClient.java:108)
	at com.couchbase.jdbc.core.ProtocolImpl.pollCluster(ProtocolImpl.java:977)
	at com.couchbase.jdbc.core.ProtocolImpl.connect(ProtocolImpl.java:238)
	at com.couchbase.jdbc.CBConnection.<init>(CBConnection.java:73)
	... 34 more
Caused by: java.net.ConnectException: Connection refused (Connection refused)
	at java.net.PlainSocketImpl.socketConnect(Native Method)
	at java.net.AbstractPlainSocketImpl.doConnect(AbstractPlainSocketImpl.java:350)
	at java.net.AbstractPlainSocketImpl.connectToAddress(AbstractPlainSocketImpl.java:206)
	at java.net.AbstractPlainSocketImpl.connect(AbstractPlainSocketImpl.java:188)
	at java.net.SocksSocketImpl.connect(SocksSocketImpl.java:392)
	at java.net.Socket.connect(Socket.java:589)
	at org.apache.http.conn.socket.PlainConnectionSocketFactory.connectSocket(PlainConnectionSocketFactory.java:75)
	at org.apache.http.impl.conn.DefaultHttpClientConnectionOperator.connect(DefaultHttpClientConnectionOperator.java:142)
	... 46 more

testGetProcedures(com.couchbase.jdbc.CBDatabaseMetaDataTest)  Time elapsed: 0.003 sec  <<< ERROR!
java.lang.NullPointerException
	at com.couchbase.jdbc.CBDatabaseMetaDataTest.close(CBDatabaseMetaDataTest.java:63)
	at sun.reflect.GeneratedMethodAccessor6.invoke(Unknown Source)
	at sun.reflect.DelegatingMethodAccessorImpl.invoke(DelegatingMethodAccessorImpl.java:43)
	at java.lang.reflect.Method.invoke(Method.java:498)
	at org.junit.runners.model.FrameworkMethod$1.runReflectiveCall(FrameworkMethod.java:50)
	at org.junit.internal.runners.model.ReflectiveCallable.run(ReflectiveCallable.java:12)
	at org.junit.runners.model.FrameworkMethod.invokeExplosively(FrameworkMethod.java:47)
	at org.junit.internal.runners.statements.RunAfters.evaluate(RunAfters.java:33)
	at org.junit.runners.ParentRunner.runLeaf(ParentRunner.java:325)
	at org.junit.runners.BlockJUnit4ClassRunner.runChild(BlockJUnit4ClassRunner.java:78)
	at org.junit.runners.BlockJUnit4ClassRunner.runChild(BlockJUnit4ClassRunner.java:57)
	at org.junit.runners.ParentRunner$3.run(ParentRunner.java:290)
	at org.junit.runners.ParentRunner$1.schedule(ParentRunner.java:71)
	at org.junit.runners.ParentRunner.runChildren(ParentRunner.java:288)
	at org.junit.runners.ParentRunner.access$000(ParentRunner.java:58)
	at org.junit.runners.ParentRunner$2.evaluate(ParentRunner.java:268)
	at org.junit.internal.runners.statements.RunBefores.evaluate(RunBefores.java:26)
	at org.junit.runners.ParentRunner.run(ParentRunner.java:363)
	at org.apache.maven.surefire.junit4.JUnit4Provider.execute(JUnit4Provider.java:252)
	at org.apache.maven.surefire.junit4.JUnit4Provider.executeTestSet(JUnit4Provider.java:141)
	at org.apache.maven.surefire.junit4.JUnit4Provider.invoke(JUnit4Provider.java:112)
	at sun.reflect.NativeMethodAccessorImpl.invoke0(Native Method)
	at sun.reflect.NativeMethodAccessorImpl.invoke(NativeMethodAccessorImpl.java:62)
	at sun.reflect.DelegatingMethodAccessorImpl.invoke(DelegatingMethodAccessorImpl.java:43)
	at java.lang.reflect.Method.invoke(Method.java:498)
	at org.apache.maven.surefire.util.ReflectionUtils.invokeMethodWithArray(ReflectionUtils.java:189)
	at org.apache.maven.surefire.booter.ProviderFactory$ProviderProxy.invoke(ProviderFactory.java:165)
	at org.apache.maven.surefire.booter.ProviderFactory.invokeProvider(ProviderFactory.java:85)
	at org.apache.maven.surefire.booter.ForkedBooter.runSuitesInProcess(ForkedBooter.java:115)
	at org.apache.maven.surefire.booter.ForkedBooter.main(ForkedBooter.java:75)

testGetResultSetHoldability(com.couchbase.jdbc.CBDatabaseMetaDataTest)  Time elapsed: 0.003 sec  <<< ERROR!
java.sql.SQLException: Error opening connection
	at com.couchbase.jdbc.CBConnection.<init>(CBConnection.java:79)
	at com.couchbase.jdbc.CBDriver.connect(CBDriver.java:94)
	at java.sql.DriverManager.getConnection(DriverManager.java:664)
	at java.sql.DriverManager.getConnection(DriverManager.java:208)
	at com.couchbase.jdbc.CBDatabaseMetaDataTest.openConnection(CBDatabaseMetaDataTest.java:54)
	at sun.reflect.GeneratedMethodAccessor5.invoke(Unknown Source)
	at sun.reflect.DelegatingMethodAccessorImpl.invoke(DelegatingMethodAccessorImpl.java:43)
	at java.lang.reflect.Method.invoke(Method.java:498)
	at org.junit.runners.model.FrameworkMethod$1.runReflectiveCall(FrameworkMethod.java:50)
	at org.junit.internal.runners.model.ReflectiveCallable.run(ReflectiveCallable.java:12)
	at org.junit.runners.model.FrameworkMethod.invokeExplosively(FrameworkMethod.java:47)
	at org.junit.internal.runners.statements.RunBefores.evaluate(RunBefores.java:24)
	at org.junit.internal.runners.statements.RunAfters.evaluate(RunAfters.java:27)
	at org.junit.runners.ParentRunner.runLeaf(ParentRunner.java:325)
	at org.junit.runners.BlockJUnit4ClassRunner.runChild(BlockJUnit4ClassRunner.java:78)
	at org.junit.runners.BlockJUnit4ClassRunner.runChild(BlockJUnit4ClassRunner.java:57)
	at org.junit.runners.ParentRunner$3.run(ParentRunner.java:290)
	at org.junit.runners.ParentRunner$1.schedule(ParentRunner.java:71)
	at org.junit.runners.ParentRunner.runChildren(ParentRunner.java:288)
	at org.junit.runners.ParentRunner.access$000(ParentRunner.java:58)
	at org.junit.runners.ParentRunner$2.evaluate(ParentRunner.java:268)
	at org.junit.internal.runners.statements.RunBefores.evaluate(RunBefores.java:26)
	at org.junit.runners.ParentRunner.run(ParentRunner.java:363)
	at org.apache.maven.surefire.junit4.JUnit4Provider.execute(JUnit4Provider.java:252)
	at org.apache.maven.surefire.junit4.JUnit4Provider.executeTestSet(JUnit4Provider.java:141)
	at org.apache.maven.surefire.junit4.JUnit4Provider.invoke(JUnit4Provider.java:112)
	at sun.reflect.NativeMethodAccessorImpl.invoke0(Native Method)
	at sun.reflect.NativeMethodAccessorImpl.invoke(NativeMethodAccessorImpl.java:62)
	at sun.reflect.DelegatingMethodAccessorImpl.invoke(DelegatingMethodAccessorImpl.java:43)
	at java.lang.reflect.Method.invoke(Method.java:498)
	at org.apache.maven.surefire.util.ReflectionUtils.invokeMethodWithArray(ReflectionUtils.java:189)
	at org.apache.maven.surefire.booter.ProviderFactory$ProviderProxy.invoke(ProviderFactory.java:165)
	at org.apache.maven.surefire.booter.ProviderFactory.invokeProvider(ProviderFactory.java:85)
	at org.apache.maven.surefire.booter.ForkedBooter.runSuitesInProcess(ForkedBooter.java:115)
	at org.apache.maven.surefire.booter.ForkedBooter.main(ForkedBooter.java:75)
Caused by: org.apache.http.conn.HttpHostConnectException: Connect to localhost:8093 [localhost/127.0.0.1, localhost/0:0:0:0:0:0:0:1] failed: Connection refused (Connection refused)
	at org.apache.http.impl.conn.DefaultHttpClientConnectionOperator.connect(DefaultHttpClientConnectionOperator.java:159)
	at org.apache.http.impl.conn.PoolingHttpClientConnectionManager.connect(PoolingHttpClientConnectionManager.java:359)
	at org.apache.http.impl.execchain.MainClientExec.establishRoute(MainClientExec.java:381)
	at org.apache.http.impl.execchain.MainClientExec.execute(MainClientExec.java:237)
	at org.apache.http.impl.execchain.ProtocolExec.execute(ProtocolExec.java:185)
	at org.apache.http.impl.execchain.RetryExec.execute(RetryExec.java:89)
	at org.apache.http.impl.execchain.RedirectExec.execute(RedirectExec.java:111)
	at org.apache.http.impl.client.InternalHttpClient.doExecute(InternalHttpClient.java:185)
	at org.apache.http.impl.client.CloseableHttpClient.execute(CloseableHttpClient.java:83)
	at org.apache.http.impl.client.CloseableHttpClient.execute(CloseableHttpClient.java:108)
	at com.couchbase.jdbc.core.ProtocolImpl.pollCluster(ProtocolImpl.java:977)
	at com.couchbase.jdbc.core.ProtocolImpl.connect(ProtocolImpl.java:238)
	at com.couchbase.jdbc.CBConnection.<init>(CBConnection.java:73)
	... 34 more
Caused by: java.net.ConnectException: Connection refused (Connection refused)
	at java.net.PlainSocketImpl.socketConnect(Native Method)
	at java.net.AbstractPlainSocketImpl.doConnect(AbstractPlainSocketImpl.java:350)
	at java.net.AbstractPlainSocketImpl.connectToAddress(AbstractPlainSocketImpl.java:206)
	at java.net.AbstractPlainSocketImpl.connect(AbstractPlainSocketImpl.java:188)
	at java.net.SocksSocketImpl.connect(SocksSocketImpl.java:392)
	at java.net.Socket.connect(Socket.java:589)
	at org.apache.http.conn.socket.PlainConnectionSocketFactory.connectSocket(PlainConnectionSocketFactory.java:75)
	at org.apache.http.impl.conn.DefaultHttpClientConnectionOperator.connect(DefaultHttpClientConnectionOperator.java:142)
	... 46 more

testGetResultSetHoldability(com.couchbase.jdbc.CBDatabaseMetaDataTest)  Time elapsed: 0.003 sec  <<< ERROR!
java.lang.NullPointerException
	at com.couchbase.jdbc.CBDatabaseMetaDataTest.close(CBDatabaseMetaDataTest.java:63)
	at sun.reflect.GeneratedMethodAccessor6.invoke(Unknown Source)
	at sun.reflect.DelegatingMethodAccessorImpl.invoke(DelegatingMethodAccessorImpl.java:43)
	at java.lang.reflect.Method.invoke(Method.java:498)
	at org.junit.runners.model.FrameworkMethod$1.runReflectiveCall(FrameworkMethod.java:50)
	at org.junit.internal.runners.model.ReflectiveCallable.run(ReflectiveCallable.java:12)
	at org.junit.runners.model.FrameworkMethod.invokeExplosively(FrameworkMethod.java:47)
	at org.junit.internal.runners.statements.RunAfters.evaluate(RunAfters.java:33)
	at org.junit.runners.ParentRunner.runLeaf(ParentRunner.java:325)
	at org.junit.runners.BlockJUnit4ClassRunner.runChild(BlockJUnit4ClassRunner.java:78)
	at org.junit.runners.BlockJUnit4ClassRunner.runChild(BlockJUnit4ClassRunner.java:57)
	at org.junit.runners.ParentRunner$3.run(ParentRunner.java:290)
	at org.junit.runners.ParentRunner$1.schedule(ParentRunner.java:71)
	at org.junit.runners.ParentRunner.runChildren(ParentRunner.java:288)
	at org.junit.runners.ParentRunner.access$000(ParentRunner.java:58)
	at org.junit.runners.ParentRunner$2.evaluate(ParentRunner.java:268)
	at org.junit.internal.runners.statements.RunBefores.evaluate(RunBefores.java:26)
	at org.junit.runners.ParentRunner.run(ParentRunner.java:363)
	at org.apache.maven.surefire.junit4.JUnit4Provider.execute(JUnit4Provider.java:252)
	at org.apache.maven.surefire.junit4.JUnit4Provider.executeTestSet(JUnit4Provider.java:141)
	at org.apache.maven.surefire.junit4.JUnit4Provider.invoke(JUnit4Provider.java:112)
	at sun.reflect.NativeMethodAccessorImpl.invoke0(Native Method)
	at sun.reflect.NativeMethodAccessorImpl.invoke(NativeMethodAccessorImpl.java:62)
	at sun.reflect.DelegatingMethodAccessorImpl.invoke(DelegatingMethodAccessorImpl.java:43)
	at java.lang.reflect.Method.invoke(Method.java:498)
	at org.apache.maven.surefire.util.ReflectionUtils.invokeMethodWithArray(ReflectionUtils.java:189)
	at org.apache.maven.surefire.booter.ProviderFactory$ProviderProxy.invoke(ProviderFactory.java:165)
	at org.apache.maven.surefire.booter.ProviderFactory.invokeProvider(ProviderFactory.java:85)
	at org.apache.maven.surefire.booter.ForkedBooter.runSuitesInProcess(ForkedBooter.java:115)
	at org.apache.maven.surefire.booter.ForkedBooter.main(ForkedBooter.java:75)

testDoesMaxRowSizeIncludeBlobs(com.couchbase.jdbc.CBDatabaseMetaDataTest)  Time elapsed: 0.002 sec  <<< ERROR!
java.sql.SQLException: Error opening connection
	at com.couchbase.jdbc.CBConnection.<init>(CBConnection.java:79)
	at com.couchbase.jdbc.CBDriver.connect(CBDriver.java:94)
	at java.sql.DriverManager.getConnection(DriverManager.java:664)
	at java.sql.DriverManager.getConnection(DriverManager.java:208)
	at com.couchbase.jdbc.CBDatabaseMetaDataTest.openConnection(CBDatabaseMetaDataTest.java:54)
	at sun.reflect.GeneratedMethodAccessor5.invoke(Unknown Source)
	at sun.reflect.DelegatingMethodAccessorImpl.invoke(DelegatingMethodAccessorImpl.java:43)
	at java.lang.reflect.Method.invoke(Method.java:498)
	at org.junit.runners.model.FrameworkMethod$1.runReflectiveCall(FrameworkMethod.java:50)
	at org.junit.internal.runners.model.ReflectiveCallable.run(ReflectiveCallable.java:12)
	at org.junit.runners.model.FrameworkMethod.invokeExplosively(FrameworkMethod.java:47)
	at org.junit.internal.runners.statements.RunBefores.evaluate(RunBefores.java:24)
	at org.junit.internal.runners.statements.RunAfters.evaluate(RunAfters.java:27)
	at org.junit.runners.ParentRunner.runLeaf(ParentRunner.java:325)
	at org.junit.runners.BlockJUnit4ClassRunner.runChild(BlockJUnit4ClassRunner.java:78)
	at org.junit.runners.BlockJUnit4ClassRunner.runChild(BlockJUnit4ClassRunner.java:57)
	at org.junit.runners.ParentRunner$3.run(ParentRunner.java:290)
	at org.junit.runners.ParentRunner$1.schedule(ParentRunner.java:71)
	at org.junit.runners.ParentRunner.runChildren(ParentRunner.java:288)
	at org.junit.runners.ParentRunner.access$000(ParentRunner.java:58)
	at org.junit.runners.ParentRunner$2.evaluate(ParentRunner.java:268)
	at org.junit.internal.runners.statements.RunBefores.evaluate(RunBefores.java:26)
	at org.junit.runners.ParentRunner.run(ParentRunner.java:363)
	at org.apache.maven.surefire.junit4.JUnit4Provider.execute(JUnit4Provider.java:252)
	at org.apache.maven.surefire.junit4.JUnit4Provider.executeTestSet(JUnit4Provider.java:141)
	at org.apache.maven.surefire.junit4.JUnit4Provider.invoke(JUnit4Provider.java:112)
	at sun.reflect.NativeMethodAccessorImpl.invoke0(Native Method)
	at sun.reflect.NativeMethodAccessorImpl.invoke(NativeMethodAccessorImpl.java:62)
	at sun.reflect.DelegatingMethodAccessorImpl.invoke(DelegatingMethodAccessorImpl.java:43)
	at java.lang.reflect.Method.invoke(Method.java:498)
	at org.apache.maven.surefire.util.ReflectionUtils.invokeMethodWithArray(ReflectionUtils.java:189)
	at org.apache.maven.surefire.booter.ProviderFactory$ProviderProxy.invoke(ProviderFactory.java:165)
	at org.apache.maven.surefire.booter.ProviderFactory.invokeProvider(ProviderFactory.java:85)
	at org.apache.maven.surefire.booter.ForkedBooter.runSuitesInProcess(ForkedBooter.java:115)
	at org.apache.maven.surefire.booter.ForkedBooter.main(ForkedBooter.java:75)
Caused by: org.apache.http.conn.HttpHostConnectException: Connect to localhost:8093 [localhost/127.0.0.1, localhost/0:0:0:0:0:0:0:1] failed: Connection refused (Connection refused)
	at org.apache.http.impl.conn.DefaultHttpClientConnectionOperator.connect(DefaultHttpClientConnectionOperator.java:159)
	at org.apache.http.impl.conn.PoolingHttpClientConnectionManager.connect(PoolingHttpClientConnectionManager.java:359)
	at org.apache.http.impl.execchain.MainClientExec.establishRoute(MainClientExec.java:381)
	at org.apache.http.impl.execchain.MainClientExec.execute(MainClientExec.java:237)
	at org.apache.http.impl.execchain.ProtocolExec.execute(ProtocolExec.java:185)
	at org.apache.http.impl.execchain.RetryExec.execute(RetryExec.java:89)
	at org.apache.http.impl.execchain.RedirectExec.execute(RedirectExec.java:111)
	at org.apache.http.impl.client.InternalHttpClient.doExecute(InternalHttpClient.java:185)
	at org.apache.http.impl.client.CloseableHttpClient.execute(CloseableHttpClient.java:83)
	at org.apache.http.impl.client.CloseableHttpClient.execute(CloseableHttpClient.java:108)
	at com.couchbase.jdbc.core.ProtocolImpl.pollCluster(ProtocolImpl.java:977)
	at com.couchbase.jdbc.core.ProtocolImpl.connect(ProtocolImpl.java:238)
	at com.couchbase.jdbc.CBConnection.<init>(CBConnection.java:73)
	... 34 more
Caused by: java.net.ConnectException: Connection refused (Connection refused)
	at java.net.PlainSocketImpl.socketConnect(Native Method)
	at java.net.AbstractPlainSocketImpl.doConnect(AbstractPlainSocketImpl.java:350)
	at java.net.AbstractPlainSocketImpl.connectToAddress(AbstractPlainSocketImpl.java:206)
	at java.net.AbstractPlainSocketImpl.connect(AbstractPlainSocketImpl.java:188)
	at java.net.SocksSocketImpl.connect(SocksSocketImpl.java:392)
	at java.net.Socket.connect(Socket.java:589)
	at org.apache.http.conn.socket.PlainConnectionSocketFactory.connectSocket(PlainConnectionSocketFactory.java:75)
	at org.apache.http.impl.conn.DefaultHttpClientConnectionOperator.connect(DefaultHttpClientConnectionOperator.java:142)
	... 46 more

testDoesMaxRowSizeIncludeBlobs(com.couchbase.jdbc.CBDatabaseMetaDataTest)  Time elapsed: 0.003 sec  <<< ERROR!
java.lang.NullPointerException
	at com.couchbase.jdbc.CBDatabaseMetaDataTest.close(CBDatabaseMetaDataTest.java:63)
	at sun.reflect.GeneratedMethodAccessor6.invoke(Unknown Source)
	at sun.reflect.DelegatingMethodAccessorImpl.invoke(DelegatingMethodAccessorImpl.java:43)
	at java.lang.reflect.Method.invoke(Method.java:498)
	at org.junit.runners.model.FrameworkMethod$1.runReflectiveCall(FrameworkMethod.java:50)
	at org.junit.internal.runners.model.ReflectiveCallable.run(ReflectiveCallable.java:12)
	at org.junit.runners.model.FrameworkMethod.invokeExplosively(FrameworkMethod.java:47)
	at org.junit.internal.runners.statements.RunAfters.evaluate(RunAfters.java:33)
	at org.junit.runners.ParentRunner.runLeaf(ParentRunner.java:325)
	at org.junit.runners.BlockJUnit4ClassRunner.runChild(BlockJUnit4ClassRunner.java:78)
	at org.junit.runners.BlockJUnit4ClassRunner.runChild(BlockJUnit4ClassRunner.java:57)
	at org.junit.runners.ParentRunner$3.run(ParentRunner.java:290)
	at org.junit.runners.ParentRunner$1.schedule(ParentRunner.java:71)
	at org.junit.runners.ParentRunner.runChildren(ParentRunner.java:288)
	at org.junit.runners.ParentRunner.access$000(ParentRunner.java:58)
	at org.junit.runners.ParentRunner$2.evaluate(ParentRunner.java:268)
	at org.junit.internal.runners.statements.RunBefores.evaluate(RunBefores.java:26)
	at org.junit.runners.ParentRunner.run(ParentRunner.java:363)
	at org.apache.maven.surefire.junit4.JUnit4Provider.execute(JUnit4Provider.java:252)
	at org.apache.maven.surefire.junit4.JUnit4Provider.executeTestSet(JUnit4Provider.java:141)
	at org.apache.maven.surefire.junit4.JUnit4Provider.invoke(JUnit4Provider.java:112)
	at sun.reflect.NativeMethodAccessorImpl.invoke0(Native Method)
	at sun.reflect.NativeMethodAccessorImpl.invoke(NativeMethodAccessorImpl.java:62)
	at sun.reflect.DelegatingMethodAccessorImpl.invoke(DelegatingMethodAccessorImpl.java:43)
	at java.lang.reflect.Method.invoke(Method.java:498)
	at org.apache.maven.surefire.util.ReflectionUtils.invokeMethodWithArray(ReflectionUtils.java:189)
	at org.apache.maven.surefire.booter.ProviderFactory$ProviderProxy.invoke(ProviderFactory.java:165)
	at org.apache.maven.surefire.booter.ProviderFactory.invokeProvider(ProviderFactory.java:85)
	at org.apache.maven.surefire.booter.ForkedBooter.runSuitesInProcess(ForkedBooter.java:115)
	at org.apache.maven.surefire.booter.ForkedBooter.main(ForkedBooter.java:75)

testOthersDeletesAreVisible(com.couchbase.jdbc.CBDatabaseMetaDataTest)  Time elapsed: 0.003 sec  <<< ERROR!
java.sql.SQLException: Error opening connection
	at com.couchbase.jdbc.CBConnection.<init>(CBConnection.java:79)
	at com.couchbase.jdbc.CBDriver.connect(CBDriver.java:94)
	at java.sql.DriverManager.getConnection(DriverManager.java:664)
	at java.sql.DriverManager.getConnection(DriverManager.java:208)
	at com.couchbase.jdbc.CBDatabaseMetaDataTest.openConnection(CBDatabaseMetaDataTest.java:54)
	at sun.reflect.GeneratedMethodAccessor5.invoke(Unknown Source)
	at sun.reflect.DelegatingMethodAccessorImpl.invoke(DelegatingMethodAccessorImpl.java:43)
	at java.lang.reflect.Method.invoke(Method.java:498)
	at org.junit.runners.model.FrameworkMethod$1.runReflectiveCall(FrameworkMethod.java:50)
	at org.junit.internal.runners.model.ReflectiveCallable.run(ReflectiveCallable.java:12)
	at org.junit.runners.model.FrameworkMethod.invokeExplosively(FrameworkMethod.java:47)
	at org.junit.internal.runners.statements.RunBefores.evaluate(RunBefores.java:24)
	at org.junit.internal.runners.statements.RunAfters.evaluate(RunAfters.java:27)
	at org.junit.runners.ParentRunner.runLeaf(ParentRunner.java:325)
	at org.junit.runners.BlockJUnit4ClassRunner.runChild(BlockJUnit4ClassRunner.java:78)
	at org.junit.runners.BlockJUnit4ClassRunner.runChild(BlockJUnit4ClassRunner.java:57)
	at org.junit.runners.ParentRunner$3.run(ParentRunner.java:290)
	at org.junit.runners.ParentRunner$1.schedule(ParentRunner.java:71)
	at org.junit.runners.ParentRunner.runChildren(ParentRunner.java:288)
	at org.junit.runners.ParentRunner.access$000(ParentRunner.java:58)
	at org.junit.runners.ParentRunner$2.evaluate(ParentRunner.java:268)
	at org.junit.internal.runners.statements.RunBefores.evaluate(RunBefores.java:26)
	at org.junit.runners.ParentRunner.run(ParentRunner.java:363)
	at org.apache.maven.surefire.junit4.JUnit4Provider.execute(JUnit4Provider.java:252)
	at org.apache.maven.surefire.junit4.JUnit4Provider.executeTestSet(JUnit4Provider.java:141)
	at org.apache.maven.surefire.junit4.JUnit4Provider.invoke(JUnit4Provider.java:112)
	at sun.reflect.NativeMethodAccessorImpl.invoke0(Native Method)
	at sun.reflect.NativeMethodAccessorImpl.invoke(NativeMethodAccessorImpl.java:62)
	at sun.reflect.DelegatingMethodAccessorImpl.invoke(DelegatingMethodAccessorImpl.java:43)
	at java.lang.reflect.Method.invoke(Method.java:498)
	at org.apache.maven.surefire.util.ReflectionUtils.invokeMethodWithArray(ReflectionUtils.java:189)
	at org.apache.maven.surefire.booter.ProviderFactory$ProviderProxy.invoke(ProviderFactory.java:165)
	at org.apache.maven.surefire.booter.ProviderFactory.invokeProvider(ProviderFactory.java:85)
	at org.apache.maven.surefire.booter.ForkedBooter.runSuitesInProcess(ForkedBooter.java:115)
	at org.apache.maven.surefire.booter.ForkedBooter.main(ForkedBooter.java:75)
Caused by: org.apache.http.conn.HttpHostConnectException: Connect to localhost:8093 [localhost/127.0.0.1, localhost/0:0:0:0:0:0:0:1] failed: Connection refused (Connection refused)
	at org.apache.http.impl.conn.DefaultHttpClientConnectionOperator.connect(DefaultHttpClientConnectionOperator.java:159)
	at org.apache.http.impl.conn.PoolingHttpClientConnectionManager.connect(PoolingHttpClientConnectionManager.java:359)
	at org.apache.http.impl.execchain.MainClientExec.establishRoute(MainClientExec.java:381)
	at org.apache.http.impl.execchain.MainClientExec.execute(MainClientExec.java:237)
	at org.apache.http.impl.execchain.ProtocolExec.execute(ProtocolExec.java:185)
	at org.apache.http.impl.execchain.RetryExec.execute(RetryExec.java:89)
	at org.apache.http.impl.execchain.RedirectExec.execute(RedirectExec.java:111)
	at org.apache.http.impl.client.InternalHttpClient.doExecute(InternalHttpClient.java:185)
	at org.apache.http.impl.client.CloseableHttpClient.execute(CloseableHttpClient.java:83)
	at org.apache.http.impl.client.CloseableHttpClient.execute(CloseableHttpClient.java:108)
	at com.couchbase.jdbc.core.ProtocolImpl.pollCluster(ProtocolImpl.java:977)
	at com.couchbase.jdbc.core.ProtocolImpl.connect(ProtocolImpl.java:238)
	at com.couchbase.jdbc.CBConnection.<init>(CBConnection.java:73)
	... 34 more
Caused by: java.net.ConnectException: Connection refused (Connection refused)
	at java.net.PlainSocketImpl.socketConnect(Native Method)
	at java.net.AbstractPlainSocketImpl.doConnect(AbstractPlainSocketImpl.java:350)
	at java.net.AbstractPlainSocketImpl.connectToAddress(AbstractPlainSocketImpl.java:206)
	at java.net.AbstractPlainSocketImpl.connect(AbstractPlainSocketImpl.java:188)
	at java.net.SocksSocketImpl.connect(SocksSocketImpl.java:392)
	at java.net.Socket.connect(Socket.java:589)
	at org.apache.http.conn.socket.PlainConnectionSocketFactory.connectSocket(PlainConnectionSocketFactory.java:75)
	at org.apache.http.impl.conn.DefaultHttpClientConnectionOperator.connect(DefaultHttpClientConnectionOperator.java:142)
	... 46 more

testOthersDeletesAreVisible(com.couchbase.jdbc.CBDatabaseMetaDataTest)  Time elapsed: 0.003 sec  <<< ERROR!
java.lang.NullPointerException
	at com.couchbase.jdbc.CBDatabaseMetaDataTest.close(CBDatabaseMetaDataTest.java:63)
	at sun.reflect.GeneratedMethodAccessor6.invoke(Unknown Source)
	at sun.reflect.DelegatingMethodAccessorImpl.invoke(DelegatingMethodAccessorImpl.java:43)
	at java.lang.reflect.Method.invoke(Method.java:498)
	at org.junit.runners.model.FrameworkMethod$1.runReflectiveCall(FrameworkMethod.java:50)
	at org.junit.internal.runners.model.ReflectiveCallable.run(ReflectiveCallable.java:12)
	at org.junit.runners.model.FrameworkMethod.invokeExplosively(FrameworkMethod.java:47)
	at org.junit.internal.runners.statements.RunAfters.evaluate(RunAfters.java:33)
	at org.junit.runners.ParentRunner.runLeaf(ParentRunner.java:325)
	at org.junit.runners.BlockJUnit4ClassRunner.runChild(BlockJUnit4ClassRunner.java:78)
	at org.junit.runners.BlockJUnit4ClassRunner.runChild(BlockJUnit4ClassRunner.java:57)
	at org.junit.runners.ParentRunner$3.run(ParentRunner.java:290)
	at org.junit.runners.ParentRunner$1.schedule(ParentRunner.java:71)
	at org.junit.runners.ParentRunner.runChildren(ParentRunner.java:288)
	at org.junit.runners.ParentRunner.access$000(ParentRunner.java:58)
	at org.junit.runners.ParentRunner$2.evaluate(ParentRunner.java:268)
	at org.junit.internal.runners.statements.RunBefores.evaluate(RunBefores.java:26)
	at org.junit.runners.ParentRunner.run(ParentRunner.java:363)
	at org.apache.maven.surefire.junit4.JUnit4Provider.execute(JUnit4Provider.java:252)
	at org.apache.maven.surefire.junit4.JUnit4Provider.executeTestSet(JUnit4Provider.java:141)
	at org.apache.maven.surefire.junit4.JUnit4Provider.invoke(JUnit4Provider.java:112)
	at sun.reflect.NativeMethodAccessorImpl.invoke0(Native Method)
	at sun.reflect.NativeMethodAccessorImpl.invoke(NativeMethodAccessorImpl.java:62)
	at sun.reflect.DelegatingMethodAccessorImpl.invoke(DelegatingMethodAccessorImpl.java:43)
	at java.lang.reflect.Method.invoke(Method.java:498)
	at org.apache.maven.surefire.util.ReflectionUtils.invokeMethodWithArray(ReflectionUtils.java:189)
	at org.apache.maven.surefire.booter.ProviderFactory$ProviderProxy.invoke(ProviderFactory.java:165)
	at org.apache.maven.surefire.booter.ProviderFactory.invokeProvider(ProviderFactory.java:85)
	at org.apache.maven.surefire.booter.ForkedBooter.runSuitesInProcess(ForkedBooter.java:115)
	at org.apache.maven.surefire.booter.ForkedBooter.main(ForkedBooter.java:75)

testSupportsLikeEscapeClause(com.couchbase.jdbc.CBDatabaseMetaDataTest)  Time elapsed: 0.003 sec  <<< ERROR!
java.sql.SQLException: Error opening connection
	at com.couchbase.jdbc.CBConnection.<init>(CBConnection.java:79)
	at com.couchbase.jdbc.CBDriver.connect(CBDriver.java:94)
	at java.sql.DriverManager.getConnection(DriverManager.java:664)
	at java.sql.DriverManager.getConnection(DriverManager.java:208)
	at com.couchbase.jdbc.CBDatabaseMetaDataTest.openConnection(CBDatabaseMetaDataTest.java:54)
	at sun.reflect.GeneratedMethodAccessor5.invoke(Unknown Source)
	at sun.reflect.DelegatingMethodAccessorImpl.invoke(DelegatingMethodAccessorImpl.java:43)
	at java.lang.reflect.Method.invoke(Method.java:498)
	at org.junit.runners.model.FrameworkMethod$1.runReflectiveCall(FrameworkMethod.java:50)
	at org.junit.internal.runners.model.ReflectiveCallable.run(ReflectiveCallable.java:12)
	at org.junit.runners.model.FrameworkMethod.invokeExplosively(FrameworkMethod.java:47)
	at org.junit.internal.runners.statements.RunBefores.evaluate(RunBefores.java:24)
	at org.junit.internal.runners.statements.RunAfters.evaluate(RunAfters.java:27)
	at org.junit.runners.ParentRunner.runLeaf(ParentRunner.java:325)
	at org.junit.runners.BlockJUnit4ClassRunner.runChild(BlockJUnit4ClassRunner.java:78)
	at org.junit.runners.BlockJUnit4ClassRunner.runChild(BlockJUnit4ClassRunner.java:57)
	at org.junit.runners.ParentRunner$3.run(ParentRunner.java:290)
	at org.junit.runners.ParentRunner$1.schedule(ParentRunner.java:71)
	at org.junit.runners.ParentRunner.runChildren(ParentRunner.java:288)
	at org.junit.runners.ParentRunner.access$000(ParentRunner.java:58)
	at org.junit.runners.ParentRunner$2.evaluate(ParentRunner.java:268)
	at org.junit.internal.runners.statements.RunBefores.evaluate(RunBefores.java:26)
	at org.junit.runners.ParentRunner.run(ParentRunner.java:363)
	at org.apache.maven.surefire.junit4.JUnit4Provider.execute(JUnit4Provider.java:252)
	at org.apache.maven.surefire.junit4.JUnit4Provider.executeTestSet(JUnit4Provider.java:141)
	at org.apache.maven.surefire.junit4.JUnit4Provider.invoke(JUnit4Provider.java:112)
	at sun.reflect.NativeMethodAccessorImpl.invoke0(Native Method)
	at sun.reflect.NativeMethodAccessorImpl.invoke(NativeMethodAccessorImpl.java:62)
	at sun.reflect.DelegatingMethodAccessorImpl.invoke(DelegatingMethodAccessorImpl.java:43)
	at java.lang.reflect.Method.invoke(Method.java:498)
	at org.apache.maven.surefire.util.ReflectionUtils.invokeMethodWithArray(ReflectionUtils.java:189)
	at org.apache.maven.surefire.booter.ProviderFactory$ProviderProxy.invoke(ProviderFactory.java:165)
	at org.apache.maven.surefire.booter.ProviderFactory.invokeProvider(ProviderFactory.java:85)
	at org.apache.maven.surefire.booter.ForkedBooter.runSuitesInProcess(ForkedBooter.java:115)
	at org.apache.maven.surefire.booter.ForkedBooter.main(ForkedBooter.java:75)
Caused by: org.apache.http.conn.HttpHostConnectException: Connect to localhost:8093 [localhost/127.0.0.1, localhost/0:0:0:0:0:0:0:1] failed: Connection refused (Connection refused)
	at org.apache.http.impl.conn.DefaultHttpClientConnectionOperator.connect(DefaultHttpClientConnectionOperator.java:159)
	at org.apache.http.impl.conn.PoolingHttpClientConnectionManager.connect(PoolingHttpClientConnectionManager.java:359)
	at org.apache.http.impl.execchain.MainClientExec.establishRoute(MainClientExec.java:381)
	at org.apache.http.impl.execchain.MainClientExec.execute(MainClientExec.java:237)
	at org.apache.http.impl.execchain.ProtocolExec.execute(ProtocolExec.java:185)
	at org.apache.http.impl.execchain.RetryExec.execute(RetryExec.java:89)
	at org.apache.http.impl.execchain.RedirectExec.execute(RedirectExec.java:111)
	at org.apache.http.impl.client.InternalHttpClient.doExecute(InternalHttpClient.java:185)
	at org.apache.http.impl.client.CloseableHttpClient.execute(CloseableHttpClient.java:83)
	at org.apache.http.impl.client.CloseableHttpClient.execute(CloseableHttpClient.java:108)
	at com.couchbase.jdbc.core.ProtocolImpl.pollCluster(ProtocolImpl.java:977)
	at com.couchbase.jdbc.core.ProtocolImpl.connect(ProtocolImpl.java:238)
	at com.couchbase.jdbc.CBConnection.<init>(CBConnection.java:73)
	... 34 more
Caused by: java.net.ConnectException: Connection refused (Connection refused)
	at java.net.PlainSocketImpl.socketConnect(Native Method)
	at java.net.AbstractPlainSocketImpl.doConnect(AbstractPlainSocketImpl.java:350)
	at java.net.AbstractPlainSocketImpl.connectToAddress(AbstractPlainSocketImpl.java:206)
	at java.net.AbstractPlainSocketImpl.connect(AbstractPlainSocketImpl.java:188)
	at java.net.SocksSocketImpl.connect(SocksSocketImpl.java:392)
	at java.net.Socket.connect(Socket.java:589)
	at org.apache.http.conn.socket.PlainConnectionSocketFactory.connectSocket(PlainConnectionSocketFactory.java:75)
	at org.apache.http.impl.conn.DefaultHttpClientConnectionOperator.connect(DefaultHttpClientConnectionOperator.java:142)
	... 46 more

testSupportsLikeEscapeClause(com.couchbase.jdbc.CBDatabaseMetaDataTest)  Time elapsed: 0.003 sec  <<< ERROR!
java.lang.NullPointerException
	at com.couchbase.jdbc.CBDatabaseMetaDataTest.close(CBDatabaseMetaDataTest.java:63)
	at sun.reflect.GeneratedMethodAccessor6.invoke(Unknown Source)
	at sun.reflect.DelegatingMethodAccessorImpl.invoke(DelegatingMethodAccessorImpl.java:43)
	at java.lang.reflect.Method.invoke(Method.java:498)
	at org.junit.runners.model.FrameworkMethod$1.runReflectiveCall(FrameworkMethod.java:50)
	at org.junit.internal.runners.model.ReflectiveCallable.run(ReflectiveCallable.java:12)
	at org.junit.runners.model.FrameworkMethod.invokeExplosively(FrameworkMethod.java:47)
	at org.junit.internal.runners.statements.RunAfters.evaluate(RunAfters.java:33)
	at org.junit.runners.ParentRunner.runLeaf(ParentRunner.java:325)
	at org.junit.runners.BlockJUnit4ClassRunner.runChild(BlockJUnit4ClassRunner.java:78)
	at org.junit.runners.BlockJUnit4ClassRunner.runChild(BlockJUnit4ClassRunner.java:57)
	at org.junit.runners.ParentRunner$3.run(ParentRunner.java:290)
	at org.junit.runners.ParentRunner$1.schedule(ParentRunner.java:71)
	at org.junit.runners.ParentRunner.runChildren(ParentRunner.java:288)
	at org.junit.runners.ParentRunner.access$000(ParentRunner.java:58)
	at org.junit.runners.ParentRunner$2.evaluate(ParentRunner.java:268)
	at org.junit.internal.runners.statements.RunBefores.evaluate(RunBefores.java:26)
	at org.junit.runners.ParentRunner.run(ParentRunner.java:363)
	at org.apache.maven.surefire.junit4.JUnit4Provider.execute(JUnit4Provider.java:252)
	at org.apache.maven.surefire.junit4.JUnit4Provider.executeTestSet(JUnit4Provider.java:141)
	at org.apache.maven.surefire.junit4.JUnit4Provider.invoke(JUnit4Provider.java:112)
	at sun.reflect.NativeMethodAccessorImpl.invoke0(Native Method)
	at sun.reflect.NativeMethodAccessorImpl.invoke(NativeMethodAccessorImpl.java:62)
	at sun.reflect.DelegatingMethodAccessorImpl.invoke(DelegatingMethodAccessorImpl.java:43)
	at java.lang.reflect.Method.invoke(Method.java:498)
	at org.apache.maven.surefire.util.ReflectionUtils.invokeMethodWithArray(ReflectionUtils.java:189)
	at org.apache.maven.surefire.booter.ProviderFactory$ProviderProxy.invoke(ProviderFactory.java:165)
	at org.apache.maven.surefire.booter.ProviderFactory.invokeProvider(ProviderFactory.java:85)
	at org.apache.maven.surefire.booter.ForkedBooter.runSuitesInProcess(ForkedBooter.java:115)
	at org.apache.maven.surefire.booter.ForkedBooter.main(ForkedBooter.java:75)

Running com.couchbase.jdbc.SSLConnectionTest
11:02:58.635 [main] ERROR com.couchbase.jdbc.core.ProtocolImpl - Error opening connection Connect to localhost:18093 [localhost/127.0.0.1, localhost/0:0:0:0:0:0:0:1] failed: Connection refused (Connection refused)
11:02:58.635 [main] ERROR com.couchbase.jdbc.CBConnection - Error opening connection for jdbc:couchbase://localhost:18093 exception Error getting cluster response
Tests run: 1, Failures: 0, Errors: 1, Skipped: 0, Time elapsed: 0.001 sec <<< FAILURE!
openConnection(com.couchbase.jdbc.SSLConnectionTest)  Time elapsed: 0.001 sec  <<< ERROR!
java.sql.SQLException: Error opening connection
	at com.couchbase.jdbc.CBConnection.<init>(CBConnection.java:79)
	at com.couchbase.jdbc.CBDriver.connect(CBDriver.java:94)
	at java.sql.DriverManager.getConnection(DriverManager.java:664)
	at java.sql.DriverManager.getConnection(DriverManager.java:208)
	at com.couchbase.jdbc.SSLConnectionTest.openConnection(SSLConnectionTest.java:42)
	at sun.reflect.NativeMethodAccessorImpl.invoke0(Native Method)
	at sun.reflect.NativeMethodAccessorImpl.invoke(NativeMethodAccessorImpl.java:62)
	at sun.reflect.DelegatingMethodAccessorImpl.invoke(DelegatingMethodAccessorImpl.java:43)
	at java.lang.reflect.Method.invoke(Method.java:498)
	at org.junit.runners.model.FrameworkMethod$1.runReflectiveCall(FrameworkMethod.java:50)
	at org.junit.internal.runners.model.ReflectiveCallable.run(ReflectiveCallable.java:12)
	at org.junit.runners.model.FrameworkMethod.invokeExplosively(FrameworkMethod.java:47)
	at org.junit.internal.runners.statements.InvokeMethod.evaluate(InvokeMethod.java:17)
	at org.junit.runners.ParentRunner.runLeaf(ParentRunner.java:325)
	at org.junit.runners.BlockJUnit4ClassRunner.runChild(BlockJUnit4ClassRunner.java:78)
	at org.junit.runners.BlockJUnit4ClassRunner.runChild(BlockJUnit4ClassRunner.java:57)
	at org.junit.runners.ParentRunner$3.run(ParentRunner.java:290)
	at org.junit.runners.ParentRunner$1.schedule(ParentRunner.java:71)
	at org.junit.runners.ParentRunner.runChildren(ParentRunner.java:288)
	at org.junit.runners.ParentRunner.access$000(ParentRunner.java:58)
	at org.junit.runners.ParentRunner$2.evaluate(ParentRunner.java:268)
	at org.junit.runners.ParentRunner.run(ParentRunner.java:363)
	at org.apache.maven.surefire.junit4.JUnit4Provider.execute(JUnit4Provider.java:252)
	at org.apache.maven.surefire.junit4.JUnit4Provider.executeTestSet(JUnit4Provider.java:141)
	at org.apache.maven.surefire.junit4.JUnit4Provider.invoke(JUnit4Provider.java:112)
	at sun.reflect.NativeMethodAccessorImpl.invoke0(Native Method)
	at sun.reflect.NativeMethodAccessorImpl.invoke(NativeMethodAccessorImpl.java:62)
	at sun.reflect.DelegatingMethodAccessorImpl.invoke(DelegatingMethodAccessorImpl.java:43)
	at java.lang.reflect.Method.invoke(Method.java:498)
	at org.apache.maven.surefire.util.ReflectionUtils.invokeMethodWithArray(ReflectionUtils.java:189)
	at org.apache.maven.surefire.booter.ProviderFactory$ProviderProxy.invoke(ProviderFactory.java:165)
	at org.apache.maven.surefire.booter.ProviderFactory.invokeProvider(ProviderFactory.java:85)
	at org.apache.maven.surefire.booter.ForkedBooter.runSuitesInProcess(ForkedBooter.java:115)
	at org.apache.maven.surefire.booter.ForkedBooter.main(ForkedBooter.java:75)
Caused by: org.apache.http.conn.HttpHostConnectException: Connect to localhost:18093 [localhost/127.0.0.1, localhost/0:0:0:0:0:0:0:1] failed: Connection refused (Connection refused)
	at org.apache.http.impl.conn.DefaultHttpClientConnectionOperator.connect(DefaultHttpClientConnectionOperator.java:159)
	at org.apache.http.impl.conn.PoolingHttpClientConnectionManager.connect(PoolingHttpClientConnectionManager.java:359)
	at org.apache.http.impl.execchain.MainClientExec.establishRoute(MainClientExec.java:381)
	at org.apache.http.impl.execchain.MainClientExec.execute(MainClientExec.java:237)
	at org.apache.http.impl.execchain.ProtocolExec.execute(ProtocolExec.java:185)
	at org.apache.http.impl.execchain.RetryExec.execute(RetryExec.java:89)
	at org.apache.http.impl.execchain.RedirectExec.execute(RedirectExec.java:111)
	at org.apache.http.impl.client.InternalHttpClient.doExecute(InternalHttpClient.java:185)
	at org.apache.http.impl.client.CloseableHttpClient.execute(CloseableHttpClient.java:83)
	at org.apache.http.impl.client.CloseableHttpClient.execute(CloseableHttpClient.java:108)
	at com.couchbase.jdbc.core.ProtocolImpl.pollCluster(ProtocolImpl.java:977)
	at com.couchbase.jdbc.core.ProtocolImpl.connect(ProtocolImpl.java:238)
	at com.couchbase.jdbc.CBConnection.<init>(CBConnection.java:73)
	... 33 more
Caused by: java.net.ConnectException: Connection refused (Connection refused)
	at java.net.PlainSocketImpl.socketConnect(Native Method)
	at java.net.AbstractPlainSocketImpl.doConnect(AbstractPlainSocketImpl.java:350)
	at java.net.AbstractPlainSocketImpl.connectToAddress(AbstractPlainSocketImpl.java:206)
	at java.net.AbstractPlainSocketImpl.connect(AbstractPlainSocketImpl.java:188)
	at java.net.SocksSocketImpl.connect(SocksSocketImpl.java:392)
	at java.net.Socket.connect(Socket.java:589)
	at org.apache.http.conn.ssl.SSLConnectionSocketFactory.connectSocket(SSLConnectionSocketFactory.java:339)
	at org.apache.http.impl.conn.DefaultHttpClientConnectionOperator.connect(DefaultHttpClientConnectionOperator.java:142)
	... 45 more


Results :

Failed tests:   testGetColumnName(com.couchbase.jdbc.ResultSetMetaDataTest)
  testGetColumnType(com.couchbase.jdbc.ResultSetMetaDataTest)
  testIsAutoIncrement(com.couchbase.jdbc.ResultSetMetaDataTest)
  testGetColumnTypeName(com.couchbase.jdbc.ResultSetMetaDataTest)
  testGetColumnCount(com.couchbase.jdbc.ResultSetMetaDataTest)
  testGetColumnLabel(com.couchbase.jdbc.ResultSetMetaDataTest)
  testBadInstance(com.couchbase.jdbc.ClusterTest)

Tests in error: 
  testSetAsciiStream(com.couchbase.jdbc.PreparedStatementTest): Error opening connection
  testSetBinaryStream(com.couchbase.jdbc.PreparedStatementTest): Error opening connection
  nClobNotImplemented(com.couchbase.jdbc.PreparedStatementTest): Error opening connection
  testExecute(com.couchbase.jdbc.PreparedStatementTest): Error opening connection
  testSetTimeStamp(com.couchbase.jdbc.PreparedStatementTest): Error opening connection
  nClob2NotImplemented(com.couchbase.jdbc.PreparedStatementTest): Error opening connection
  testSetUserArray(com.couchbase.jdbc.PreparedStatementTest): Error opening connection
  blob1NotImplemented(com.couchbase.jdbc.PreparedStatementTest): Error opening connection
  testPreparedReturning(com.couchbase.jdbc.PreparedStatementTest): Error opening connection
  clobNotImplemented(com.couchbase.jdbc.PreparedStatementTest): Error opening connection
  testSetSimpleArray(com.couchbase.jdbc.PreparedStatementTest): Error opening connection
  clob2NotImplemented(com.couchbase.jdbc.PreparedStatementTest): Error opening connection
  testN1QLSpecific(com.couchbase.jdbc.PreparedStatementTest): Error opening connection
  testExecuteQuery(com.couchbase.jdbc.PreparedStatementTest): Error opening connection
  testSetInteger(com.couchbase.jdbc.PreparedStatementTest): Error opening connection
  blobNotImplemented(com.couchbase.jdbc.PreparedStatementTest): Error opening connection
  blob2NotImplemented(com.couchbase.jdbc.PreparedStatementTest): Error opening connection
  setObject(com.couchbase.jdbc.PreparedStatementTest): Error opening connection
  createStatement(com.couchbase.jdbc.PreparedStatementTest): Error opening connection
  testSetAsciiStream1(com.couchbase.jdbc.PreparedStatementTest): Error opening connection
  testSetCharacterStream(com.couchbase.jdbc.PreparedStatementTest): Error opening connection
  refNotImplemented(com.couchbase.jdbc.PreparedStatementTest): Error opening connection
  testSetUnicodeStream(com.couchbase.jdbc.PreparedStatementTest): Error opening connection
  rowIdNotImplemented(com.couchbase.jdbc.PreparedStatementTest): Error opening connection
  getPreparedMetaData(com.couchbase.jdbc.PreparedStatementTest): Error opening connection
  schemaLessTest(com.couchbase.jdbc.PreparedStatementTest): Error opening connection
  emptyResult(com.couchbase.jdbc.PreparedStatementTest): Error opening connection
  getResultMetaData(com.couchbase.jdbc.PreparedStatementTest): Error opening connection
  nClob1NotImplemented(com.couchbase.jdbc.PreparedStatementTest): Error opening connection
  testSetCharacterStream1(com.couchbase.jdbc.PreparedStatementTest): Error opening connection
  testSetByte(com.couchbase.jdbc.PreparedStatementTest): Error opening connection
  testSetDate(com.couchbase.jdbc.PreparedStatementTest): Error opening connection
  testSetLong(com.couchbase.jdbc.PreparedStatementTest): Error opening connection
  testSetTime(com.couchbase.jdbc.PreparedStatementTest): Error opening connection
  testSetBigDecimal(com.couchbase.jdbc.PreparedStatementTest): Error opening connection
  testSetBytes(com.couchbase.jdbc.PreparedStatementTest): Error opening connection
  clob1NotImplemented(com.couchbase.jdbc.PreparedStatementTest): Error opening connection
  testSetShort(com.couchbase.jdbc.PreparedStatementTest): Error opening connection
  testValues(com.couchbase.jdbc.Test16017): Error opening connection
  testUpdateAsciiStream2NotImplemented(com.couchbase.jdbc.ResultSetTest): Error opening connection
  testUpdateObject4NotImplemented(com.couchbase.jdbc.ResultSetTest): Error opening connection
  testUpdateNCLob4NotImplemented(com.couchbase.jdbc.ResultSetTest): Error opening connection
  testUpdateBinaryStream5NotImplemented(com.couchbase.jdbc.ResultSetTest): Error opening connection
  testUpdateBytes1NotImplemented(com.couchbase.jdbc.ResultSetTest): Error opening connection
  testUpdateBlob4NotImplemented(com.couchbase.jdbc.ResultSetTest): Error opening connection
  testUpdateAsciiStream5NotImplemented(com.couchbase.jdbc.ResultSetTest): Error opening connection
  testUpdateObjectNotImplemented(com.couchbase.jdbc.ResultSetTest): Error opening connection
  testUpdateBinaryStreamNotImplemented(com.couchbase.jdbc.ResultSetTest): Error opening connection
  testUpdateTimeNotImplemented(com.couchbase.jdbc.ResultSetTest): Error opening connection
  testRelativeNotImplemented(com.couchbase.jdbc.ResultSetTest): Error opening connection
  testUpdateCharacterStream3NotImplemented(com.couchbase.jdbc.ResultSetTest): Error opening connection
  testUpdateArrayNotImplemented(com.couchbase.jdbc.ResultSetTest): Error opening connection
  testUpdateNCharacterStreamNotImplemented(com.couchbase.jdbc.ResultSetTest): Error opening connection
  testUpdateInt1NotImplemented(com.couchbase.jdbc.ResultSetTest): Error opening connection
  testUpdateNString1NotImplemented(com.couchbase.jdbc.ResultSetTest): Error opening connection
  testUpdateTime1NotImplemented(com.couchbase.jdbc.ResultSetTest): Error opening connection
  testUpdateByte1NotImplemented(com.couchbase.jdbc.ResultSetTest): Error opening connection
  testUpdateBigDecimalNotImplemented(com.couchbase.jdbc.ResultSetTest): Error opening connection
  testUpdateCLob1NotImplemented(com.couchbase.jdbc.ResultSetTest): Error opening connection
  testUpdateNCharacterStream1NotImplemented(com.couchbase.jdbc.ResultSetTest): Error opening connection
  testUpdateCLob4NotImplemented(com.couchbase.jdbc.ResultSetTest): Error opening connection
  testUpdateNCharacterStream4NotImplemented(com.couchbase.jdbc.ResultSetTest): Error opening connection
  testBadColumnName(com.couchbase.jdbc.ResultSetTest): Error opening connection
  testIsAfterLastNotImplemented(com.couchbase.jdbc.ResultSetTest): Error opening connection
  testUpdateObject2NotImplemented(com.couchbase.jdbc.ResultSetTest): Error opening connection
  testUpdateNCLob2NotImplemented(com.couchbase.jdbc.ResultSetTest): Error opening connection
  testUpdateBinaryStream3NotImplemented(com.couchbase.jdbc.ResultSetTest): Error opening connection
  testUpdateDouble1NotImplemented(com.couchbase.jdbc.ResultSetTest): Error opening connection
  testUpdateBlob2NotImplemented(com.couchbase.jdbc.ResultSetTest): Error opening connection
  testUpdateArray2NotImplemented(com.couchbase.jdbc.ResultSetTest): Error opening connection
  testUpdateBytesNotImplemented(com.couchbase.jdbc.ResultSetTest): Error opening connection
  testUpdateAsciiStream3NotImplemented(com.couchbase.jdbc.ResultSetTest): Error opening connection
  testUpdateDate1NotImplemented(com.couchbase.jdbc.ResultSetTest): Error opening connection
  testWasMissing(com.couchbase.jdbc.ResultSetTest): Error opening connection
  testUpdateNCLob5NotImplemented(com.couchbase.jdbc.ResultSetTest): Error opening connection
  testUpdateBinaryStream6NotImplemented(com.couchbase.jdbc.ResultSetTest): Error opening connection
  testUpdateBlob5NotImplemented(com.couchbase.jdbc.ResultSetTest): Error opening connection
  testGetDate(com.couchbase.jdbc.ResultSetTest): Error opening connection
  testUpdateNull1NotImplemented(com.couchbase.jdbc.ResultSetTest): Error opening connection
  testUpdateTimestamp1NotImplemented(com.couchbase.jdbc.ResultSetTest): Error opening connection
  testUpdateLong1NotImplemented(com.couchbase.jdbc.ResultSetTest): Error opening connection
  testUpdateCharacterStream1NotImplemented(com.couchbase.jdbc.ResultSetTest): Error opening connection
  testUpdateLongNotImplemented(com.couchbase.jdbc.ResultSetTest): Error opening connection
  testUpdateDateNotImplemented(com.couchbase.jdbc.ResultSetTest): Error opening connection
  testUpdateAsciiStreamNotImplemented(com.couchbase.jdbc.ResultSetTest): Error opening connection
  testUpdateCharacterStream4NotImplemented(com.couchbase.jdbc.ResultSetTest): Error opening connection
  testAbsoluteNotImplemented(com.couchbase.jdbc.ResultSetTest): Error opening connection
  testUpdateByteNotImplemented(com.couchbase.jdbc.ResultSetTest): Error opening connection
  testBeforeFirstNotImplemented(com.couchbase.jdbc.ResultSetTest): Error opening connection
  testUpdateRowIdNotImplemented(com.couchbase.jdbc.ResultSetTest): Error opening connection
  testUpdateCLob2NotImplemented(com.couchbase.jdbc.ResultSetTest): Error opening connection
  testUpdateNCharacterStream2NotImplemented(com.couchbase.jdbc.ResultSetTest): Error opening connection
  testUpdateTimestampNotImplemented(com.couchbase.jdbc.ResultSetTest): Error opening connection
  testUpdateRowNotImplemented(com.couchbase.jdbc.ResultSetTest): Error opening connection
  testUpdateCLobNotImplemented(com.couchbase.jdbc.ResultSetTest): Error opening connection
  testUpdateBinaryStream1NotImplemented(com.couchbase.jdbc.ResultSetTest): Error opening connection
  testUpdateNCharacterStream5NotImplemented(com.couchbase.jdbc.ResultSetTest): Error opening connection
  testUpdateAsciiStream1NotImplemented(com.couchbase.jdbc.ResultSetTest): Error opening connection
  testUpdateObject3NotImplemented(com.couchbase.jdbc.ResultSetTest): Error opening connection
  testUpdateNCLob3NotImplemented(com.couchbase.jdbc.ResultSetTest): Error opening connection
  testUpdateBinaryStream4NotImplemented(com.couchbase.jdbc.ResultSetTest): Error opening connection
  testUpdateBlob3NotImplemented(com.couchbase.jdbc.ResultSetTest): Error opening connection
  testUpdateAsciiStream4NotImplemented(com.couchbase.jdbc.ResultSetTest): Error opening connection
  testRefreshRowNotImplemented(com.couchbase.jdbc.ResultSetTest): Error opening connection
  testUpdateDoubleNotImplemented(com.couchbase.jdbc.ResultSetTest): Error opening connection
  testUpdateBinaryStream7NotImplemented(com.couchbase.jdbc.ResultSetTest): Error opening connection
  testUpdateRowId1NotImplemented(com.couchbase.jdbc.ResultSetTest): Error opening connection
  testGetTimestamp(com.couchbase.jdbc.ResultSetTest): Error opening connection
  testUpdateBooleanNotImplemented(com.couchbase.jdbc.ResultSetTest): Error opening connection
  testUpdateNCLobNotImplemented(com.couchbase.jdbc.ResultSetTest): Error opening connection
  testUpdateCharacterStream2NotImplemented(com.couchbase.jdbc.ResultSetTest): Error opening connection
  testUpdateCharacterStreamNotImplemented(com.couchbase.jdbc.ResultSetTest): Error opening connection
  testIsBeforeFirstNotImplemented(com.couchbase.jdbc.ResultSetTest): Error opening connection
  testUpdateCharacterStream5NotImplemented(com.couchbase.jdbc.ResultSetTest): Error opening connection
  testUpdateRefNotImplemented(com.couchbase.jdbc.ResultSetTest): Error opening connection
  testUpdateBigDecimal1NotImplemented(com.couchbase.jdbc.ResultSetTest): Error opening connection
  testIsNull(com.couchbase.jdbc.ResultSetTest): Error opening connection
  testUpdateFloatNotImplemented(com.couchbase.jdbc.ResultSetTest): Error opening connection
  testUpdateIntNotImplemented(com.couchbase.jdbc.ResultSetTest): Error opening connection
  testGetString(com.couchbase.jdbc.ResultSetTest): Error opening connection
  testUpdateNullNotImplemented(com.couchbase.jdbc.ResultSetTest): Error opening connection
  testUpdateBoolean1NotImplemented(com.couchbase.jdbc.ResultSetTest): Error opening connection
  testUpdateRef1NotImplemented(com.couchbase.jdbc.ResultSetTest): Error opening connection
  testUpdateNStringNotImplemented(com.couchbase.jdbc.ResultSetTest): Error opening connection
  testUpdateCLob3NotImplemented(com.couchbase.jdbc.ResultSetTest): Error opening connection
  testUpdateBlobNotImplemented(com.couchbase.jdbc.ResultSetTest): Error opening connection
  testUpdateNCharacterStream3NotImplemented(com.couchbase.jdbc.ResultSetTest): Error opening connection
  testUpdateObject1NotImplemented(com.couchbase.jdbc.ResultSetTest): Error opening connection
  testUpdateNCLob1NotImplemented(com.couchbase.jdbc.ResultSetTest): Error opening connection
  testUpdateBinaryStream2NotImplemented(com.couchbase.jdbc.ResultSetTest): Error opening connection
  testUpdateBlob1NotImplemented(com.couchbase.jdbc.ResultSetTest): Error opening connection
  testUpdateFloat1NotImplemented(com.couchbase.jdbc.ResultSetTest): Error opening connection
  testConnect(com.couchbase.jdbc.DriverTest): Error opening connection
  testReplaceProcessing(com.couchbase.jdbc.SqlParserTest): Error opening connection
  testStringFunctions(com.couchbase.jdbc.SqlParserTest): Error opening connection
  testDateFunctions(com.couchbase.jdbc.SqlParserTest): Error opening connection
  testNumericFunctions(com.couchbase.jdbc.SqlParserTest): Error opening connection
  simpleInsert(com.couchbase.jdbc.StatementTest): Error opening connection
  simpleSelect(com.couchbase.jdbc.StatementTest): Error opening connection
  getAllTypes(com.couchbase.jdbc.StatementTest): Error opening connection
  createStatement(com.couchbase.jdbc.StatementTest): Error opening connection
  emptyResult(com.couchbase.jdbc.StatementTest): Error opening connection
  testGetColumnName(com.couchbase.jdbc.ResultSetMetaDataTest): Error opening connection
  testGetColumnType(com.couchbase.jdbc.ResultSetMetaDataTest): Error opening connection
  testIsAutoIncrement(com.couchbase.jdbc.ResultSetMetaDataTest): Error opening connection
  testGetColumnTypeName(com.couchbase.jdbc.ResultSetMetaDataTest): Error opening connection
  testGetColumnCount(com.couchbase.jdbc.ResultSetMetaDataTest): Error opening connection
  testGetColumnLabel(com.couchbase.jdbc.ResultSetMetaDataTest): Error opening connection
  testSetBoolean(com.couchbase.jdbc.TestSQLJson): Error opening connection
  testSetTimestamp(com.couchbase.jdbc.TestSQLJson): Error opening connection
  testGetShort(com.couchbase.jdbc.TestSQLJson): Error opening connection
  getSqlJson(com.couchbase.jdbc.TestSQLJson): Error opening connection
  testGetJDBCType(com.couchbase.jdbc.TestSQLJson): Error opening connection
  testGetByte(com.couchbase.jdbc.TestSQLJson): Error opening connection
  testGetDate(com.couchbase.jdbc.TestSQLJson): Error opening connection
  testGetTime(com.couchbase.jdbc.TestSQLJson): Error opening connection
  testGetBoolean(com.couchbase.jdbc.TestSQLJson): Error opening connection
  setSqlJson(com.couchbase.jdbc.TestSQLJson): Error opening connection
  testGetTimestamp(com.couchbase.jdbc.TestSQLJson): Error opening connection
  testSetObject(com.couchbase.jdbc.TestSQLJson): Error opening connection
  testSetString(com.couchbase.jdbc.TestSQLJson): Error opening connection
  testGetObject(com.couchbase.jdbc.TestSQLJson): Error opening connection
  testGetInt(com.couchbase.jdbc.TestSQLJson): Error opening connection
  testGetMap(com.couchbase.jdbc.TestSQLJson): Error opening connection
  testGetString(com.couchbase.jdbc.TestSQLJson): Error opening connection
  testSetByte(com.couchbase.jdbc.TestSQLJson): Error opening connection
  testSetDate(com.couchbase.jdbc.TestSQLJson): Error opening connection
  testSetTime(com.couchbase.jdbc.TestSQLJson): Error opening connection
  testSetInt(com.couchbase.jdbc.TestSQLJson): Error opening connection
  testSetMap(com.couchbase.jdbc.TestSQLJson): Error opening connection
  testSetArray(com.couchbase.jdbc.TestSQLJson): Error opening connection
  testSetShort(com.couchbase.jdbc.TestSQLJson): Error opening connection
  testConnectionIsWrapperForPrivate(com.couchbase.jdbc.WrapperTest): Error opening connection
  testConnectionUnwrapPrivate(com.couchbase.jdbc.WrapperTest): Error opening connection
  testConnectionIsWrapperForConnection(com.couchbase.jdbc.WrapperTest): Error opening connection
  testStatementIsWrapperForStatement(com.couchbase.jdbc.WrapperTest): Error opening connection
  testConnectionUnwrapCBConnection(com.couchbase.jdbc.WrapperTest): Error opening connection
  testConnectionUnwrapConnection(com.couchbase.jdbc.WrapperTest): Error opening connection
  testStatementIsWrapperForPrivate(com.couchbase.jdbc.WrapperTest): Error opening connection
  testConnectionIsWrapperForCBConnection(com.couchbase.jdbc.WrapperTest): Error opening connection
  testStatementIsWrapperForCBStatement(com.couchbase.jdbc.WrapperTest): Error opening connection
  testStatementUnwrapStatement(com.couchbase.jdbc.WrapperTest): Error opening connection
  testStatementUnwrapCBStatement(com.couchbase.jdbc.WrapperTest): Error opening connection
  testStatementUnwrapPrivate(com.couchbase.jdbc.WrapperTest): Error opening connection
  testBadInstance(com.couchbase.jdbc.ClusterTest): Error opening connection
  testPrepareCall(com.couchbase.jdbc.ConnectionTest): Error opening connection
  testCreateSQLXML(com.couchbase.jdbc.ConnectionTest): Error opening connection
  testCreateStruct(com.couchbase.jdbc.ConnectionTest): Error opening connection
  testGetPassword(com.couchbase.jdbc.ConnectionTest): Error opening connection
  testSetSavepoint(com.couchbase.jdbc.ConnectionTest): Error opening connection
  testSetCatalog(com.couchbase.jdbc.ConnectionTest): Error opening connection
  testCreateStructNotImplemented(com.couchbase.jdbc.ConnectionTest): Error opening connection
  testAbort(com.couchbase.jdbc.ConnectionTest): Error opening connection
  testClose(com.couchbase.jdbc.ConnectionTest): Error opening connection
  testCreateArray(com.couchbase.jdbc.ConnectionTest): Error opening connection
  testCreateNClob(com.couchbase.jdbc.ConnectionTest): Error opening connection
  testReleaseSavepoint(com.couchbase.jdbc.ConnectionTest): Error opening connection
  testPrepareCall1(com.couchbase.jdbc.ConnectionTest): Error opening connection
  testPrepareCall2(com.couchbase.jdbc.ConnectionTest): Error opening connection
  testGetHoldability(com.couchbase.jdbc.ConnectionTest): Error opening connection
  testGetTypeMap(com.couchbase.jdbc.ConnectionTest): Error opening connection
  testNativeSQL(com.couchbase.jdbc.ConnectionTest): Error opening connection
  testSetTransactionIsolation(com.couchbase.jdbc.ConnectionTest): Error opening connection
  testSetSavepoint1(com.couchbase.jdbc.ConnectionTest): Error opening connection
  testIsClosed(com.couchbase.jdbc.ConnectionTest): Error opening connection
  testRollback(com.couchbase.jdbc.ConnectionTest): Error opening connection
  testSetReadOnly(com.couchbase.jdbc.ConnectionTest): Error opening connection
  testCreateStatement1(com.couchbase.jdbc.ConnectionTest): Error opening connection
  testCreateStatement2(com.couchbase.jdbc.ConnectionTest): Error opening connection
  testCreateStatement(com.couchbase.jdbc.ConnectionTest): Error opening connection
  testCreateBlob(com.couchbase.jdbc.ConnectionTest): Error opening connection
  testCreateClob(com.couchbase.jdbc.ConnectionTest): Error opening connection
  testGetAutoCommit(com.couchbase.jdbc.ConnectionTest): Error opening connection
  testGetCatalog(com.couchbase.jdbc.ConnectionTest): Error opening connection
  testGetMetaData(com.couchbase.jdbc.ConnectionTest): Error opening connection
  testGetUserName(com.couchbase.jdbc.ConnectionTest): Error opening connection
  testRollback1(com.couchbase.jdbc.ConnectionTest): Error opening connection
  testCommit(com.couchbase.jdbc.ConnectionTest): Error opening connection
  testSetTypeMap(com.couchbase.jdbc.ConnectionTest): Error opening connection
  testGetSchema(com.couchbase.jdbc.ConnectionTest): Error opening connection
  testSetAutoCommit(com.couchbase.jdbc.ConnectionTest): Error opening connection
  testClearWarnings(com.couchbase.jdbc.ConnectionTest): Error opening connection
  testIsValid(com.couchbase.jdbc.ConnectionTest): Error opening connection
  testSetHoldability(com.couchbase.jdbc.ConnectionTest): Error opening connection
  testPrepareStatement1(com.couchbase.jdbc.ConnectionTest): Error opening connection
  testPrepareStatement2(com.couchbase.jdbc.ConnectionTest): Error opening connection
  testPrepareStatement3(com.couchbase.jdbc.ConnectionTest): Error opening connection
  testPrepareStatement4(com.couchbase.jdbc.ConnectionTest): Error opening connection
  testPrepareStatement5(com.couchbase.jdbc.ConnectionTest): Error opening connection
  testGetWarnings(com.couchbase.jdbc.ConnectionTest): Error opening connection
  testIsReadOnly(com.couchbase.jdbc.ConnectionTest): Error opening connection
  testGetTransactionIsolation(com.couchbase.jdbc.ConnectionTest): Error opening connection
  testPrepareStatement(com.couchbase.jdbc.ConnectionTest): Error opening connection
  testSupportsSchemasInPrivilegeDefinitions(com.couchbase.jdbc.CBDatabaseMetaDataTest): Error opening connection
  testSupportsSchemasInPrivilegeDefinitions(com.couchbase.jdbc.CBDatabaseMetaDataTest)
  testGetMaxColumnsInOrderBy(com.couchbase.jdbc.CBDatabaseMetaDataTest): Error opening connection
  testGetMaxColumnsInOrderBy(com.couchbase.jdbc.CBDatabaseMetaDataTest)
  testGetDriverName(com.couchbase.jdbc.CBDatabaseMetaDataTest): Error opening connection
  testGetDriverName(com.couchbase.jdbc.CBDatabaseMetaDataTest)
  testSupportsStoredProcedures(com.couchbase.jdbc.CBDatabaseMetaDataTest): Error opening connection
  testSupportsStoredProcedures(com.couchbase.jdbc.CBDatabaseMetaDataTest)
  testGetSchemas(com.couchbase.jdbc.CBDatabaseMetaDataTest): Error opening connection
  testGetSchemas(com.couchbase.jdbc.CBDatabaseMetaDataTest)
  testSupportsStoredFunctionsUsingCallSyntax(com.couchbase.jdbc.CBDatabaseMetaDataTest): Error opening connection
  testSupportsStoredFunctionsUsingCallSyntax(com.couchbase.jdbc.CBDatabaseMetaDataTest)
  testSupportsNamedParameters(com.couchbase.jdbc.CBDatabaseMetaDataTest): Error opening connection
  testSupportsNamedParameters(com.couchbase.jdbc.CBDatabaseMetaDataTest)
  testSupportsANSI92FullSQL(com.couchbase.jdbc.CBDatabaseMetaDataTest): Error opening connection
  testSupportsANSI92FullSQL(com.couchbase.jdbc.CBDatabaseMetaDataTest)
  testGetJDBCMinorVersion(com.couchbase.jdbc.CBDatabaseMetaDataTest): Error opening connection
  testGetJDBCMinorVersion(com.couchbase.jdbc.CBDatabaseMetaDataTest)
  testDataDefinitionIgnoredInTransactions(com.couchbase.jdbc.CBDatabaseMetaDataTest): Error opening connection
  testDataDefinitionIgnoredInTransactions(com.couchbase.jdbc.CBDatabaseMetaDataTest)
  testSupportsDataManipulationTransactionsOnly(com.couchbase.jdbc.CBDatabaseMetaDataTest): Error opening connection
  testSupportsDataManipulationTransactionsOnly(com.couchbase.jdbc.CBDatabaseMetaDataTest)
  testSupportsResultSetType(com.couchbase.jdbc.CBDatabaseMetaDataTest): Error opening connection
  testSupportsResultSetType(com.couchbase.jdbc.CBDatabaseMetaDataTest)
  testGetDatabaseMajorVersion(com.couchbase.jdbc.CBDatabaseMetaDataTest): Error opening connection
  testGetDatabaseMajorVersion(com.couchbase.jdbc.CBDatabaseMetaDataTest)
  testGetMaxColumnsInSelect(com.couchbase.jdbc.CBDatabaseMetaDataTest): Error opening connection
  testGetMaxColumnsInSelect(com.couchbase.jdbc.CBDatabaseMetaDataTest)
  testGetBestRowIdentifier(com.couchbase.jdbc.CBDatabaseMetaDataTest): Error opening connection
  testGetBestRowIdentifier(com.couchbase.jdbc.CBDatabaseMetaDataTest)
  testGetProcedureColumns(com.couchbase.jdbc.CBDatabaseMetaDataTest): Error opening connection
  testGetProcedureColumns(com.couchbase.jdbc.CBDatabaseMetaDataTest)
  testNullsAreSortedAtStart(com.couchbase.jdbc.CBDatabaseMetaDataTest): Error opening connection
  testNullsAreSortedAtStart(com.couchbase.jdbc.CBDatabaseMetaDataTest)
  testNullsAreSortedHigh(com.couchbase.jdbc.CBDatabaseMetaDataTest): Error opening connection
  testNullsAreSortedHigh(com.couchbase.jdbc.CBDatabaseMetaDataTest)
  testGeneratedKeyAlwaysReturned(com.couchbase.jdbc.CBDatabaseMetaDataTest): Error opening connection
  testGeneratedKeyAlwaysReturned(com.couchbase.jdbc.CBDatabaseMetaDataTest)
  testSupportsOpenCursorsAcrossCommit(com.couchbase.jdbc.CBDatabaseMetaDataTest): Error opening connection
  testSupportsOpenCursorsAcrossCommit(com.couchbase.jdbc.CBDatabaseMetaDataTest)
  testSupportsCatalogsInIndexDefinitions(com.couchbase.jdbc.CBDatabaseMetaDataTest): Error opening connection
  testSupportsCatalogsInIndexDefinitions(com.couchbase.jdbc.CBDatabaseMetaDataTest)
  testSupportsGroupByUnrelated(com.couchbase.jdbc.CBDatabaseMetaDataTest): Error opening connection
  testSupportsGroupByUnrelated(com.couchbase.jdbc.CBDatabaseMetaDataTest)
  testGetMaxUserNameLength(com.couchbase.jdbc.CBDatabaseMetaDataTest): Error opening connection
  testGetMaxUserNameLength(com.couchbase.jdbc.CBDatabaseMetaDataTest)
  testSupportsMultipleOpenResults(com.couchbase.jdbc.CBDatabaseMetaDataTest): Error opening connection
  testSupportsMultipleOpenResults(com.couchbase.jdbc.CBDatabaseMetaDataTest)
  testGetExtraNameCharacters(com.couchbase.jdbc.CBDatabaseMetaDataTest): Error opening connection
  testGetExtraNameCharacters(com.couchbase.jdbc.CBDatabaseMetaDataTest)
  testSupportsCatalogsInProcedureCalls(com.couchbase.jdbc.CBDatabaseMetaDataTest): Error opening connection
  testSupportsCatalogsInProcedureCalls(com.couchbase.jdbc.CBDatabaseMetaDataTest)
  testGetVersionColumns(com.couchbase.jdbc.CBDatabaseMetaDataTest): Error opening connection
  testGetVersionColumns(com.couchbase.jdbc.CBDatabaseMetaDataTest)
  testSupportsOpenStatementsAcrossRollback(com.couchbase.jdbc.CBDatabaseMetaDataTest): Error opening connection
  testSupportsOpenStatementsAcrossRollback(com.couchbase.jdbc.CBDatabaseMetaDataTest)
  testNullsAreSortedLow(com.couchbase.jdbc.CBDatabaseMetaDataTest): Error opening connection
  testNullsAreSortedLow(com.couchbase.jdbc.CBDatabaseMetaDataTest)
  testOwnInsertsAreVisible(com.couchbase.jdbc.CBDatabaseMetaDataTest): Error opening connection
  testOwnInsertsAreVisible(com.couchbase.jdbc.CBDatabaseMetaDataTest)
  testSupportsResultSetHoldability(com.couchbase.jdbc.CBDatabaseMetaDataTest): Error opening connection
  testSupportsResultSetHoldability(com.couchbase.jdbc.CBDatabaseMetaDataTest)
  testSupportsMinimumSQLGrammar(com.couchbase.jdbc.CBDatabaseMetaDataTest): Error opening connection
  testSupportsMinimumSQLGrammar(com.couchbase.jdbc.CBDatabaseMetaDataTest)
  testSupportsMultipleTransactions(com.couchbase.jdbc.CBDatabaseMetaDataTest): Error opening connection
  testSupportsMultipleTransactions(com.couchbase.jdbc.CBDatabaseMetaDataTest)
  testSupportsIntegrityEnhancementFacility(com.couchbase.jdbc.CBDatabaseMetaDataTest): Error opening connection
  testSupportsIntegrityEnhancementFacility(com.couchbase.jdbc.CBDatabaseMetaDataTest)
  testGetMaxTableNameLength(com.couchbase.jdbc.CBDatabaseMetaDataTest): Error opening connection
  testGetMaxTableNameLength(com.couchbase.jdbc.CBDatabaseMetaDataTest)
  testSupportsCorrelatedSubqueries(com.couchbase.jdbc.CBDatabaseMetaDataTest): Error opening connection
  testSupportsCorrelatedSubqueries(com.couchbase.jdbc.CBDatabaseMetaDataTest)
  testSupportsGetGeneratedKeys(com.couchbase.jdbc.CBDatabaseMetaDataTest): Error opening connection
  testSupportsGetGeneratedKeys(com.couchbase.jdbc.CBDatabaseMetaDataTest)
  testSupportsCatalogsInPrivilegeDefinitions(com.couchbase.jdbc.CBDatabaseMetaDataTest): Error opening connection
  testSupportsCatalogsInPrivilegeDefinitions(com.couchbase.jdbc.CBDatabaseMetaDataTest)
  testNullPlusNonNullIsNull(com.couchbase.jdbc.CBDatabaseMetaDataTest): Error opening connection
  testNullPlusNonNullIsNull(com.couchbase.jdbc.CBDatabaseMetaDataTest)
  testAllTablesAreSelectable(com.couchbase.jdbc.CBDatabaseMetaDataTest): Error opening connection
  testAllTablesAreSelectable(com.couchbase.jdbc.CBDatabaseMetaDataTest)
  testSupportsResultSetConcurrency(com.couchbase.jdbc.CBDatabaseMetaDataTest): Error opening connection
  testSupportsResultSetConcurrency(com.couchbase.jdbc.CBDatabaseMetaDataTest)
  testSupportsMixedCaseQuotedIdentifiers(com.couchbase.jdbc.CBDatabaseMetaDataTest): Error opening connection
  testSupportsMixedCaseQuotedIdentifiers(com.couchbase.jdbc.CBDatabaseMetaDataTest)
  testUsesLocalFiles(com.couchbase.jdbc.CBDatabaseMetaDataTest): Error opening connection
  testUsesLocalFiles(com.couchbase.jdbc.CBDatabaseMetaDataTest)
  testSupportsOpenStatementsAcrossCommit(com.couchbase.jdbc.CBDatabaseMetaDataTest): Error opening connection
  testSupportsOpenStatementsAcrossCommit(com.couchbase.jdbc.CBDatabaseMetaDataTest)
  testSupportsSchemasInProcedureCalls(com.couchbase.jdbc.CBDatabaseMetaDataTest): Error opening connection
  testSupportsSchemasInProcedureCalls(com.couchbase.jdbc.CBDatabaseMetaDataTest)
  testSupportsTransactions(com.couchbase.jdbc.CBDatabaseMetaDataTest): Error opening connection
  testSupportsTransactions(com.couchbase.jdbc.CBDatabaseMetaDataTest)
  testGetMaxCharLiteralLength(com.couchbase.jdbc.CBDatabaseMetaDataTest): Error opening connection
  testGetMaxCharLiteralLength(com.couchbase.jdbc.CBDatabaseMetaDataTest)
  testSupportsSchemasInIndexDefinitions(com.couchbase.jdbc.CBDatabaseMetaDataTest): Error opening connection
  testSupportsSchemasInIndexDefinitions(com.couchbase.jdbc.CBDatabaseMetaDataTest)
  testNullsAreSortedAtEnd(com.couchbase.jdbc.CBDatabaseMetaDataTest): Error opening connection
  testNullsAreSortedAtEnd(com.couchbase.jdbc.CBDatabaseMetaDataTest)
  testSupportsPositionedDelete(com.couchbase.jdbc.CBDatabaseMetaDataTest): Error opening connection
  testSupportsPositionedDelete(com.couchbase.jdbc.CBDatabaseMetaDataTest)
  testGetDatabaseProductVersion(com.couchbase.jdbc.CBDatabaseMetaDataTest): Error opening connection
  testGetDatabaseProductVersion(com.couchbase.jdbc.CBDatabaseMetaDataTest)
  testOwnUpdatesAreVisible(com.couchbase.jdbc.CBDatabaseMetaDataTest): Error opening connection
  testOwnUpdatesAreVisible(com.couchbase.jdbc.CBDatabaseMetaDataTest)
  testGetMaxStatementLength(com.couchbase.jdbc.CBDatabaseMetaDataTest): Error opening connection
  testGetMaxStatementLength(com.couchbase.jdbc.CBDatabaseMetaDataTest)
  testUsesLocalFilePerTable(com.couchbase.jdbc.CBDatabaseMetaDataTest): Error opening connection
  testUsesLocalFilePerTable(com.couchbase.jdbc.CBDatabaseMetaDataTest)
  testGetMaxColumnsInGroupBy(com.couchbase.jdbc.CBDatabaseMetaDataTest): Error opening connection
  testGetMaxColumnsInGroupBy(com.couchbase.jdbc.CBDatabaseMetaDataTest)
  testStoresLowerCaseIdentifiers(com.couchbase.jdbc.CBDatabaseMetaDataTest): Error opening connection
  testStoresLowerCaseIdentifiers(com.couchbase.jdbc.CBDatabaseMetaDataTest)
  testGetClientInfoProperties(com.couchbase.jdbc.CBDatabaseMetaDataTest): Error opening connection
  testGetClientInfoProperties(com.couchbase.jdbc.CBDatabaseMetaDataTest)
  testGetMaxSchemaNameLength(com.couchbase.jdbc.CBDatabaseMetaDataTest): Error opening connection
  testGetMaxSchemaNameLength(com.couchbase.jdbc.CBDatabaseMetaDataTest)
  testSupportsTransactionIsolationLevel(com.couchbase.jdbc.CBDatabaseMetaDataTest): Error opening connection
  testSupportsTransactionIsolationLevel(com.couchbase.jdbc.CBDatabaseMetaDataTest)
  testGetUDTs(com.couchbase.jdbc.CBDatabaseMetaDataTest): Error opening connection
  testGetUDTs(com.couchbase.jdbc.CBDatabaseMetaDataTest)
  testSupportsMixedCaseIdentifiers(com.couchbase.jdbc.CBDatabaseMetaDataTest): Error opening connection
  testSupportsMixedCaseIdentifiers(com.couchbase.jdbc.CBDatabaseMetaDataTest)
  testSupportsDifferentTableCorrelationNames(com.couchbase.jdbc.CBDatabaseMetaDataTest): Error opening connection
  testSupportsDifferentTableCorrelationNames(com.couchbase.jdbc.CBDatabaseMetaDataTest)
  testGetMaxCursorNameLength(com.couchbase.jdbc.CBDatabaseMetaDataTest): Error opening connection
  testGetMaxCursorNameLength(com.couchbase.jdbc.CBDatabaseMetaDataTest)
  testSupportsGroupBy(com.couchbase.jdbc.CBDatabaseMetaDataTest): Error opening connection
  testSupportsGroupBy(com.couchbase.jdbc.CBDatabaseMetaDataTest)
  testGetDefaultTransactionIsolation(com.couchbase.jdbc.CBDatabaseMetaDataTest): Error opening connection
  testGetDefaultTransactionIsolation(com.couchbase.jdbc.CBDatabaseMetaDataTest)
  testGetNumericFunctions(com.couchbase.jdbc.CBDatabaseMetaDataTest): Error opening connection
  testGetNumericFunctions(com.couchbase.jdbc.CBDatabaseMetaDataTest)
  testSupportsANSI92EntryLevelSQL(com.couchbase.jdbc.CBDatabaseMetaDataTest): Error opening connection
  testSupportsANSI92EntryLevelSQL(com.couchbase.jdbc.CBDatabaseMetaDataTest)
  testSupportsAlterTableWithDropColumn(com.couchbase.jdbc.CBDatabaseMetaDataTest): Error opening connection
  testSupportsAlterTableWithDropColumn(com.couchbase.jdbc.CBDatabaseMetaDataTest)
  testGetSearchStringEscape(com.couchbase.jdbc.CBDatabaseMetaDataTest): Error opening connection
  testGetSearchStringEscape(com.couchbase.jdbc.CBDatabaseMetaDataTest)
  testSupportsFullOuterJoins(com.couchbase.jdbc.CBDatabaseMetaDataTest): Error opening connection
  testSupportsFullOuterJoins(com.couchbase.jdbc.CBDatabaseMetaDataTest)
  testSupportsCatalogsInTableDefinitions(com.couchbase.jdbc.CBDatabaseMetaDataTest): Error opening connection
  testSupportsCatalogsInTableDefinitions(com.couchbase.jdbc.CBDatabaseMetaDataTest)
  testSupportsOpenCursorsAcrossRollback(com.couchbase.jdbc.CBDatabaseMetaDataTest): Error opening connection
  testSupportsOpenCursorsAcrossRollback(com.couchbase.jdbc.CBDatabaseMetaDataTest)
  testSupportsPositionedUpdate(com.couchbase.jdbc.CBDatabaseMetaDataTest): Error opening connection
  testSupportsPositionedUpdate(com.couchbase.jdbc.CBDatabaseMetaDataTest)
  testGetMaxProcedureNameLength(com.couchbase.jdbc.CBDatabaseMetaDataTest): Error opening connection
  testGetMaxProcedureNameLength(com.couchbase.jdbc.CBDatabaseMetaDataTest)
  testSupportsMultipleResultSets(com.couchbase.jdbc.CBDatabaseMetaDataTest): Error opening connection
  testSupportsMultipleResultSets(com.couchbase.jdbc.CBDatabaseMetaDataTest)
  testGetMaxColumnsInIndex(com.couchbase.jdbc.CBDatabaseMetaDataTest): Error opening connection
  testGetMaxColumnsInIndex(com.couchbase.jdbc.CBDatabaseMetaDataTest)
  testGetMaxColumnsInTable(com.couchbase.jdbc.CBDatabaseMetaDataTest): Error opening connection
  testGetMaxColumnsInTable(com.couchbase.jdbc.CBDatabaseMetaDataTest)
  testGetTimeDateFunctions(com.couchbase.jdbc.CBDatabaseMetaDataTest): Error opening connection
  testGetTimeDateFunctions(com.couchbase.jdbc.CBDatabaseMetaDataTest)
  testGetMaxRowSize(com.couchbase.jdbc.CBDatabaseMetaDataTest): Error opening connection
  testGetMaxRowSize(com.couchbase.jdbc.CBDatabaseMetaDataTest)
  testGetSuperTypes(com.couchbase.jdbc.CBDatabaseMetaDataTest): Error opening connection
  testGetSuperTypes(com.couchbase.jdbc.CBDatabaseMetaDataTest)
  testGetDriverMajorVersion(com.couchbase.jdbc.CBDatabaseMetaDataTest): Error opening connection
  testGetDriverMajorVersion(com.couchbase.jdbc.CBDatabaseMetaDataTest)
  testGetImportedKeys(com.couchbase.jdbc.CBDatabaseMetaDataTest): Error opening connection
  testGetImportedKeys(com.couchbase.jdbc.CBDatabaseMetaDataTest)
  testAllProceduresAreCallable(com.couchbase.jdbc.CBDatabaseMetaDataTest): Error opening connection
  testAllProceduresAreCallable(com.couchbase.jdbc.CBDatabaseMetaDataTest)
  testGetDriverVersion(com.couchbase.jdbc.CBDatabaseMetaDataTest): Error opening connection
  testGetDriverVersion(com.couchbase.jdbc.CBDatabaseMetaDataTest)
  testGetMaxColumnNameLength(com.couchbase.jdbc.CBDatabaseMetaDataTest): Error opening connection
  testGetMaxColumnNameLength(com.couchbase.jdbc.CBDatabaseMetaDataTest)
  testGetTableTypes(com.couchbase.jdbc.CBDatabaseMetaDataTest): Error opening connection
  testGetTableTypes(com.couchbase.jdbc.CBDatabaseMetaDataTest)
  testSupportsSubqueriesInExists(com.couchbase.jdbc.CBDatabaseMetaDataTest): Error opening connection
  testSupportsSubqueriesInExists(com.couchbase.jdbc.CBDatabaseMetaDataTest)
  testSupportsSubqueriesInIns(com.couchbase.jdbc.CBDatabaseMetaDataTest): Error opening connection
  testSupportsSubqueriesInIns(com.couchbase.jdbc.CBDatabaseMetaDataTest)
  testOthersInsertsAreVisible(com.couchbase.jdbc.CBDatabaseMetaDataTest): Error opening connection
  testOthersInsertsAreVisible(com.couchbase.jdbc.CBDatabaseMetaDataTest)
  testSupportsGroupByBeyondSelect(com.couchbase.jdbc.CBDatabaseMetaDataTest): Error opening connection
  testSupportsGroupByBeyondSelect(com.couchbase.jdbc.CBDatabaseMetaDataTest)
  testSupportsExtendedSQLGrammar(com.couchbase.jdbc.CBDatabaseMetaDataTest): Error opening connection
  testSupportsExtendedSQLGrammar(com.couchbase.jdbc.CBDatabaseMetaDataTest)
  testGetDatabaseMinorVersion(com.couchbase.jdbc.CBDatabaseMetaDataTest): Error opening connection
  testGetDatabaseMinorVersion(com.couchbase.jdbc.CBDatabaseMetaDataTest)
  testGetMaxTablesInSelect(com.couchbase.jdbc.CBDatabaseMetaDataTest): Error opening connection
  testGetMaxTablesInSelect(com.couchbase.jdbc.CBDatabaseMetaDataTest)
  testSupportsConvert(com.couchbase.jdbc.CBDatabaseMetaDataTest): Error opening connection
  testSupportsConvert(com.couchbase.jdbc.CBDatabaseMetaDataTest)
  testDeletesAreDetected(com.couchbase.jdbc.CBDatabaseMetaDataTest): Error opening connection
  testDeletesAreDetected(com.couchbase.jdbc.CBDatabaseMetaDataTest)
  testGetRowIdLifetime(com.couchbase.jdbc.CBDatabaseMetaDataTest): Error opening connection
  testGetRowIdLifetime(com.couchbase.jdbc.CBDatabaseMetaDataTest)
  testGetJDBCMajorVersion(com.couchbase.jdbc.CBDatabaseMetaDataTest): Error opening connection
  testGetJDBCMajorVersion(com.couchbase.jdbc.CBDatabaseMetaDataTest)
  testGetColumnPrivileges(com.couchbase.jdbc.CBDatabaseMetaDataTest): Error opening connection
  testGetColumnPrivileges(com.couchbase.jdbc.CBDatabaseMetaDataTest)
  testGetSuperTables(com.couchbase.jdbc.CBDatabaseMetaDataTest): Error opening connection
  testGetSuperTables(com.couchbase.jdbc.CBDatabaseMetaDataTest)
  testSupportsNonNullableColumns(com.couchbase.jdbc.CBDatabaseMetaDataTest): Error opening connection
  testSupportsNonNullableColumns(com.couchbase.jdbc.CBDatabaseMetaDataTest)
  testOwnDeletesAreVisible(com.couchbase.jdbc.CBDatabaseMetaDataTest): Error opening connection
  testOwnDeletesAreVisible(com.couchbase.jdbc.CBDatabaseMetaDataTest)
  testSupportsOrderByUnrelated(com.couchbase.jdbc.CBDatabaseMetaDataTest): Error opening connection
  testSupportsOrderByUnrelated(com.couchbase.jdbc.CBDatabaseMetaDataTest)
  testSupportsSchemasInTableDefinitions(com.couchbase.jdbc.CBDatabaseMetaDataTest): Error opening connection
  testSupportsSchemasInTableDefinitions(com.couchbase.jdbc.CBDatabaseMetaDataTest)
  testInsertsAreDetected(com.couchbase.jdbc.CBDatabaseMetaDataTest): Error opening connection
  testInsertsAreDetected(com.couchbase.jdbc.CBDatabaseMetaDataTest)
  testUpdatesAreDetected(com.couchbase.jdbc.CBDatabaseMetaDataTest): Error opening connection
  testUpdatesAreDetected(com.couchbase.jdbc.CBDatabaseMetaDataTest)
  testSupportsOuterJoins(com.couchbase.jdbc.CBDatabaseMetaDataTest): Error opening connection
  testSupportsOuterJoins(com.couchbase.jdbc.CBDatabaseMetaDataTest)
  testSupportsSelectForUpdate(com.couchbase.jdbc.CBDatabaseMetaDataTest): Error opening connection
  testSupportsSelectForUpdate(com.couchbase.jdbc.CBDatabaseMetaDataTest)
  testSupportsStatementPooling(com.couchbase.jdbc.CBDatabaseMetaDataTest): Error opening connection
  testSupportsStatementPooling(com.couchbase.jdbc.CBDatabaseMetaDataTest)
  testGetTablePrivileges(com.couchbase.jdbc.CBDatabaseMetaDataTest): Error opening connection
  testGetTablePrivileges(com.couchbase.jdbc.CBDatabaseMetaDataTest)
  testGetSchemas1(com.couchbase.jdbc.CBDatabaseMetaDataTest): Error opening connection
  testGetSchemas1(com.couchbase.jdbc.CBDatabaseMetaDataTest)
  testAutoCommitFailureClosesAllResultSets(com.couchbase.jdbc.CBDatabaseMetaDataTest): Error opening connection
  testAutoCommitFailureClosesAllResultSets(com.couchbase.jdbc.CBDatabaseMetaDataTest)
  testGetTypeInfo(com.couchbase.jdbc.CBDatabaseMetaDataTest): Error opening connection
  testGetTypeInfo(com.couchbase.jdbc.CBDatabaseMetaDataTest)
  testGetCrossReference(com.couchbase.jdbc.CBDatabaseMetaDataTest): Error opening connection
  testGetCrossReference(com.couchbase.jdbc.CBDatabaseMetaDataTest)
  testGetMaxStatements(com.couchbase.jdbc.CBDatabaseMetaDataTest): Error opening connection
  testGetMaxStatements(com.couchbase.jdbc.CBDatabaseMetaDataTest)
  testGetFunctionColumns(com.couchbase.jdbc.CBDatabaseMetaDataTest): Error opening connection
  testGetFunctionColumns(com.couchbase.jdbc.CBDatabaseMetaDataTest)
  testDataDefinitionCausesTransactionCommit(com.couchbase.jdbc.CBDatabaseMetaDataTest): Error opening connection
  testDataDefinitionCausesTransactionCommit(com.couchbase.jdbc.CBDatabaseMetaDataTest)
  testSupportsSavepoints(com.couchbase.jdbc.CBDatabaseMetaDataTest): Error opening connection
  testSupportsSavepoints(com.couchbase.jdbc.CBDatabaseMetaDataTest)
  testGetConnection(com.couchbase.jdbc.CBDatabaseMetaDataTest): Error opening connection
  testGetConnection(com.couchbase.jdbc.CBDatabaseMetaDataTest)
  testSupportsColumnAliasing(com.couchbase.jdbc.CBDatabaseMetaDataTest): Error opening connection
  testSupportsColumnAliasing(com.couchbase.jdbc.CBDatabaseMetaDataTest)
  testOthersUpdatesAreVisible(com.couchbase.jdbc.CBDatabaseMetaDataTest): Error opening connection
  testOthersUpdatesAreVisible(com.couchbase.jdbc.CBDatabaseMetaDataTest)
  testSupportsUnionAll(com.couchbase.jdbc.CBDatabaseMetaDataTest): Error opening connection
  testSupportsUnionAll(com.couchbase.jdbc.CBDatabaseMetaDataTest)
  testGetMaxIndexLength(com.couchbase.jdbc.CBDatabaseMetaDataTest): Error opening connection
  testGetMaxIndexLength(com.couchbase.jdbc.CBDatabaseMetaDataTest)
  testGetFunctions(com.couchbase.jdbc.CBDatabaseMetaDataTest): Error opening connection
  testGetFunctions(com.couchbase.jdbc.CBDatabaseMetaDataTest)
  testGetCatalogSeparator(com.couchbase.jdbc.CBDatabaseMetaDataTest): Error opening connection
  testGetCatalogSeparator(com.couchbase.jdbc.CBDatabaseMetaDataTest)
  testSupportsCatalogsInDataManipulation(com.couchbase.jdbc.CBDatabaseMetaDataTest): Error opening connection
  testSupportsCatalogsInDataManipulation(com.couchbase.jdbc.CBDatabaseMetaDataTest)
  testSupportsAlterTableWithAddColumn(com.couchbase.jdbc.CBDatabaseMetaDataTest): Error opening connection
  testSupportsAlterTableWithAddColumn(com.couchbase.jdbc.CBDatabaseMetaDataTest)
  testLocatorsUpdateCopy(com.couchbase.jdbc.CBDatabaseMetaDataTest): Error opening connection
  testLocatorsUpdateCopy(com.couchbase.jdbc.CBDatabaseMetaDataTest)
  testGetExportedKeys(com.couchbase.jdbc.CBDatabaseMetaDataTest): Error opening connection
  testGetExportedKeys(com.couchbase.jdbc.CBDatabaseMetaDataTest)
  testGetPseudoColumns(com.couchbase.jdbc.CBDatabaseMetaDataTest): Error opening connection
  testGetPseudoColumns(com.couchbase.jdbc.CBDatabaseMetaDataTest)
  testSupportsBatchUpdates(com.couchbase.jdbc.CBDatabaseMetaDataTest): Error opening connection
  testSupportsBatchUpdates(com.couchbase.jdbc.CBDatabaseMetaDataTest)
  testSupportsDataDefinitionAndDataManipulationTransactions(com.couchbase.jdbc.CBDatabaseMetaDataTest): Error opening connection
  testSupportsDataDefinitionAndDataManipulationTransactions(com.couchbase.jdbc.CBDatabaseMetaDataTest)
  testGetUserName(com.couchbase.jdbc.CBDatabaseMetaDataTest): Error opening connection
  testGetUserName(com.couchbase.jdbc.CBDatabaseMetaDataTest)
  testGetSchemaTerm(com.couchbase.jdbc.CBDatabaseMetaDataTest): Error opening connection
  testGetSchemaTerm(com.couchbase.jdbc.CBDatabaseMetaDataTest)
  testGetStringFunctions(com.couchbase.jdbc.CBDatabaseMetaDataTest): Error opening connection
  testGetStringFunctions(com.couchbase.jdbc.CBDatabaseMetaDataTest)
  testSupportsLimitedOuterJoins(com.couchbase.jdbc.CBDatabaseMetaDataTest): Error opening connection
  testSupportsLimitedOuterJoins(com.couchbase.jdbc.CBDatabaseMetaDataTest)
  testGetColumns(com.couchbase.jdbc.CBDatabaseMetaDataTest): Error opening connection
  testGetColumns(com.couchbase.jdbc.CBDatabaseMetaDataTest)
  testSupportsExpressionsInOrderBy(com.couchbase.jdbc.CBDatabaseMetaDataTest): Error opening connection
  testSupportsExpressionsInOrderBy(com.couchbase.jdbc.CBDatabaseMetaDataTest)
  testGetURL(com.couchbase.jdbc.CBDatabaseMetaDataTest): Error opening connection
  testGetURL(com.couchbase.jdbc.CBDatabaseMetaDataTest)
  testGetCatalogTerm(com.couchbase.jdbc.CBDatabaseMetaDataTest): Error opening connection
  testGetCatalogTerm(com.couchbase.jdbc.CBDatabaseMetaDataTest)
  testGetProcedureTerm(com.couchbase.jdbc.CBDatabaseMetaDataTest): Error opening connection
  testGetProcedureTerm(com.couchbase.jdbc.CBDatabaseMetaDataTest)
  testSupportsCoreSQLGrammar(com.couchbase.jdbc.CBDatabaseMetaDataTest): Error opening connection
  testSupportsCoreSQLGrammar(com.couchbase.jdbc.CBDatabaseMetaDataTest)
  testGetCatalogs(com.couchbase.jdbc.CBDatabaseMetaDataTest): Error opening connection
  testGetCatalogs(com.couchbase.jdbc.CBDatabaseMetaDataTest)
  testGetMaxConnections(com.couchbase.jdbc.CBDatabaseMetaDataTest): Error opening connection
  testGetMaxConnections(com.couchbase.jdbc.CBDatabaseMetaDataTest)
  testGetTables(com.couchbase.jdbc.CBDatabaseMetaDataTest): Error opening connection
  testGetTables(com.couchbase.jdbc.CBDatabaseMetaDataTest)
  testSupportsSubqueriesInQuantifieds(com.couchbase.jdbc.CBDatabaseMetaDataTest): Error opening connection
  testSupportsSubqueriesInQuantifieds(com.couchbase.jdbc.CBDatabaseMetaDataTest)
  testGetMaxCatalogNameLength(com.couchbase.jdbc.CBDatabaseMetaDataTest): Error opening connection
  testGetMaxCatalogNameLength(com.couchbase.jdbc.CBDatabaseMetaDataTest)
  testGetPrimaryKeys(com.couchbase.jdbc.CBDatabaseMetaDataTest): Error opening connection
  testGetPrimaryKeys(com.couchbase.jdbc.CBDatabaseMetaDataTest)
  testSupportsSubqueriesInComparisons(com.couchbase.jdbc.CBDatabaseMetaDataTest): Error opening connection
  testSupportsSubqueriesInComparisons(com.couchbase.jdbc.CBDatabaseMetaDataTest)
  testStoresMixedCaseIdentifiers(com.couchbase.jdbc.CBDatabaseMetaDataTest): Error opening connection
  testStoresMixedCaseIdentifiers(com.couchbase.jdbc.CBDatabaseMetaDataTest)
  testGetDatabaseProductName(com.couchbase.jdbc.CBDatabaseMetaDataTest): Error opening connection
  testGetDatabaseProductName(com.couchbase.jdbc.CBDatabaseMetaDataTest)
  testIsCatalogAtStart(com.couchbase.jdbc.CBDatabaseMetaDataTest): Error opening connection
  testIsCatalogAtStart(com.couchbase.jdbc.CBDatabaseMetaDataTest)
  testGetSQLStateType(com.couchbase.jdbc.CBDatabaseMetaDataTest): Error opening connection
  testGetSQLStateType(com.couchbase.jdbc.CBDatabaseMetaDataTest)
  testSupportsUnion(com.couchbase.jdbc.CBDatabaseMetaDataTest): Error opening connection
  testSupportsUnion(com.couchbase.jdbc.CBDatabaseMetaDataTest)
  testGetMaxBinaryLiteralLength(com.couchbase.jdbc.CBDatabaseMetaDataTest): Error opening connection
  testGetMaxBinaryLiteralLength(com.couchbase.jdbc.CBDatabaseMetaDataTest)
  testSupportsSchemasInDataManipulation(com.couchbase.jdbc.CBDatabaseMetaDataTest): Error opening connection
  testSupportsSchemasInDataManipulation(com.couchbase.jdbc.CBDatabaseMetaDataTest)
  testStoresUpperCaseIdentifiers(com.couchbase.jdbc.CBDatabaseMetaDataTest): Error opening connection
  testStoresUpperCaseIdentifiers(com.couchbase.jdbc.CBDatabaseMetaDataTest)
  testGetDriverMinorVersion(com.couchbase.jdbc.CBDatabaseMetaDataTest): Error opening connection
  testGetDriverMinorVersion(com.couchbase.jdbc.CBDatabaseMetaDataTest)
  testSupportsTableCorrelationNames(com.couchbase.jdbc.CBDatabaseMetaDataTest): Error opening connection
  testSupportsTableCorrelationNames(com.couchbase.jdbc.CBDatabaseMetaDataTest)
  testIsReadOnly(com.couchbase.jdbc.CBDatabaseMetaDataTest): Error opening connection
  testIsReadOnly(com.couchbase.jdbc.CBDatabaseMetaDataTest)
  testSupportsANSI92IntermediateSQL(com.couchbase.jdbc.CBDatabaseMetaDataTest): Error opening connection
  testSupportsANSI92IntermediateSQL(com.couchbase.jdbc.CBDatabaseMetaDataTest)
  testGetAttributes(com.couchbase.jdbc.CBDatabaseMetaDataTest): Error opening connection
  testGetAttributes(com.couchbase.jdbc.CBDatabaseMetaDataTest)
  testGetProcedures(com.couchbase.jdbc.CBDatabaseMetaDataTest): Error opening connection
  testGetProcedures(com.couchbase.jdbc.CBDatabaseMetaDataTest)
  testGetResultSetHoldability(com.couchbase.jdbc.CBDatabaseMetaDataTest): Error opening connection
  testGetResultSetHoldability(com.couchbase.jdbc.CBDatabaseMetaDataTest)
  testDoesMaxRowSizeIncludeBlobs(com.couchbase.jdbc.CBDatabaseMetaDataTest): Error opening connection
  testDoesMaxRowSizeIncludeBlobs(com.couchbase.jdbc.CBDatabaseMetaDataTest)
  testOthersDeletesAreVisible(com.couchbase.jdbc.CBDatabaseMetaDataTest): Error opening connection
  testOthersDeletesAreVisible(com.couchbase.jdbc.CBDatabaseMetaDataTest)
  testSupportsLikeEscapeClause(com.couchbase.jdbc.CBDatabaseMetaDataTest): Error opening connection
  testSupportsLikeEscapeClause(com.couchbase.jdbc.CBDatabaseMetaDataTest)
  openConnection(com.couchbase.jdbc.SSLConnectionTest): Error opening connection

Tests run: 586, Failures: 7, Errors: 566, Skipped: 10

[INFO] ------------------------------------------------------------------------
[INFO] BUILD FAILURE
[INFO] ------------------------------------------------------------------------
[INFO] Total time: 58.232 s
[INFO] Finished at: 2019-05-20T11:02:58-04:00
[INFO] Final Memory: 23M/276M
[INFO] ------------------------------------------------------------------------
[ERROR] Failed to execute goal org.apache.maven.plugins:maven-surefire-plugin:2.12.4:test (default-test) on project jdbc-n1ql: There are test failures.
[ERROR] 
[ERROR] Please refer to /home/tomcat/.jenkins/jobs/gluu-jdbc-cb/workspace/target/surefire-reports for the individual test results.
[ERROR] -> [Help 1]
[ERROR] 
[ERROR] To see the full stack trace of the errors, re-run Maven with the -e switch.
[ERROR] Re-run Maven using the -X switch to enable full debug logging.
[ERROR] 
[ERROR] For more information about the errors and possible solutions, please read the following articles:
[ERROR] [Help 1] http://cwiki.apache.org/confluence/display/MAVEN/MojoFailureException
Build step 'Invoke top-level Maven targets' marked build as failure
[FINDBUGS] Skipping publisher since build result is FAILURE
TestNG Reports Processing: START
Looking for TestNG results report in workspace using pattern: **/testng-results.xml
Did not find any matching files.
Sending e-mails to: support@gluu.org
Finished: FAILURE