FailedConsole Output

Started by an SCM change
Running as SYSTEM
Building on master in workspace /home/jenkins/.jenkins/jobs/janssen-notify_master/workspace
The recommended git tool is: NONE
No credentials specified
 > git rev-parse --is-inside-work-tree # timeout=10
Fetching changes from the remote Git repository
 > git config remote.origin.url https://github.com/JanssenProject/notify # timeout=10
Fetching upstream changes from https://github.com/JanssenProject/notify
 > git --version # timeout=10
 > git --version # 'git version 1.8.3.1'
 > git fetch --tags --progress https://github.com/JanssenProject/notify +refs/heads/*:refs/remotes/origin/* # timeout=10
 > git rev-parse refs/remotes/origin/master^{commit} # timeout=10
 > git rev-parse refs/remotes/origin/origin/master^{commit} # timeout=10
Checking out Revision 183b1317c1cc788f212dd48fc60de61eee34f694 (refs/remotes/origin/master)
 > git config core.sparsecheckout # timeout=10
 > git checkout -f 183b1317c1cc788f212dd48fc60de61eee34f694 # timeout=10
Commit message: "Renaming maven artifacts org.janssen -> io.jans"
First time build. Skipping changelog.
[workspace] $ /home/jenkins/.jenkins/tools/hudson.tasks.Maven_MavenInstallation/maven_3.3.9/bin/mvn -DVERSION_NAME=master -Dpython.import.site=false -DPYTHON_HOME=/opt/jython clean compile install site
[INFO] Scanning for projects...
Downloading: http://repo2.maven.org/maven2/org/bouncycastle/io/jans/core-bom/5.0.0-SNAPSHOT/maven-metadata.xml
Downloading: http://repo1.maven.org/maven2/io/jans/core-bom/5.0.0-SNAPSHOT/maven-metadata.xml


[WARNING] Could not transfer metadata io.jans:core-bom:5.0.0-SNAPSHOT/maven-metadata.xml from/to mavencentral (http://repo1.maven.org/maven2): Failed to transfer file: http://repo1.maven.org/maven2/io/jans/core-bom/5.0.0-SNAPSHOT/maven-metadata.xml. Return code is: 501 , ReasonPhrase:HTTPS Required.
[WARNING] Could not transfer metadata io.jans:core-bom:5.0.0-SNAPSHOT/maven-metadata.xml from/to bouncycastle (http://repo2.maven.org/maven2/org/bouncycastle): repo2.maven.org: Name or service not known
[INFO] ------------------------------------------------------------------------
[INFO] Reactor Build Order:
[INFO] 
[INFO] notify
[INFO] notify Model
[INFO] notify Client
[INFO] notify Client2
[INFO] notify Server
[INFO]                                                                         
[INFO] ------------------------------------------------------------------------
[INFO] Building notify 5.0.0-SNAPSHOT
[INFO] ------------------------------------------------------------------------
[INFO] 
[INFO] --- maven-clean-plugin:2.5:clean (default-clean) @ notify ---
[INFO] Deleting /home/jenkins/.jenkins/jobs/janssen-notify_master/workspace/target
[INFO] 
[INFO] --- maven-install-plugin:2.3.1:install (default-install) @ notify ---
[INFO] Installing /home/jenkins/.jenkins/jobs/janssen-notify_master/workspace/pom.xml to /var/www/html/maven/io/jans/notify/5.0.0-SNAPSHOT/notify-5.0.0-SNAPSHOT.pom
[INFO] 
[INFO] --- maven-site-plugin:2.1.1:site (default-site) @ notify ---
Downloading: http://repo2.maven.org/maven2/org/bouncycastle/org/apache/maven/skins/maven-default-skin/maven-metadata.xml

[WARNING] Could not transfer metadata org.apache.maven.skins:maven-default-skin/maven-metadata.xml from/to bouncycastle (http://repo2.maven.org/maven2/org/bouncycastle): repo2.maven.org
[INFO]                                                                         
[INFO] ------------------------------------------------------------------------
[INFO] Building notify Model 5.0.0-SNAPSHOT
[INFO] ------------------------------------------------------------------------
[INFO] 
[INFO] --- maven-clean-plugin:2.5:clean (default-clean) @ notify-model ---
[INFO] Deleting /home/jenkins/.jenkins/jobs/janssen-notify_master/workspace/model/target
[INFO] 
[INFO] --- maven-resources-plugin:2.6:resources (default-resources) @ notify-model ---
[INFO] Using 'UTF-8' encoding to copy filtered resources.
[INFO] skip non existing resourceDirectory /home/jenkins/.jenkins/jobs/janssen-notify_master/workspace/model/src/main/resources
[INFO] 
[INFO] --- maven-compiler-plugin:2.3.2:compile (default-compile) @ notify-model ---
[INFO] Compiling 4 source files to /home/jenkins/.jenkins/jobs/janssen-notify_master/workspace/model/target/classes
[INFO] 
[INFO] --- maven-resources-plugin:2.6:resources (default-resources) @ notify-model ---
[INFO] Using 'UTF-8' encoding to copy filtered resources.
[INFO] skip non existing resourceDirectory /home/jenkins/.jenkins/jobs/janssen-notify_master/workspace/model/src/main/resources
[INFO] 
[INFO] --- maven-compiler-plugin:2.3.2:compile (default-compile) @ notify-model ---
[INFO] Nothing to compile - all classes are up to date
[INFO] 
[INFO] --- maven-resources-plugin:2.6:testResources (default-testResources) @ notify-model ---
[INFO] Using 'UTF-8' encoding to copy filtered resources.
[INFO] skip non existing resourceDirectory /home/jenkins/.jenkins/jobs/janssen-notify_master/workspace/model/src/test/resources
[INFO] 
[INFO] --- maven-compiler-plugin:2.3.2:testCompile (default-testCompile) @ notify-model ---
[INFO] No sources to compile
[INFO] 
[INFO] --- maven-surefire-plugin:2.17:test (default-test) @ notify-model ---
[INFO] No tests to run.
[INFO] 
[INFO] --- maven-jar-plugin:2.4:jar (default-jar) @ notify-model ---
[INFO] Building jar: /home/jenkins/.jenkins/jobs/janssen-notify_master/workspace/model/target/notify-model-5.0.0-SNAPSHOT.jar
[INFO] 
[INFO] --- maven-jar-plugin:2.4:test-jar (default) @ notify-model ---
[WARNING] JAR will be empty - no content was marked for inclusion!
[INFO] Building jar: /home/jenkins/.jenkins/jobs/janssen-notify_master/workspace/model/target/notify-model-5.0.0-SNAPSHOT-tests.jar
[INFO] 
[INFO] --- maven-install-plugin:2.3.1:install (default-install) @ notify-model ---
[INFO] Installing /home/jenkins/.jenkins/jobs/janssen-notify_master/workspace/model/target/notify-model-5.0.0-SNAPSHOT.jar to /var/www/html/maven/io/jans/notify-model/5.0.0-SNAPSHOT/notify-model-5.0.0-SNAPSHOT.jar
[INFO] Installing /home/jenkins/.jenkins/jobs/janssen-notify_master/workspace/model/pom.xml to /var/www/html/maven/io/jans/notify-model/5.0.0-SNAPSHOT/notify-model-5.0.0-SNAPSHOT.pom
[INFO] Installing /home/jenkins/.jenkins/jobs/janssen-notify_master/workspace/model/target/notify-model-5.0.0-SNAPSHOT-tests.jar to /var/www/html/maven/io/jans/notify-model/5.0.0-SNAPSHOT/notify-model-5.0.0-SNAPSHOT-tests.jar
[INFO] 
[INFO] --- maven-site-plugin:2.1.1:site (default-site) @ notify-model ---
[INFO]                                                                         
[INFO] ------------------------------------------------------------------------
[INFO] Building notify Client 5.0.0-SNAPSHOT
[INFO] ------------------------------------------------------------------------
[INFO] 
[INFO] --- maven-clean-plugin:2.5:clean (default-clean) @ notify-client ---
[INFO] Deleting /home/jenkins/.jenkins/jobs/janssen-notify_master/workspace/client/target
[INFO] 
[INFO] --- maven-resources-plugin:2.6:resources (default-resources) @ notify-client ---
[INFO] Using 'UTF-8' encoding to copy filtered resources.
[INFO] skip non existing resourceDirectory /home/jenkins/.jenkins/jobs/janssen-notify_master/workspace/client/src/main/resources
[INFO] 
[INFO] --- maven-compiler-plugin:2.3.2:compile (default-compile) @ notify-client ---
[INFO] Compiling 3 source files to /home/jenkins/.jenkins/jobs/janssen-notify_master/workspace/client/target/classes
[INFO] 
[INFO] --- maven-resources-plugin:2.6:resources (default-resources) @ notify-client ---
[INFO] Using 'UTF-8' encoding to copy filtered resources.
[INFO] skip non existing resourceDirectory /home/jenkins/.jenkins/jobs/janssen-notify_master/workspace/client/src/main/resources
[INFO] 
[INFO] --- maven-compiler-plugin:2.3.2:compile (default-compile) @ notify-client ---
[INFO] Nothing to compile - all classes are up to date
[INFO] 
[INFO] --- maven-resources-plugin:2.6:testResources (default-testResources) @ notify-client ---
[INFO] Using 'UTF-8' encoding to copy filtered resources.
[INFO] skip non existing resourceDirectory /home/jenkins/.jenkins/jobs/janssen-notify_master/workspace/client/src/test/resources
[INFO] 
[INFO] --- maven-compiler-plugin:2.3.2:testCompile (default-testCompile) @ notify-client ---
[INFO] Nothing to compile - all classes are up to date
[INFO] 
[INFO] --- maven-surefire-plugin:2.17:test (default-test) @ notify-client ---
[INFO] No tests to run.
[INFO] 
[INFO] --- maven-jar-plugin:2.4:jar (default-jar) @ notify-client ---
[INFO] Building jar: /home/jenkins/.jenkins/jobs/janssen-notify_master/workspace/client/target/notify-client-5.0.0-SNAPSHOT.jar
[INFO] 
[INFO] --- maven-jar-plugin:2.4:test-jar (default) @ notify-client ---
[WARNING] JAR will be empty - no content was marked for inclusion!
[INFO] Building jar: /home/jenkins/.jenkins/jobs/janssen-notify_master/workspace/client/target/notify-client-5.0.0-SNAPSHOT-tests.jar
[INFO] 
[INFO] --- maven-install-plugin:2.3.1:install (default-install) @ notify-client ---
[INFO] Installing /home/jenkins/.jenkins/jobs/janssen-notify_master/workspace/client/target/notify-client-5.0.0-SNAPSHOT.jar to /var/www/html/maven/io/jans/notify-client/5.0.0-SNAPSHOT/notify-client-5.0.0-SNAPSHOT.jar
[INFO] Installing /home/jenkins/.jenkins/jobs/janssen-notify_master/workspace/client/pom.xml to /var/www/html/maven/io/jans/notify-client/5.0.0-SNAPSHOT/notify-client-5.0.0-SNAPSHOT.pom
[INFO] Installing /home/jenkins/.jenkins/jobs/janssen-notify_master/workspace/client/target/notify-client-5.0.0-SNAPSHOT-tests.jar to /var/www/html/maven/io/jans/notify-client/5.0.0-SNAPSHOT/notify-client-5.0.0-SNAPSHOT-tests.jar
[INFO] 
[INFO] --- maven-site-plugin:2.1.1:site (default-site) @ notify-client ---
[INFO]                                                                         
[INFO] ------------------------------------------------------------------------
[INFO] Building notify Client2 5.0.0-SNAPSHOT
[INFO] ------------------------------------------------------------------------
[INFO] 
[INFO] --- maven-clean-plugin:2.5:clean (default-clean) @ notify-client2 ---
[INFO] Deleting /home/jenkins/.jenkins/jobs/janssen-notify_master/workspace/client2/target
[INFO] 
[INFO] --- maven-resources-plugin:2.6:resources (default-resources) @ notify-client2 ---
[INFO] Using 'UTF-8' encoding to copy filtered resources.
[INFO] skip non existing resourceDirectory /home/jenkins/.jenkins/jobs/janssen-notify_master/workspace/client2/src/main/resources
[INFO] 
[INFO] --- maven-compiler-plugin:2.3.2:compile (default-compile) @ notify-client2 ---
[INFO] Compiling 3 source files to /home/jenkins/.jenkins/jobs/janssen-notify_master/workspace/client2/target/classes
[INFO] 
[INFO] --- maven-resources-plugin:2.6:resources (default-resources) @ notify-client2 ---
[INFO] Using 'UTF-8' encoding to copy filtered resources.
[INFO] skip non existing resourceDirectory /home/jenkins/.jenkins/jobs/janssen-notify_master/workspace/client2/src/main/resources
[INFO] 
[INFO] --- maven-compiler-plugin:2.3.2:compile (default-compile) @ notify-client2 ---
[INFO] Nothing to compile - all classes are up to date
[INFO] 
[INFO] --- maven-resources-plugin:2.6:testResources (default-testResources) @ notify-client2 ---
[INFO] Using 'UTF-8' encoding to copy filtered resources.
[INFO] skip non existing resourceDirectory /home/jenkins/.jenkins/jobs/janssen-notify_master/workspace/client2/src/test/resources
[INFO] 
[INFO] --- maven-compiler-plugin:2.3.2:testCompile (default-testCompile) @ notify-client2 ---
[INFO] No sources to compile
[INFO] 
[INFO] --- maven-surefire-plugin:2.17:test (default-test) @ notify-client2 ---
[INFO] No tests to run.
[INFO] 
[INFO] --- maven-jar-plugin:2.4:jar (default-jar) @ notify-client2 ---
[INFO] Building jar: /home/jenkins/.jenkins/jobs/janssen-notify_master/workspace/client2/target/notify-client2-5.0.0-SNAPSHOT.jar
[INFO] 
[INFO] --- maven-jar-plugin:2.4:test-jar (default) @ notify-client2 ---
[WARNING] JAR will be empty - no content was marked for inclusion!
[INFO] Building jar: /home/jenkins/.jenkins/jobs/janssen-notify_master/workspace/client2/target/notify-client2-5.0.0-SNAPSHOT-tests.jar
[INFO] 
[INFO] --- maven-install-plugin:2.3.1:install (default-install) @ notify-client2 ---
[INFO] Installing /home/jenkins/.jenkins/jobs/janssen-notify_master/workspace/client2/target/notify-client2-5.0.0-SNAPSHOT.jar to /var/www/html/maven/io/jans/notify-client2/5.0.0-SNAPSHOT/notify-client2-5.0.0-SNAPSHOT.jar
[INFO] Installing /home/jenkins/.jenkins/jobs/janssen-notify_master/workspace/client2/pom.xml to /var/www/html/maven/io/jans/notify-client2/5.0.0-SNAPSHOT/notify-client2-5.0.0-SNAPSHOT.pom
[INFO] Installing /home/jenkins/.jenkins/jobs/janssen-notify_master/workspace/client2/target/notify-client2-5.0.0-SNAPSHOT-tests.jar to /var/www/html/maven/io/jans/notify-client2/5.0.0-SNAPSHOT/notify-client2-5.0.0-SNAPSHOT-tests.jar
[INFO] 
[INFO] --- maven-site-plugin:2.1.1:site (default-site) @ notify-client2 ---
[INFO]                                                                         
[INFO] ------------------------------------------------------------------------
[INFO] Building notify Server 5.0.0-SNAPSHOT
[INFO] ------------------------------------------------------------------------
[WARNING] Failure to transfer io.jans:core-bom:5.0.0-SNAPSHOT/maven-metadata.xml from http://repo1.maven.org/maven2 was cached in the local repository, resolution will not be reattempted until the update interval of mavencentral has elapsed or updates are forced. Original error: Could not transfer metadata io.jans:core-bom:5.0.0-SNAPSHOT/maven-metadata.xml from/to mavencentral (http://repo1.maven.org/maven2): Failed to transfer file: http://repo1.maven.org/maven2/io/jans/core-bom/5.0.0-SNAPSHOT/maven-metadata.xml. Return code is: 501 , ReasonPhrase:HTTPS Required.
[WARNING] Failure to transfer io.jans:core-bom:5.0.0-SNAPSHOT/maven-metadata.xml from http://repo2.maven.org/maven2/org/bouncycastle was cached in the local repository, resolution will not be reattempted until the update interval of bouncycastle has elapsed or updates are forced. Original error: Could not transfer metadata io.jans:core-bom:5.0.0-SNAPSHOT/maven-metadata.xml from/to bouncycastle (http://repo2.maven.org/maven2/org/bouncycastle): repo2.maven.org: Name or service not known
[INFO] 
[INFO] --- maven-clean-plugin:2.5:clean (default-clean) @ notify-server ---
[INFO] Deleting /home/jenkins/.jenkins/jobs/janssen-notify_master/workspace/server/target
[INFO] 
[INFO] --- maven-resources-plugin:2.6:resources (default-resources) @ notify-server ---
[INFO] Using 'UTF-8' encoding to copy filtered resources.
[INFO] Copying 2 resources
[INFO] 
[INFO] --- maven-compiler-plugin:2.3.2:compile (default-compile) @ notify-server ---
[INFO] Compiling 18 source files to /home/jenkins/.jenkins/jobs/janssen-notify_master/workspace/server/target/classes
[INFO] -------------------------------------------------------------
[ERROR] COMPILATION ERROR : 
[INFO] -------------------------------------------------------------
[ERROR] /home/jenkins/.jenkins/jobs/janssen-notify_master/workspace/server/src/main/java/org/gluu/oxnotify/service/ConfigurationFactory.java:[21,31] error: package org.gluu.util.properties does not exist
[ERROR] /home/jenkins/.jenkins/jobs/janssen-notify_master/workspace/server/src/main/java/org/gluu/oxnotify/service/ConfigurationFactory.java:[109,9] error: cannot find symbol
[INFO] 2 errors 
[INFO] -------------------------------------------------------------
[INFO] ------------------------------------------------------------------------
[INFO] Reactor Summary:
[INFO] 
[INFO] notify ............................................. SUCCESS [  0.995 s]
[INFO] notify Model ....................................... SUCCESS [  1.289 s]
[INFO] notify Client ...................................... SUCCESS [  1.064 s]
[INFO] notify Client2 ..................................... SUCCESS [  0.633 s]
[INFO] notify Server ...................................... FAILURE [  0.896 s]
[INFO] ------------------------------------------------------------------------
[INFO] BUILD FAILURE
[INFO] ------------------------------------------------------------------------
[INFO] Total time: 5.804 s
[INFO] Finished at: 2020-10-06T14:17:17+00:00
[INFO] Final Memory: 45M/483M
[INFO] ------------------------------------------------------------------------
[ERROR] Failed to execute goal org.apache.maven.plugins:maven-compiler-plugin:2.3.2:compile (default-compile) on project notify-server: Compilation failure: Compilation failure:
[ERROR] /home/jenkins/.jenkins/jobs/janssen-notify_master/workspace/server/src/main/java/org/gluu/oxnotify/service/ConfigurationFactory.java:[21,31] error: package org.gluu.util.properties does not exist
[ERROR] /home/jenkins/.jenkins/jobs/janssen-notify_master/workspace/server/src/main/java/org/gluu/oxnotify/service/ConfigurationFactory.java:[109,9] error: cannot find symbol
[ERROR] -> [Help 1]
[ERROR] 
[ERROR] To see the full stack trace of the errors, re-run Maven with the -e switch.
[ERROR] Re-run Maven using the -X switch to enable full debug logging.
[ERROR] 
[ERROR] For more information about the errors and possible solutions, please read the following articles:
[ERROR] [Help 1] http://cwiki.apache.org/confluence/display/MAVEN/MojoFailureException
[ERROR] 
[ERROR] After correcting the problems, you can resume the build with the command
[ERROR]   mvn <goals> -rf :notify-server
Build step 'Invoke top-level Maven targets' marked build as failure
[FINDBUGS] Skipping publisher since build result is FAILURE
Recording test results
TestNG Reports Processing: START
Looking for TestNG results report in workspace using pattern: **/testng-results.xml
Did not find any matching files.
Not sending mail to unregistered user yzabrovarniy@gmail.com
Sending e-mails to: support@gluu.org
Finished: FAILURE