FailedConsole Output

Started by an SCM change
Running as SYSTEM
Building on master in workspace /home/jenkins/.jenkins/jobs/_jans-fido2_master/workspace
The recommended git tool is: NONE
No credentials specified
 > git rev-parse --is-inside-work-tree # timeout=10
Fetching changes from the remote Git repository
 > git config remote.origin.url https://github.com/JanssenProject/jans-fido2 # timeout=10
Fetching upstream changes from https://github.com/JanssenProject/jans-fido2
 > git --version # timeout=10
 > git --version # 'git version 1.8.3.1'
 > git fetch --tags --progress https://github.com/JanssenProject/jans-fido2 +refs/heads/*:refs/remotes/origin/* # timeout=10
 > git rev-parse refs/remotes/origin/master^{commit} # timeout=10
 > git rev-parse refs/remotes/origin/origin/master^{commit} # timeout=10
Checking out Revision 1eec7a890309f47f42662365136ada65aed71fbb (refs/remotes/origin/master)
 > git config core.sparsecheckout # timeout=10
 > git checkout -f 1eec7a890309f47f42662365136ada65aed71fbb # timeout=10
Commit message: "Update to conform ORM"
 > git rev-list --no-walk aa49f5706b3f7428df1100090ace57189390b038 # timeout=10
[workspace] $ /home/jenkins/.jenkins/tools/hudson.tasks.Maven_MavenInstallation/maven_3.3.9/bin/mvn -DDEPLOY_BUILD=false -DVERSION_NAME=master -DPROFILE_NAME=default -DDEVELOPMENT_BUILD=false -DMAVEN_SKIP_TESTS=false -Dpython.import.site=false -DPYTHON_HOME=/opt/jython -Dcfg=default -Dmaven.test.skip=false -Ddevelopment-build=false clean compile test-compile install site
[INFO] Scanning for projects...
[WARNING] 
[WARNING] Some problems were encountered while building the effective model for io.jans:jans-fido2-server:war:5.0.0-SNAPSHOT
[WARNING] 'build.plugins.plugin.version' for org.apache.maven.plugins:maven-war-plugin is missing. @ io.jans:jans-fido2-server:[unknown-version], /home/jenkins/.jenkins/jobs/_jans-fido2_master/workspace/server/pom.xml, line 43, column 12
[WARNING] 
[WARNING] It is highly recommended to fix these problems because they threaten the stability of your build.
[WARNING] 
[WARNING] For this reason, future Maven versions might no longer support building such malformed projects.
[WARNING] 
[INFO] ------------------------------------------------------------------------
[INFO] Reactor Build Order:
[INFO] 
[INFO] Fido2 API
[INFO] Fido2 API Model
[INFO] Fido2 Client
[INFO] Fido2 API Server
[INFO]                                                                         
[INFO] ------------------------------------------------------------------------
[INFO] Building Fido2 API 5.0.0-SNAPSHOT
[INFO] ------------------------------------------------------------------------
[INFO] 
[INFO] --- maven-clean-plugin:2.5:clean (default-clean) @ jans-fido2-parent ---
[INFO] Deleting /home/jenkins/.jenkins/jobs/_jans-fido2_master/workspace/target
[INFO] 
[INFO] --- maven-install-plugin:2.3.1:install (default-install) @ jans-fido2-parent ---
[INFO] Installing /home/jenkins/.jenkins/jobs/_jans-fido2_master/workspace/pom.xml to /var/www/html/maven/io/jans/jans-fido2-parent/5.0.0-SNAPSHOT/jans-fido2-parent-5.0.0-SNAPSHOT.pom
[INFO] 
[INFO] --- maven-site-plugin:2.1.1:site (default-site) @ jans-fido2-parent ---
[WARNING] No URL defined for the project - decoration links will not be resolved
[INFO]                                                                         
[INFO] ------------------------------------------------------------------------
[INFO] Building Fido2 API Model 5.0.0-SNAPSHOT
[INFO] ------------------------------------------------------------------------
Downloading: https://repo2.maven.org/maven2/org/bouncycastle/io/jans/jans-core-bom/5.0.0-SNAPSHOT/maven-metadata.xml

[WARNING] Could not transfer metadata io.jans:jans-core-bom:5.0.0-SNAPSHOT/maven-metadata.xml from/to bouncycastle (https://repo2.maven.org/maven2/org/bouncycastle): repo2.maven.org: Name or service not known
Downloading: https://repo2.maven.org/maven2/org/bouncycastle/io/jans/eleven-client/5.0.0-SNAPSHOT/maven-metadata.xml

[WARNING] Could not transfer metadata io.jans:eleven-client:5.0.0-SNAPSHOT/maven-metadata.xml from/to bouncycastle (https://repo2.maven.org/maven2/org/bouncycastle): repo2.maven.org
[WARNING] Failure to transfer io.jans:eleven-client:5.0.0-SNAPSHOT/maven-metadata.xml from https://repo2.maven.org/maven2/org/bouncycastle was cached in the local repository, resolution will not be reattempted until the update interval of bouncycastle has elapsed or updates are forced. Original error: Could not transfer metadata io.jans:eleven-client:5.0.0-SNAPSHOT/maven-metadata.xml from/to bouncycastle (https://repo2.maven.org/maven2/org/bouncycastle): repo2.maven.org
Downloading: https://repo2.maven.org/maven2/org/bouncycastle/io/jans/eleven/5.0.0-SNAPSHOT/maven-metadata.xml

[WARNING] Could not transfer metadata io.jans:eleven:5.0.0-SNAPSHOT/maven-metadata.xml from/to bouncycastle (https://repo2.maven.org/maven2/org/bouncycastle): repo2.maven.org
Downloading: http://repo2.maven.org/maven2/org/bouncycastle/io/jans/janssen-core-bom/5.0.0-SNAPSHOT/maven-metadata.xml

[WARNING] Could not transfer metadata io.jans:janssen-core-bom:5.0.0-SNAPSHOT/maven-metadata.xml from/to bouncycastle (http://repo2.maven.org/maven2/org/bouncycastle): repo2.maven.org
Downloading: https://repo2.maven.org/maven2/org/bouncycastle/io/jans/eleven-model/5.0.0-SNAPSHOT/maven-metadata.xml

[WARNING] Could not transfer metadata io.jans:eleven-model:5.0.0-SNAPSHOT/maven-metadata.xml from/to bouncycastle (https://repo2.maven.org/maven2/org/bouncycastle): repo2.maven.org
[WARNING] Failure to transfer io.jans:eleven-model:5.0.0-SNAPSHOT/maven-metadata.xml from https://repo2.maven.org/maven2/org/bouncycastle was cached in the local repository, resolution will not be reattempted until the update interval of bouncycastle has elapsed or updates are forced. Original error: Could not transfer metadata io.jans:eleven-model:5.0.0-SNAPSHOT/maven-metadata.xml from/to bouncycastle (https://repo2.maven.org/maven2/org/bouncycastle): repo2.maven.org
Downloading: https://repo2.maven.org/maven2/org/bouncycastle/io/jans/jans-core-util/5.0.0-SNAPSHOT/maven-metadata.xml

[WARNING] Could not transfer metadata io.jans:jans-core-util:5.0.0-SNAPSHOT/maven-metadata.xml from/to bouncycastle (https://repo2.maven.org/maven2/org/bouncycastle): repo2.maven.org
[WARNING] Failure to transfer io.jans:jans-core-util:5.0.0-SNAPSHOT/maven-metadata.xml from https://repo2.maven.org/maven2/org/bouncycastle was cached in the local repository, resolution will not be reattempted until the update interval of bouncycastle has elapsed or updates are forced. Original error: Could not transfer metadata io.jans:jans-core-util:5.0.0-SNAPSHOT/maven-metadata.xml from/to bouncycastle (https://repo2.maven.org/maven2/org/bouncycastle): repo2.maven.org
Downloading: https://repo2.maven.org/maven2/org/bouncycastle/io/jans/jans-core-model/5.0.0-SNAPSHOT/maven-metadata.xml

[WARNING] Could not transfer metadata io.jans:jans-core-model:5.0.0-SNAPSHOT/maven-metadata.xml from/to bouncycastle (https://repo2.maven.org/maven2/org/bouncycastle): repo2.maven.org
[WARNING] Failure to transfer io.jans:jans-core-model:5.0.0-SNAPSHOT/maven-metadata.xml from https://repo2.maven.org/maven2/org/bouncycastle was cached in the local repository, resolution will not be reattempted until the update interval of bouncycastle has elapsed or updates are forced. Original error: Could not transfer metadata io.jans:jans-core-model:5.0.0-SNAPSHOT/maven-metadata.xml from/to bouncycastle (https://repo2.maven.org/maven2/org/bouncycastle): repo2.maven.org
Downloading: https://repo2.maven.org/maven2/org/bouncycastle/net/minidev/json-smart/maven-metadata.xml

[WARNING] Could not transfer metadata net.minidev:json-smart/maven-metadata.xml from/to bouncycastle (https://repo2.maven.org/maven2/org/bouncycastle): repo2.maven.org
[INFO] 
[INFO] --- maven-clean-plugin:2.5:clean (default-clean) @ jans-fido2-model ---
[INFO] Deleting /home/jenkins/.jenkins/jobs/_jans-fido2_master/workspace/model/target
[INFO] 
[INFO] --- maven-resources-plugin:2.6:resources (default-resources) @ jans-fido2-model ---
[INFO] Using 'UTF-8' encoding to copy filtered resources.
[INFO] skip non existing resourceDirectory /home/jenkins/.jenkins/jobs/_jans-fido2_master/workspace/model/src/main/resources
[INFO] 
[INFO] --- maven-compiler-plugin:3.1:compile (default-compile) @ jans-fido2-model ---
[INFO] Changes detected - recompiling the module!
[INFO] Compiling 19 source files to /home/jenkins/.jenkins/jobs/_jans-fido2_master/workspace/model/target/classes
[INFO] -------------------------------------------------------------
[ERROR] COMPILATION ERROR : 
[INFO] -------------------------------------------------------------
[ERROR] /home/jenkins/.jenkins/jobs/_jans-fido2_master/workspace/model/src/main/java/io/jans/entry/DeviceRegistration.java:[15,46] package io.jans.oxauth.model.fido.u2f.protocol does not exist
[ERROR] /home/jenkins/.jenkins/jobs/_jans-fido2_master/workspace/model/src/main/java/io/jans/entry/DeviceRegistration.java:[71,17] cannot find symbol
  symbol:   class DeviceData
  location: class io.jans.entry.DeviceRegistration
[ERROR] /home/jenkins/.jenkins/jobs/_jans-fido2_master/workspace/model/src/main/java/io/jans/entry/DeviceRegistration.java:[225,12] cannot find symbol
  symbol:   class DeviceData
  location: class io.jans.entry.DeviceRegistration
[ERROR] /home/jenkins/.jenkins/jobs/_jans-fido2_master/workspace/model/src/main/java/io/jans/entry/DeviceRegistration.java:[229,35] cannot find symbol
  symbol:   class DeviceData
  location: class io.jans.entry.DeviceRegistration
[INFO] 4 errors 
[INFO] -------------------------------------------------------------
[INFO] ------------------------------------------------------------------------
[INFO] Reactor Summary:
[INFO] 
[INFO] Fido2 API .......................................... SUCCESS [  1.141 s]
[INFO] Fido2 API Model .................................... FAILURE [  2.957 s]
[INFO] Fido2 Client ....................................... SKIPPED
[INFO] Fido2 API Server ................................... SKIPPED
[INFO] ------------------------------------------------------------------------
[INFO] BUILD FAILURE
[INFO] ------------------------------------------------------------------------
[INFO] Total time: 4.552 s
[INFO] Finished at: 2020-10-09T16:18:14+00:00
[INFO] Final Memory: 28M/310M
[INFO] ------------------------------------------------------------------------
[ERROR] Failed to execute goal org.apache.maven.plugins:maven-compiler-plugin:3.1:compile (default-compile) on project jans-fido2-model: Compilation failure: Compilation failure:
[ERROR] /home/jenkins/.jenkins/jobs/_jans-fido2_master/workspace/model/src/main/java/io/jans/entry/DeviceRegistration.java:[15,46] package io.jans.oxauth.model.fido.u2f.protocol does not exist
[ERROR] /home/jenkins/.jenkins/jobs/_jans-fido2_master/workspace/model/src/main/java/io/jans/entry/DeviceRegistration.java:[71,17] cannot find symbol
[ERROR] symbol:   class DeviceData
[ERROR] location: class io.jans.entry.DeviceRegistration
[ERROR] /home/jenkins/.jenkins/jobs/_jans-fido2_master/workspace/model/src/main/java/io/jans/entry/DeviceRegistration.java:[225,12] cannot find symbol
[ERROR] symbol:   class DeviceData
[ERROR] location: class io.jans.entry.DeviceRegistration
[ERROR] /home/jenkins/.jenkins/jobs/_jans-fido2_master/workspace/model/src/main/java/io/jans/entry/DeviceRegistration.java:[229,35] cannot find symbol
[ERROR] symbol:   class DeviceData
[ERROR] location: class io.jans.entry.DeviceRegistration
[ERROR] -> [Help 1]
[ERROR] 
[ERROR] To see the full stack trace of the errors, re-run Maven with the -e switch.
[ERROR] Re-run Maven using the -X switch to enable full debug logging.
[ERROR] 
[ERROR] For more information about the errors and possible solutions, please read the following articles:
[ERROR] [Help 1] http://cwiki.apache.org/confluence/display/MAVEN/MojoFailureException
[ERROR] 
[ERROR] After correcting the problems, you can resume the build with the command
[ERROR]   mvn <goals> -rf :jans-fido2-model
Build step 'Invoke top-level Maven targets' marked build as failure
Finished: FAILURE