FailedConsole Output

Started by an SCM change
Running as SYSTEM
Building on master in workspace /home/jenkins/.jenkins/jobs/_jans-core_master/workspace
The recommended git tool is: NONE
No credentials specified
 > git rev-parse --is-inside-work-tree # timeout=10
Fetching changes from the remote Git repository
 > git config remote.origin.url https://github.com/JanssenProject/jans-core # timeout=10
Fetching upstream changes from https://github.com/JanssenProject/jans-core
 > git --version # timeout=10
 > git --version # 'git version 1.8.3.1'
 > git fetch --tags --progress https://github.com/JanssenProject/jans-core +refs/heads/*:refs/remotes/origin/* # timeout=10
 > git rev-parse refs/remotes/origin/master^{commit} # timeout=10
 > git rev-parse refs/remotes/origin/origin/master^{commit} # timeout=10
Checking out Revision feaccdb1e9717ba35bf4e0e7b1a9f3dcd9595fb5 (refs/remotes/origin/master)
 > git config core.sparsecheckout # timeout=10
 > git checkout -f feaccdb1e9717ba35bf4e0e7b1a9f3dcd9595fb5 # timeout=10
Commit message: "Fix license, properties and conform jans project"
 > git rev-list --no-walk 8a8635cde27ecb7f34bc17beba112c82b3c03215 # timeout=10
[workspace] $ /home/jenkins/.jenkins/tools/hudson.tasks.Maven_MavenInstallation/maven_3.3.9/bin/mvn -DVERSION_NAME=master -DMAVEN_SKIP_TESTS=false -Dmaven.test.skip=false clean compile install
[INFO] Scanning for projects...
[INFO] ------------------------------------------------------------------------
[INFO] Reactor Build Order:
[INFO] 
[INFO] jans-core
[INFO] jans-core-util
[INFO] jans-core-model
[INFO] Caches support
[INFO] Caches support
[INFO] Configuration factories for standalone applications
[INFO] jans-core-saml
[INFO] jans-core-cdi
[INFO] jans-core-script
[INFO] jans-core-service
[INFO] jans-core-jsf-util
[INFO] Java extensions
[INFO] Weld CDI timer implementation
[INFO] security-extension-cdi
[INFO] exception-extension-cdi
[INFO] Web application specific classes
[INFO] jans-core-radius
[INFO] Demo CDI services
[INFO]                                                                         
[INFO] ------------------------------------------------------------------------
[INFO] Building jans-core 5.0.0-SNAPSHOT
[INFO] ------------------------------------------------------------------------
[INFO] 
[INFO] --- maven-clean-plugin:2.4.1:clean (default-clean) @ jans-core-parent ---
[INFO] 
[INFO] --- maven-install-plugin:2.3.1:install (default-install) @ jans-core-parent ---
[INFO] Installing /home/jenkins/.jenkins/jobs/_jans-core_master/workspace/pom.xml to /var/www/html/maven/io/jans/jans-core-parent/5.0.0-SNAPSHOT/jans-core-parent-5.0.0-SNAPSHOT.pom
[INFO]                                                                         
[INFO] ------------------------------------------------------------------------
[INFO] Building jans-core-util 5.0.0-SNAPSHOT
[INFO] ------------------------------------------------------------------------
[INFO] 
[INFO] --- maven-clean-plugin:2.4.1:clean (default-clean) @ jans-core-util ---
[INFO] Deleting /home/jenkins/.jenkins/jobs/_jans-core_master/workspace/util/target
[INFO] 
[INFO] --- maven-resources-plugin:2.4:resources (default-resources) @ jans-core-util ---
[INFO] Using 'UTF-8' encoding to copy filtered resources.
[INFO] skip non existing resourceDirectory /home/jenkins/.jenkins/jobs/_jans-core_master/workspace/util/src/main/resources
[INFO] 
[INFO] --- maven-compiler-plugin:2.3.2:compile (default-compile) @ jans-core-util ---
[INFO] Compiling 62 source files to /home/jenkins/.jenkins/jobs/_jans-core_master/workspace/util/target/classes
[INFO] 
[INFO] --- maven-resources-plugin:2.4:resources (default-resources) @ jans-core-util ---
[INFO] Using 'UTF-8' encoding to copy filtered resources.
[INFO] skip non existing resourceDirectory /home/jenkins/.jenkins/jobs/_jans-core_master/workspace/util/src/main/resources
[INFO] 
[INFO] --- maven-compiler-plugin:2.3.2:compile (default-compile) @ jans-core-util ---
[INFO] Nothing to compile - all classes are up to date
[INFO] 
[INFO] --- maven-resources-plugin:2.4:testResources (default-testResources) @ jans-core-util ---
[INFO] Using 'UTF-8' encoding to copy filtered resources.
[INFO] skip non existing resourceDirectory /home/jenkins/.jenkins/jobs/_jans-core_master/workspace/util/src/test/resources
[INFO] 
[INFO] --- maven-compiler-plugin:2.3.2:testCompile (default-testCompile) @ jans-core-util ---
[INFO] No sources to compile
[INFO] 
[INFO] --- maven-surefire-plugin:2.7.2:test (default-test) @ jans-core-util ---
[INFO] No tests to run.
[INFO] Surefire report directory: /home/jenkins/.jenkins/jobs/_jans-core_master/workspace/util/target/surefire-reports

-------------------------------------------------------
 T E S T S
-------------------------------------------------------
There are no tests to run.

Results :

Tests run: 0, Failures: 0, Errors: 0, Skipped: 0

[INFO] 
[INFO] --- maven-jar-plugin:2.4:jar (default-jar) @ jans-core-util ---
[INFO] Building jar: /home/jenkins/.jenkins/jobs/_jans-core_master/workspace/util/target/jans-core-util-5.0.0-SNAPSHOT.jar
[INFO] 
[INFO] --- maven-install-plugin:2.3.1:install (default-install) @ jans-core-util ---
[INFO] Installing /home/jenkins/.jenkins/jobs/_jans-core_master/workspace/util/target/jans-core-util-5.0.0-SNAPSHOT.jar to /var/www/html/maven/io/jans/jans-core-util/5.0.0-SNAPSHOT/jans-core-util-5.0.0-SNAPSHOT.jar
[INFO] Installing /home/jenkins/.jenkins/jobs/_jans-core_master/workspace/util/pom.xml to /var/www/html/maven/io/jans/jans-core-util/5.0.0-SNAPSHOT/jans-core-util-5.0.0-SNAPSHOT.pom
[INFO]                                                                         
[INFO] ------------------------------------------------------------------------
[INFO] Building jans-core-model 5.0.0-SNAPSHOT
[INFO] ------------------------------------------------------------------------
[INFO] 
[INFO] --- maven-clean-plugin:2.4.1:clean (default-clean) @ jans-core-model ---
[INFO] Deleting /home/jenkins/.jenkins/jobs/_jans-core_master/workspace/model/target
[INFO] 
[INFO] --- maven-resources-plugin:2.4:resources (default-resources) @ jans-core-model ---
[INFO] Using 'UTF-8' encoding to copy filtered resources.
[INFO] skip non existing resourceDirectory /home/jenkins/.jenkins/jobs/_jans-core_master/workspace/model/src/main/resources
[INFO] 
[INFO] --- maven-compiler-plugin:2.3.2:compile (default-compile) @ jans-core-model ---
[INFO] Compiling 18 source files to /home/jenkins/.jenkins/jobs/_jans-core_master/workspace/model/target/classes
[INFO] 
[INFO] --- maven-resources-plugin:2.4:resources (default-resources) @ jans-core-model ---
[INFO] Using 'UTF-8' encoding to copy filtered resources.
[INFO] skip non existing resourceDirectory /home/jenkins/.jenkins/jobs/_jans-core_master/workspace/model/src/main/resources
[INFO] 
[INFO] --- maven-compiler-plugin:2.3.2:compile (default-compile) @ jans-core-model ---
[INFO] Nothing to compile - all classes are up to date
[INFO] 
[INFO] --- maven-resources-plugin:2.4:testResources (default-testResources) @ jans-core-model ---
[INFO] Using 'UTF-8' encoding to copy filtered resources.
[INFO] skip non existing resourceDirectory /home/jenkins/.jenkins/jobs/_jans-core_master/workspace/model/src/test/resources
[INFO] 
[INFO] --- maven-compiler-plugin:2.3.2:testCompile (default-testCompile) @ jans-core-model ---
[INFO] No sources to compile
[INFO] 
[INFO] --- maven-surefire-plugin:2.7.2:test (default-test) @ jans-core-model ---
[INFO] No tests to run.
[INFO] Surefire report directory: /home/jenkins/.jenkins/jobs/_jans-core_master/workspace/model/target/surefire-reports

-------------------------------------------------------
 T E S T S
-------------------------------------------------------
There are no tests to run.

Results :

Tests run: 0, Failures: 0, Errors: 0, Skipped: 0

[INFO] 
[INFO] --- maven-jar-plugin:2.4:jar (default-jar) @ jans-core-model ---
[INFO] Building jar: /home/jenkins/.jenkins/jobs/_jans-core_master/workspace/model/target/jans-core-model-5.0.0-SNAPSHOT.jar
[INFO] 
[INFO] --- maven-install-plugin:2.3.1:install (default-install) @ jans-core-model ---
[INFO] Installing /home/jenkins/.jenkins/jobs/_jans-core_master/workspace/model/target/jans-core-model-5.0.0-SNAPSHOT.jar to /var/www/html/maven/io/jans/jans-core-model/5.0.0-SNAPSHOT/jans-core-model-5.0.0-SNAPSHOT.jar
[INFO] Installing /home/jenkins/.jenkins/jobs/_jans-core_master/workspace/model/pom.xml to /var/www/html/maven/io/jans/jans-core-model/5.0.0-SNAPSHOT/jans-core-model-5.0.0-SNAPSHOT.pom
[INFO]                                                                         
[INFO] ------------------------------------------------------------------------
[INFO] Building Caches support 5.0.0-SNAPSHOT
[INFO] ------------------------------------------------------------------------
[INFO] 
[INFO] --- maven-clean-plugin:2.4.1:clean (default-clean) @ jans-core-cache ---
[INFO] Deleting /home/jenkins/.jenkins/jobs/_jans-core_master/workspace/cache/target
[INFO] 
[INFO] --- maven-resources-plugin:2.4:resources (default-resources) @ jans-core-cache ---
[INFO] Using 'UTF-8' encoding to copy filtered resources.
[INFO] Copying 1 resource
[INFO] 
[INFO] --- maven-compiler-plugin:2.3.2:compile (default-compile) @ jans-core-cache ---
[INFO] Compiling 28 source files to /home/jenkins/.jenkins/jobs/_jans-core_master/workspace/cache/target/classes
[INFO] 
[INFO] --- maven-resources-plugin:2.4:resources (default-resources) @ jans-core-cache ---
[INFO] Using 'UTF-8' encoding to copy filtered resources.
[INFO] Copying 1 resource
[INFO] 
[INFO] --- maven-compiler-plugin:2.3.2:compile (default-compile) @ jans-core-cache ---
[INFO] Nothing to compile - all classes are up to date
[INFO] 
[INFO] --- maven-resources-plugin:2.4:testResources (default-testResources) @ jans-core-cache ---
[INFO] Using 'UTF-8' encoding to copy filtered resources.
[INFO] skip non existing resourceDirectory /home/jenkins/.jenkins/jobs/_jans-core_master/workspace/cache/src/test/resources
[INFO] 
[INFO] --- maven-compiler-plugin:2.3.2:testCompile (default-testCompile) @ jans-core-cache ---
[INFO] No sources to compile
[INFO] 
[INFO] --- maven-surefire-plugin:2.7.2:test (default-test) @ jans-core-cache ---
[INFO] No tests to run.
[INFO] Surefire report directory: /home/jenkins/.jenkins/jobs/_jans-core_master/workspace/cache/target/surefire-reports
There are no tests to run.
[INFO] 
[INFO] --- maven-jar-plugin:2.4:jar (default-jar) @ jans-core-cache ---
[INFO] Building jar: /home/jenkins/.jenkins/jobs/_jans-core_master/workspace/cache/target/jans-core-cache-5.0.0-SNAPSHOT.jar
[INFO] 
[INFO] --- maven-install-plugin:2.3.1:install (default-install) @ jans-core-cache ---
[INFO] Installing /home/jenkins/.jenkins/jobs/_jans-core_master/workspace/cache/target/jans-core-cache-5.0.0-SNAPSHOT.jar to /var/www/html/maven/io/jans/jans-core-cache/5.0.0-SNAPSHOT/jans-core-cache-5.0.0-SNAPSHOT.jar
[INFO] Installing /home/jenkins/.jenkins/jobs/_jans-core_master/workspace/cache/pom.xml to /var/www/html/maven/io/jans/jans-core-cache/5.0.0-SNAPSHOT/jans-core-cache-5.0.0-SNAPSHOT.pom
[INFO]                                                                         
[INFO] ------------------------------------------------------------------------
[INFO] Building Caches support 5.0.0-SNAPSHOT
[INFO] ------------------------------------------------------------------------
[INFO] 
[INFO] --- maven-clean-plugin:2.4.1:clean (default-clean) @ jans-core-document-store ---
[INFO] Deleting /home/jenkins/.jenkins/jobs/_jans-core_master/workspace/document-store/target
[INFO] 
[INFO] --- maven-resources-plugin:2.4:resources (default-resources) @ jans-core-document-store ---
[INFO] Using 'UTF-8' encoding to copy filtered resources.
[INFO] Copying 1 resource
[INFO] 
[INFO] --- maven-compiler-plugin:2.3.2:compile (default-compile) @ jans-core-document-store ---
[INFO] Compiling 16 source files to /home/jenkins/.jenkins/jobs/_jans-core_master/workspace/document-store/target/classes
[INFO] 
[INFO] --- maven-resources-plugin:2.4:resources (default-resources) @ jans-core-document-store ---
[INFO] Using 'UTF-8' encoding to copy filtered resources.
[INFO] Copying 1 resource
[INFO] 
[INFO] --- maven-compiler-plugin:2.3.2:compile (default-compile) @ jans-core-document-store ---
[INFO] Nothing to compile - all classes are up to date
[INFO] 
[INFO] --- maven-resources-plugin:2.4:testResources (default-testResources) @ jans-core-document-store ---
[INFO] Using 'UTF-8' encoding to copy filtered resources.
[INFO] skip non existing resourceDirectory /home/jenkins/.jenkins/jobs/_jans-core_master/workspace/document-store/src/test/resources
[INFO] 
[INFO] --- maven-compiler-plugin:2.3.2:testCompile (default-testCompile) @ jans-core-document-store ---
[INFO] Compiling 1 source file to /home/jenkins/.jenkins/jobs/_jans-core_master/workspace/document-store/target/test-classes
[INFO] 
[INFO] --- maven-surefire-plugin:2.7.2:test (default-test) @ jans-core-document-store ---
[INFO] Surefire report directory: /home/jenkins/.jenkins/jobs/_jans-core_master/workspace/document-store/target/surefire-reports

-------------------------------------------------------
 T E S T S
-------------------------------------------------------
Running TestSuite
Tests run: 0, Failures: 0, Errors: 0, Skipped: 0, Time elapsed: 0.255 sec
There are no tests to run.

Results :

Tests run: 0, Failures: 0, Errors: 0, Skipped: 0

[INFO] 
[INFO] --- maven-jar-plugin:2.4:jar (default-jar) @ jans-core-document-store ---
[INFO] Building jar: /home/jenkins/.jenkins/jobs/_jans-core_master/workspace/document-store/target/jans-core-document-store-5.0.0-SNAPSHOT.jar
[INFO] 
[INFO] --- maven-install-plugin:2.3.1:install (default-install) @ jans-core-document-store ---
[INFO] Installing /home/jenkins/.jenkins/jobs/_jans-core_master/workspace/document-store/target/jans-core-document-store-5.0.0-SNAPSHOT.jar to /var/www/html/maven/io/jans/jans-core-document-store/5.0.0-SNAPSHOT/jans-core-document-store-5.0.0-SNAPSHOT.jar
[INFO] Installing /home/jenkins/.jenkins/jobs/_jans-core_master/workspace/document-store/pom.xml to /var/www/html/maven/io/jans/jans-core-document-store/5.0.0-SNAPSHOT/jans-core-document-store-5.0.0-SNAPSHOT.pom
[INFO]                                                                         
[INFO] ------------------------------------------------------------------------
[INFO] Building Configuration factories for standalone applications 5.0.0-SNAPSHOT
[INFO] ------------------------------------------------------------------------
[INFO] 
[INFO] --- maven-clean-plugin:2.4.1:clean (default-clean) @ jans-core-standalone ---
[INFO] Deleting /home/jenkins/.jenkins/jobs/_jans-core_master/workspace/standalone/target
[INFO] 
[INFO] --- maven-resources-plugin:2.4:resources (default-resources) @ jans-core-standalone ---
[INFO] Using 'UTF-8' encoding to copy filtered resources.
[INFO] skip non existing resourceDirectory /home/jenkins/.jenkins/jobs/_jans-core_master/workspace/standalone/src/main/resources
[INFO] 
[INFO] --- maven-compiler-plugin:2.3.2:compile (default-compile) @ jans-core-standalone ---
[INFO] Compiling 5 source files to /home/jenkins/.jenkins/jobs/_jans-core_master/workspace/standalone/target/classes
[INFO] 
[INFO] --- maven-resources-plugin:2.4:resources (default-resources) @ jans-core-standalone ---
[INFO] Using 'UTF-8' encoding to copy filtered resources.
[INFO] skip non existing resourceDirectory /home/jenkins/.jenkins/jobs/_jans-core_master/workspace/standalone/src/main/resources
[INFO] 
[INFO] --- maven-compiler-plugin:2.3.2:compile (default-compile) @ jans-core-standalone ---
[INFO] Nothing to compile - all classes are up to date
[INFO] 
[INFO] --- maven-resources-plugin:2.4:testResources (default-testResources) @ jans-core-standalone ---
[INFO] Using 'UTF-8' encoding to copy filtered resources.
[INFO] skip non existing resourceDirectory /home/jenkins/.jenkins/jobs/_jans-core_master/workspace/standalone/src/test/resources
[INFO] 
[INFO] --- maven-compiler-plugin:2.3.2:testCompile (default-testCompile) @ jans-core-standalone ---
[INFO] No sources to compile
[INFO] 
[INFO] --- maven-surefire-plugin:2.7.2:test (default-test) @ jans-core-standalone ---
[INFO] No tests to run.
[INFO] Surefire report directory: /home/jenkins/.jenkins/jobs/_jans-core_master/workspace/standalone/target/surefire-reports
There are no tests to run.
[INFO] 
[INFO] --- maven-jar-plugin:2.4:jar (default-jar) @ jans-core-standalone ---
[INFO] Building jar: /home/jenkins/.jenkins/jobs/_jans-core_master/workspace/standalone/target/jans-core-standalone-5.0.0-SNAPSHOT.jar
[INFO] 
[INFO] --- maven-install-plugin:2.3.1:install (default-install) @ jans-core-standalone ---
[INFO] Installing /home/jenkins/.jenkins/jobs/_jans-core_master/workspace/standalone/target/jans-core-standalone-5.0.0-SNAPSHOT.jar to /var/www/html/maven/io/jans/jans-core-standalone/5.0.0-SNAPSHOT/jans-core-standalone-5.0.0-SNAPSHOT.jar
[INFO] Installing /home/jenkins/.jenkins/jobs/_jans-core_master/workspace/standalone/pom.xml to /var/www/html/maven/io/jans/jans-core-standalone/5.0.0-SNAPSHOT/jans-core-standalone-5.0.0-SNAPSHOT.pom
[INFO]                                                                         
[INFO] ------------------------------------------------------------------------
[INFO] Building jans-core-saml 5.0.0-SNAPSHOT
[INFO] ------------------------------------------------------------------------
[INFO] 
[INFO] --- maven-clean-plugin:2.4.1:clean (default-clean) @ jans-core-saml ---
[INFO] Deleting /home/jenkins/.jenkins/jobs/_jans-core_master/workspace/saml/target
[INFO] 
[INFO] --- maven-resources-plugin:2.4:resources (default-resources) @ jans-core-saml ---
[INFO] Using 'UTF-8' encoding to copy filtered resources.
[INFO] Copying 1 resource
[INFO] 
[INFO] --- maven-compiler-plugin:2.3.2:compile (default-compile) @ jans-core-saml ---
[INFO] Compiling 7 source files to /home/jenkins/.jenkins/jobs/_jans-core_master/workspace/saml/target/classes
[INFO] 
[INFO] --- maven-resources-plugin:2.4:resources (default-resources) @ jans-core-saml ---
[INFO] Using 'UTF-8' encoding to copy filtered resources.
[INFO] Copying 1 resource
[INFO] 
[INFO] --- maven-compiler-plugin:2.3.2:compile (default-compile) @ jans-core-saml ---
[INFO] Nothing to compile - all classes are up to date
[INFO] 
[INFO] --- maven-resources-plugin:2.4:testResources (default-testResources) @ jans-core-saml ---
[INFO] Using 'UTF-8' encoding to copy filtered resources.
[INFO] skip non existing resourceDirectory /home/jenkins/.jenkins/jobs/_jans-core_master/workspace/saml/src/test/resources
[INFO] 
[INFO] --- maven-compiler-plugin:2.3.2:testCompile (default-testCompile) @ jans-core-saml ---
[INFO] No sources to compile
[INFO] 
[INFO] --- maven-surefire-plugin:2.7.2:test (default-test) @ jans-core-saml ---
[INFO] No tests to run.
[INFO] Surefire report directory: /home/jenkins/.jenkins/jobs/_jans-core_master/workspace/saml/target/surefire-reports

-------------------------------------------------------
 T E S T S
-------------------------------------------------------
There are no tests to run.

Results :

Tests run: 0, Failures: 0, Errors: 0, Skipped: 0

[INFO] 
[INFO] --- maven-jar-plugin:2.4:jar (default-jar) @ jans-core-saml ---
[INFO] Building jar: /home/jenkins/.jenkins/jobs/_jans-core_master/workspace/saml/target/jans-core-saml-5.0.0-SNAPSHOT.jar
[INFO] 
[INFO] --- maven-install-plugin:2.3.1:install (default-install) @ jans-core-saml ---
[INFO] Installing /home/jenkins/.jenkins/jobs/_jans-core_master/workspace/saml/target/jans-core-saml-5.0.0-SNAPSHOT.jar to /var/www/html/maven/io/jans/jans-core-saml/5.0.0-SNAPSHOT/jans-core-saml-5.0.0-SNAPSHOT.jar
[INFO] Installing /home/jenkins/.jenkins/jobs/_jans-core_master/workspace/saml/pom.xml to /var/www/html/maven/io/jans/jans-core-saml/5.0.0-SNAPSHOT/jans-core-saml-5.0.0-SNAPSHOT.pom
[INFO]                                                                         
[INFO] ------------------------------------------------------------------------
[INFO] Building jans-core-cdi 5.0.0-SNAPSHOT
[INFO] ------------------------------------------------------------------------
[INFO] 
[INFO] --- maven-clean-plugin:2.4.1:clean (default-clean) @ jans-core-cdi ---
[INFO] Deleting /home/jenkins/.jenkins/jobs/_jans-core_master/workspace/cdi/target
[INFO] 
[INFO] --- maven-resources-plugin:2.4:resources (default-resources) @ jans-core-cdi ---
[INFO] Using 'UTF-8' encoding to copy filtered resources.
[INFO] Copying 1 resource
[INFO] 
[INFO] --- maven-compiler-plugin:2.3.2:compile (default-compile) @ jans-core-cdi ---
[INFO] Compiling 5 source files to /home/jenkins/.jenkins/jobs/_jans-core_master/workspace/cdi/target/classes
[INFO] 
[INFO] --- maven-resources-plugin:2.4:resources (default-resources) @ jans-core-cdi ---
[INFO] Using 'UTF-8' encoding to copy filtered resources.
[INFO] Copying 1 resource
[INFO] 
[INFO] --- maven-compiler-plugin:2.3.2:compile (default-compile) @ jans-core-cdi ---
[INFO] Nothing to compile - all classes are up to date
[INFO] 
[INFO] --- maven-resources-plugin:2.4:testResources (default-testResources) @ jans-core-cdi ---
[INFO] Using 'UTF-8' encoding to copy filtered resources.
[INFO] skip non existing resourceDirectory /home/jenkins/.jenkins/jobs/_jans-core_master/workspace/cdi/src/test/resources
[INFO] 
[INFO] --- maven-compiler-plugin:2.3.2:testCompile (default-testCompile) @ jans-core-cdi ---
[INFO] No sources to compile
[INFO] 
[INFO] --- maven-surefire-plugin:2.7.2:test (default-test) @ jans-core-cdi ---
[INFO] No tests to run.
[INFO] Surefire report directory: /home/jenkins/.jenkins/jobs/_jans-core_master/workspace/cdi/target/surefire-reports

-------------------------------------------------------
 T E S T S
-------------------------------------------------------
There are no tests to run.

Results :

Tests run: 0, Failures: 0, Errors: 0, Skipped: 0

[INFO] 
[INFO] --- maven-jar-plugin:2.4:jar (default-jar) @ jans-core-cdi ---
[INFO] Building jar: /home/jenkins/.jenkins/jobs/_jans-core_master/workspace/cdi/target/jans-core-cdi-5.0.0-SNAPSHOT.jar
[INFO] 
[INFO] --- maven-install-plugin:2.3.1:install (default-install) @ jans-core-cdi ---
[INFO] Installing /home/jenkins/.jenkins/jobs/_jans-core_master/workspace/cdi/target/jans-core-cdi-5.0.0-SNAPSHOT.jar to /var/www/html/maven/io/jans/jans-core-cdi/5.0.0-SNAPSHOT/jans-core-cdi-5.0.0-SNAPSHOT.jar
[INFO] Installing /home/jenkins/.jenkins/jobs/_jans-core_master/workspace/cdi/pom.xml to /var/www/html/maven/io/jans/jans-core-cdi/5.0.0-SNAPSHOT/jans-core-cdi-5.0.0-SNAPSHOT.pom
[INFO]                                                                         
[INFO] ------------------------------------------------------------------------
[INFO] Building jans-core-script 5.0.0-SNAPSHOT
[INFO] ------------------------------------------------------------------------
[INFO] 
[INFO] --- maven-clean-plugin:2.4.1:clean (default-clean) @ jans-core-script ---
[INFO] Deleting /home/jenkins/.jenkins/jobs/_jans-core_master/workspace/script/target
[INFO] 
[INFO] --- maven-resources-plugin:2.4:resources (default-resources) @ jans-core-script ---
[INFO] Using 'UTF-8' encoding to copy filtered resources.
[INFO] Copying 1 resource
[INFO] 
[INFO] --- maven-compiler-plugin:2.3.2:compile (default-compile) @ jans-core-script ---
[INFO] Compiling 59 source files to /home/jenkins/.jenkins/jobs/_jans-core_master/workspace/script/target/classes
[INFO] 
[INFO] --- maven-resources-plugin:2.4:resources (default-resources) @ jans-core-script ---
[INFO] Using 'UTF-8' encoding to copy filtered resources.
[INFO] Copying 1 resource
[INFO] 
[INFO] --- maven-compiler-plugin:2.3.2:compile (default-compile) @ jans-core-script ---
[INFO] Nothing to compile - all classes are up to date
[INFO] 
[INFO] --- maven-resources-plugin:2.4:testResources (default-testResources) @ jans-core-script ---
[INFO] Using 'UTF-8' encoding to copy filtered resources.
[INFO] skip non existing resourceDirectory /home/jenkins/.jenkins/jobs/_jans-core_master/workspace/script/src/test/resources
[INFO] 
[INFO] --- maven-compiler-plugin:2.3.2:testCompile (default-testCompile) @ jans-core-script ---
[INFO] Compiling 2 source files to /home/jenkins/.jenkins/jobs/_jans-core_master/workspace/script/target/test-classes
[INFO] 
[INFO] --- maven-surefire-plugin:2.7.2:test (default-test) @ jans-core-script ---
[INFO] Surefire report directory: /home/jenkins/.jenkins/jobs/_jans-core_master/workspace/script/target/surefire-reports

-------------------------------------------------------
 T E S T S
-------------------------------------------------------
Running io.jans.service.custom.script.test.StandaloneCustomScriptManagerTest
Tests run: 0, Failures: 0, Errors: 0, Skipped: 0, Time elapsed: 0.005 sec
There are no tests to run.

Results :

Tests run: 0, Failures: 0, Errors: 0, Skipped: 0

[INFO] 
[INFO] --- maven-jar-plugin:2.4:jar (default-jar) @ jans-core-script ---
[INFO] Building jar: /home/jenkins/.jenkins/jobs/_jans-core_master/workspace/script/target/jans-core-script-5.0.0-SNAPSHOT.jar
[INFO] 
[INFO] --- maven-install-plugin:2.3.1:install (default-install) @ jans-core-script ---
[INFO] Installing /home/jenkins/.jenkins/jobs/_jans-core_master/workspace/script/target/jans-core-script-5.0.0-SNAPSHOT.jar to /var/www/html/maven/io/jans/jans-core-script/5.0.0-SNAPSHOT/jans-core-script-5.0.0-SNAPSHOT.jar
[INFO] Installing /home/jenkins/.jenkins/jobs/_jans-core_master/workspace/script/pom.xml to /var/www/html/maven/io/jans/jans-core-script/5.0.0-SNAPSHOT/jans-core-script-5.0.0-SNAPSHOT.pom
[INFO]                                                                         
[INFO] ------------------------------------------------------------------------
[INFO] Building jans-core-service 5.0.0-SNAPSHOT
[INFO] ------------------------------------------------------------------------
[INFO] 
[INFO] --- maven-clean-plugin:2.4.1:clean (default-clean) @ jans-core-service ---
[INFO] Deleting /home/jenkins/.jenkins/jobs/_jans-core_master/workspace/service/target
[INFO] 
[INFO] --- maven-resources-plugin:2.4:resources (default-resources) @ jans-core-service ---
[INFO] Using 'UTF-8' encoding to copy filtered resources.
[INFO] Copying 1 resource
[INFO] 
[INFO] --- maven-compiler-plugin:2.3.2:compile (default-compile) @ jans-core-service ---
[INFO] Compiling 85 source files to /home/jenkins/.jenkins/jobs/_jans-core_master/workspace/service/target/classes
[INFO] -------------------------------------------------------------
[ERROR] COMPILATION ERROR : 
[INFO] -------------------------------------------------------------
[ERROR] /home/jenkins/.jenkins/jobs/_jans-core_master/workspace/service/src/main/java/io/jans/config/oxtrust/ImportPersonConfig.java:[7,30] error: ';' expected
[ERROR] /home/jenkins/.jenkins/jobs/_jans-core_master/workspace/service/src/main/java/io/jans/config/oxtrust/LdapOxAuthConfiguration.java:[7,30] error: ';' expected
[ERROR] /home/jenkins/.jenkins/jobs/_jans-core_master/workspace/service/src/main/java/io/jans/config/oxtrust/ScimProperties.java:[7,30] error: ';' expected
[ERROR] /home/jenkins/.jenkins/jobs/_jans-core_master/workspace/service/src/main/java/io/jans/config/oxtrust/ImportPerson.java:[7,30] error: ';' expected
[ERROR] /home/jenkins/.jenkins/jobs/_jans-core_master/workspace/service/src/main/java/io/jans/config/oxtrust/AttributeResolverConfiguration.java:[7,30] error: ';' expected
[ERROR] /home/jenkins/.jenkins/jobs/_jans-core_master/workspace/service/src/main/java/io/jans/config/oxtrust/ShibbolethCASProtocolConfiguration.java:[7,30] error: ';' expected
[ERROR] /home/jenkins/.jenkins/jobs/_jans-core_master/workspace/service/src/main/java/io/jans/config/oxtrust/DbApplicationConfiguration.java:[7,30] error: ';' expected
[ERROR] /home/jenkins/.jenkins/jobs/_jans-core_master/workspace/service/src/main/java/io/jans/config/oxtrust/AsimbaConfiguration.java:[7,30] error: ';' expected
[ERROR] /home/jenkins/.jenkins/jobs/_jans-core_master/workspace/service/src/main/java/io/jans/config/oxtrust/LdapOxAsimbaConfiguration.java:[7,30] error: ';' expected
[ERROR] /home/jenkins/.jenkins/jobs/_jans-core_master/workspace/service/src/main/java/io/jans/config/oxtrust/Configuration.java:[7,30] error: ';' expected
[ERROR] /home/jenkins/.jenkins/jobs/_jans-core_master/workspace/service/src/main/java/io/jans/config/oxtrust/CacheRefreshAttributeMapping.java:[7,30] error: ';' expected
[ERROR] /home/jenkins/.jenkins/jobs/_jans-core_master/workspace/service/src/main/java/io/jans/config/oxtrust/LdapOxPassportConfiguration.java:[7,30] error: ';' expected
[ERROR] /home/jenkins/.jenkins/jobs/_jans-core_master/workspace/service/src/main/java/io/jans/config/oxtrust/NameIdConfig.java:[7,30] error: ';' expected
[ERROR] /home/jenkins/.jenkins/jobs/_jans-core_master/workspace/service/src/main/java/io/jans/config/oxtrust/CacheRefreshConfiguration.java:[7,30] error: ';' expected
[ERROR] /home/jenkins/.jenkins/jobs/_jans-core_master/workspace/service/src/main/java/io/jans/config/oxtrust/LdapShibbolethCASProtocolConfiguration.java:[7,30] error: ';' expected
[ERROR] /home/jenkins/.jenkins/jobs/_jans-core_master/workspace/service/src/main/java/io/jans/config/oxtrust/AppConfiguration.java:[7,30] error: ';' expected
[ERROR] /home/jenkins/.jenkins/jobs/_jans-core_master/workspace/service/src/main/java/io/jans/config/oxtrust/AppConfiguration.java:[130,27] error: ';' expected
[ERROR] /home/jenkins/.jenkins/jobs/_jans-core_master/workspace/service/src/main/java/io/jans/config/oxtrust/AppConfiguration.java:[130,46] error: <identifier> expected
[ERROR] /home/jenkins/.jenkins/jobs/_jans-core_master/workspace/service/src/main/java/io/jans/config/oxtrust/AppConfiguration.java:[667,28] error: ';' expected
[ERROR] /home/jenkins/.jenkins/jobs/_jans-core_master/workspace/service/src/main/java/io/jans/config/oxtrust/AppConfiguration.java:[667,29] error: invalid method declaration; return type required
[ERROR] /home/jenkins/.jenkins/jobs/_jans-core_master/workspace/service/src/main/java/io/jans/config/oxtrust/AppConfiguration.java:[668,22] error: ';' expected
[ERROR] /home/jenkins/.jenkins/jobs/_jans-core_master/workspace/service/src/main/java/io/jans/config/oxtrust/AppConfiguration.java:[668,23] error: not a statement
[ERROR] /home/jenkins/.jenkins/jobs/_jans-core_master/workspace/service/src/main/java/io/jans/config/oxtrust/AppConfiguration.java:[671,27] error: '(' expected
[ERROR] /home/jenkins/.jenkins/jobs/_jans-core_master/workspace/service/src/main/java/io/jans/config/oxtrust/AppConfiguration.java:[671,61] error: ')' expected
[ERROR] /home/jenkins/.jenkins/jobs/_jans-core_master/workspace/service/src/main/java/io/jans/config/oxtrust/AppConfiguration.java:[671,80] error: illegal start of type
[ERROR] /home/jenkins/.jenkins/jobs/_jans-core_master/workspace/service/src/main/java/io/jans/config/oxtrust/AppConfiguration.java:[671,81] error: <identifier> expected
[ERROR] /home/jenkins/.jenkins/jobs/_jans-core_master/workspace/service/src/main/java/io/jans/config/oxtrust/AppConfiguration.java:[671,83] error: ';' expected
[ERROR] /home/jenkins/.jenkins/jobs/_jans-core_master/workspace/service/src/main/java/io/jans/config/oxtrust/AppConfiguration.java:[672,12] error: illegal start of type
[ERROR] /home/jenkins/.jenkins/jobs/_jans-core_master/workspace/service/src/main/java/io/jans/config/oxtrust/AppConfiguration.java:[672,20] error: ';' expected
[ERROR] /home/jenkins/.jenkins/jobs/_jans-core_master/workspace/service/src/main/java/io/jans/config/oxtrust/AppConfiguration.java:[672,39] error: <identifier> expected
[ERROR] /home/jenkins/.jenkins/jobs/_jans-core_master/workspace/service/src/main/java/io/jans/config/oxtrust/AppConfiguration.java:[672,49] error: ';' expected
[ERROR] /home/jenkins/.jenkins/jobs/_jans-core_master/workspace/service/src/main/java/io/jans/config/oxtrust/AppConfiguration.java:[672,68] error: <identifier> expected
[ERROR] /home/jenkins/.jenkins/jobs/_jans-core_master/workspace/service/src/main/java/io/jans/config/oxtrust/AppConfiguration.java:[675,11] error: class, interface, or enum expected
[ERROR] /home/jenkins/.jenkins/jobs/_jans-core_master/workspace/service/src/main/java/io/jans/config/oxtrust/AppConfiguration.java:[677,4] error: class, interface, or enum expected
[ERROR] /home/jenkins/.jenkins/jobs/_jans-core_master/workspace/service/src/main/java/io/jans/config/oxtrust/AppConfiguration.java:[679,11] error: class, interface, or enum expected
[ERROR] /home/jenkins/.jenkins/jobs/_jans-core_master/workspace/service/src/main/java/io/jans/config/oxtrust/AppConfiguration.java:[681,4] error: class, interface, or enum expected
[ERROR] /home/jenkins/.jenkins/jobs/_jans-core_master/workspace/service/src/main/java/io/jans/config/oxtrust/AppConfiguration.java:[683,11] error: class, interface, or enum expected
[ERROR] /home/jenkins/.jenkins/jobs/_jans-core_master/workspace/service/src/main/java/io/jans/config/oxtrust/AppConfiguration.java:[685,4] error: class, interface, or enum expected
[ERROR] /home/jenkins/.jenkins/jobs/_jans-core_master/workspace/service/src/main/java/io/jans/config/oxtrust/AppConfiguration.java:[687,11] error: class, interface, or enum expected
[ERROR] /home/jenkins/.jenkins/jobs/_jans-core_master/workspace/service/src/main/java/io/jans/config/oxtrust/AppConfiguration.java:[689,4] error: class, interface, or enum expected
[ERROR] /home/jenkins/.jenkins/jobs/_jans-core_master/workspace/service/src/main/java/io/jans/config/oxtrust/AppConfiguration.java:[691,11] error: class, interface, or enum expected
[ERROR] /home/jenkins/.jenkins/jobs/_jans-core_master/workspace/service/src/main/java/io/jans/config/oxtrust/AppConfiguration.java:[693,4] error: class, interface, or enum expected
[ERROR] /home/jenkins/.jenkins/jobs/_jans-core_master/workspace/service/src/main/java/io/jans/config/oxtrust/AppConfiguration.java:[695,11] error: class, interface, or enum expected
[ERROR] /home/jenkins/.jenkins/jobs/_jans-core_master/workspace/service/src/main/java/io/jans/config/oxtrust/AppConfiguration.java:[697,4] error: class, interface, or enum expected
[ERROR] /home/jenkins/.jenkins/jobs/_jans-core_master/workspace/service/src/main/java/io/jans/config/oxtrust/AppConfiguration.java:[699,11] error: class, interface, or enum expected
[ERROR] /home/jenkins/.jenkins/jobs/_jans-core_master/workspace/service/src/main/java/io/jans/config/oxtrust/AppConfiguration.java:[701,4] error: class, interface, or enum expected
[ERROR] /home/jenkins/.jenkins/jobs/_jans-core_master/workspace/service/src/main/java/io/jans/config/oxtrust/AppConfiguration.java:[703,11] error: class, interface, or enum expected
[ERROR] /home/jenkins/.jenkins/jobs/_jans-core_master/workspace/service/src/main/java/io/jans/config/oxtrust/AppConfiguration.java:[705,4] error: class, interface, or enum expected
[ERROR] /home/jenkins/.jenkins/jobs/_jans-core_master/workspace/service/src/main/java/io/jans/config/oxtrust/AppConfiguration.java:[707,11] error: class, interface, or enum expected
[ERROR] /home/jenkins/.jenkins/jobs/_jans-core_master/workspace/service/src/main/java/io/jans/config/oxtrust/AppConfiguration.java:[709,4] error: class, interface, or enum expected
[ERROR] /home/jenkins/.jenkins/jobs/_jans-core_master/workspace/service/src/main/java/io/jans/config/oxtrust/AppConfiguration.java:[711,11] error: class, interface, or enum expected
[ERROR] /home/jenkins/.jenkins/jobs/_jans-core_master/workspace/service/src/main/java/io/jans/config/oxtrust/AppConfiguration.java:[713,4] error: class, interface, or enum expected
[ERROR] /home/jenkins/.jenkins/jobs/_jans-core_master/workspace/service/src/main/java/io/jans/config/oxtrust/AppConfiguration.java:[715,11] error: class, interface, or enum expected
[ERROR] /home/jenkins/.jenkins/jobs/_jans-core_master/workspace/service/src/main/java/io/jans/config/oxtrust/AppConfiguration.java:[717,4] error: class, interface, or enum expected
[ERROR] /home/jenkins/.jenkins/jobs/_jans-core_master/workspace/service/src/main/java/io/jans/config/oxtrust/AppConfiguration.java:[719,11] error: class, interface, or enum expected
[ERROR] /home/jenkins/.jenkins/jobs/_jans-core_master/workspace/service/src/main/java/io/jans/config/oxtrust/AppConfiguration.java:[721,4] error: class, interface, or enum expected
[ERROR] /home/jenkins/.jenkins/jobs/_jans-core_master/workspace/service/src/main/java/io/jans/config/oxtrust/AppConfiguration.java:[723,11] error: class, interface, or enum expected
[ERROR] /home/jenkins/.jenkins/jobs/_jans-core_master/workspace/service/src/main/java/io/jans/config/oxtrust/AppConfiguration.java:[725,4] error: class, interface, or enum expected
[ERROR] /home/jenkins/.jenkins/jobs/_jans-core_master/workspace/service/src/main/java/io/jans/config/oxtrust/AppConfiguration.java:[727,11] error: class, interface, or enum expected
[ERROR] /home/jenkins/.jenkins/jobs/_jans-core_master/workspace/service/src/main/java/io/jans/config/oxtrust/AppConfiguration.java:[729,4] error: class, interface, or enum expected
[ERROR] /home/jenkins/.jenkins/jobs/_jans-core_master/workspace/service/src/main/java/io/jans/config/oxtrust/AppConfiguration.java:[731,11] error: class, interface, or enum expected
[ERROR] /home/jenkins/.jenkins/jobs/_jans-core_master/workspace/service/src/main/java/io/jans/config/oxtrust/AppConfiguration.java:[733,4] error: class, interface, or enum expected
[ERROR] /home/jenkins/.jenkins/jobs/_jans-core_master/workspace/service/src/main/java/io/jans/config/oxtrust/AppConfiguration.java:[735,11] error: class, interface, or enum expected
[ERROR] /home/jenkins/.jenkins/jobs/_jans-core_master/workspace/service/src/main/java/io/jans/config/oxtrust/AppConfiguration.java:[737,4] error: class, interface, or enum expected
[ERROR] /home/jenkins/.jenkins/jobs/_jans-core_master/workspace/service/src/main/java/io/jans/config/oxtrust/AppConfiguration.java:[739,11] error: class, interface, or enum expected
[ERROR] /home/jenkins/.jenkins/jobs/_jans-core_master/workspace/service/src/main/java/io/jans/config/oxtrust/AppConfiguration.java:[741,4] error: class, interface, or enum expected
[ERROR] /home/jenkins/.jenkins/jobs/_jans-core_master/workspace/service/src/main/java/io/jans/config/oxtrust/AppConfiguration.java:[743,11] error: class, interface, or enum expected
[ERROR] /home/jenkins/.jenkins/jobs/_jans-core_master/workspace/service/src/main/java/io/jans/config/oxtrust/AppConfiguration.java:[745,4] error: class, interface, or enum expected
[ERROR] /home/jenkins/.jenkins/jobs/_jans-core_master/workspace/service/src/main/java/io/jans/config/oxtrust/AppConfiguration.java:[747,11] error: class, interface, or enum expected
[ERROR] /home/jenkins/.jenkins/jobs/_jans-core_master/workspace/service/src/main/java/io/jans/config/oxtrust/AppConfiguration.java:[749,4] error: class, interface, or enum expected
[ERROR] /home/jenkins/.jenkins/jobs/_jans-core_master/workspace/service/src/main/java/io/jans/config/oxtrust/AppConfiguration.java:[751,11] error: class, interface, or enum expected
[ERROR] /home/jenkins/.jenkins/jobs/_jans-core_master/workspace/service/src/main/java/io/jans/config/oxtrust/AppConfiguration.java:[753,4] error: class, interface, or enum expected
[ERROR] /home/jenkins/.jenkins/jobs/_jans-core_master/workspace/service/src/main/java/io/jans/config/oxtrust/AppConfiguration.java:[755,11] error: class, interface, or enum expected
[ERROR] /home/jenkins/.jenkins/jobs/_jans-core_master/workspace/service/src/main/java/io/jans/config/oxtrust/AppConfiguration.java:[757,4] error: class, interface, or enum expected
[ERROR] /home/jenkins/.jenkins/jobs/_jans-core_master/workspace/service/src/main/java/io/jans/config/oxtrust/AppConfiguration.java:[759,11] error: class, interface, or enum expected
[ERROR] /home/jenkins/.jenkins/jobs/_jans-core_master/workspace/service/src/main/java/io/jans/config/oxtrust/AppConfiguration.java:[761,4] error: class, interface, or enum expected
[ERROR] /home/jenkins/.jenkins/jobs/_jans-core_master/workspace/service/src/main/java/io/jans/config/oxtrust/AppConfiguration.java:[763,11] error: class, interface, or enum expected
[ERROR] /home/jenkins/.jenkins/jobs/_jans-core_master/workspace/service/src/main/java/io/jans/config/oxtrust/AppConfiguration.java:[765,4] error: class, interface, or enum expected
[ERROR] /home/jenkins/.jenkins/jobs/_jans-core_master/workspace/service/src/main/java/io/jans/config/oxtrust/AppConfiguration.java:[767,11] error: class, interface, or enum expected
[ERROR] /home/jenkins/.jenkins/jobs/_jans-core_master/workspace/service/src/main/java/io/jans/config/oxtrust/AppConfiguration.java:[769,4] error: class, interface, or enum expected
[ERROR] /home/jenkins/.jenkins/jobs/_jans-core_master/workspace/service/src/main/java/io/jans/config/oxtrust/AppConfiguration.java:[771,11] error: class, interface, or enum expected
[ERROR] /home/jenkins/.jenkins/jobs/_jans-core_master/workspace/service/src/main/java/io/jans/config/oxtrust/AppConfiguration.java:[773,4] error: class, interface, or enum expected
[ERROR] /home/jenkins/.jenkins/jobs/_jans-core_master/workspace/service/src/main/java/io/jans/config/oxtrust/AppConfiguration.java:[775,11] error: class, interface, or enum expected
[ERROR] /home/jenkins/.jenkins/jobs/_jans-core_master/workspace/service/src/main/java/io/jans/config/oxtrust/AppConfiguration.java:[777,4] error: class, interface, or enum expected
[ERROR] /home/jenkins/.jenkins/jobs/_jans-core_master/workspace/service/src/main/java/io/jans/config/oxtrust/AppConfiguration.java:[779,11] error: class, interface, or enum expected
[ERROR] /home/jenkins/.jenkins/jobs/_jans-core_master/workspace/service/src/main/java/io/jans/config/oxtrust/AppConfiguration.java:[781,4] error: class, interface, or enum expected
[ERROR] /home/jenkins/.jenkins/jobs/_jans-core_master/workspace/service/src/main/java/io/jans/config/oxtrust/AppConfiguration.java:[783,11] error: class, interface, or enum expected
[ERROR] /home/jenkins/.jenkins/jobs/_jans-core_master/workspace/service/src/main/java/io/jans/config/oxtrust/AppConfiguration.java:[785,4] error: class, interface, or enum expected
[ERROR] /home/jenkins/.jenkins/jobs/_jans-core_master/workspace/service/src/main/java/io/jans/config/oxtrust/AppConfiguration.java:[787,11] error: class, interface, or enum expected
[ERROR] /home/jenkins/.jenkins/jobs/_jans-core_master/workspace/service/src/main/java/io/jans/config/oxtrust/AppConfiguration.java:[789,4] error: class, interface, or enum expected
[ERROR] /home/jenkins/.jenkins/jobs/_jans-core_master/workspace/service/src/main/java/io/jans/config/oxtrust/AppConfiguration.java:[791,11] error: class, interface, or enum expected
[ERROR] /home/jenkins/.jenkins/jobs/_jans-core_master/workspace/service/src/main/java/io/jans/config/oxtrust/AppConfiguration.java:[793,4] error: class, interface, or enum expected
[ERROR] /home/jenkins/.jenkins/jobs/_jans-core_master/workspace/service/src/main/java/io/jans/config/oxtrust/AppConfiguration.java:[795,11] error: class, interface, or enum expected
[ERROR] /home/jenkins/.jenkins/jobs/_jans-core_master/workspace/service/src/main/java/io/jans/config/oxtrust/AppConfiguration.java:[797,4] error: class, interface, or enum expected
[ERROR] /home/jenkins/.jenkins/jobs/_jans-core_master/workspace/service/src/main/java/io/jans/config/oxtrust/AppConfiguration.java:[799,11] error: class, interface, or enum expected
[ERROR] /home/jenkins/.jenkins/jobs/_jans-core_master/workspace/service/src/main/java/io/jans/config/oxtrust/AppConfiguration.java:[801,4] error: class, interface, or enum expected
[ERROR] /home/jenkins/.jenkins/jobs/_jans-core_master/workspace/service/src/main/java/io/jans/config/oxtrust/AppConfiguration.java:[803,11] error: class, interface, or enum expected
[ERROR] /home/jenkins/.jenkins/jobs/_jans-core_master/workspace/service/src/main/java/io/jans/config/oxtrust/AppConfiguration.java:[805,4] error: class, interface, or enum expected
[ERROR] /home/jenkins/.jenkins/jobs/_jans-core_master/workspace/service/src/main/java/io/jans/config/oxtrust/AppConfiguration.java:[807,11] error: class, interface, or enum expected
[ERROR] /home/jenkins/.jenkins/jobs/_jans-core_master/workspace/service/src/main/java/io/jans/config/oxtrust/AppConfiguration.java:[809,4] error: class, interface, or enum expected
[INFO] 100 errors 
[INFO] -------------------------------------------------------------
[INFO] ------------------------------------------------------------------------
[INFO] Reactor Summary:
[INFO] 
[INFO] jans-core .......................................... SUCCESS [  0.264 s]
[INFO] jans-core-util ..................................... SUCCESS [  3.917 s]
[INFO] jans-core-model .................................... SUCCESS [  1.287 s]
[INFO] Caches support ..................................... SUCCESS [  2.180 s]
[INFO] Caches support ..................................... SUCCESS [  2.405 s]
[INFO] Configuration factories for standalone applications  SUCCESS [  1.283 s]
[INFO] jans-core-saml ..................................... SUCCESS [  1.981 s]
[INFO] jans-core-cdi ...................................... SUCCESS [  0.698 s]
[INFO] jans-core-script ................................... SUCCESS [  3.393 s]
[INFO] jans-core-service .................................. FAILURE [  0.563 s]
[INFO] jans-core-jsf-util ................................. SKIPPED
[INFO] Java extensions .................................... SKIPPED
[INFO] Weld CDI timer implementation ...................... SKIPPED
[INFO] security-extension-cdi ............................. SKIPPED
[INFO] exception-extension-cdi ............................ SKIPPED
[INFO] Web application specific classes ................... SKIPPED
[INFO] jans-core-radius ................................... SKIPPED
[INFO] Demo CDI services .................................. SKIPPED
[INFO] ------------------------------------------------------------------------
[INFO] BUILD FAILURE
[INFO] ------------------------------------------------------------------------
[INFO] Total time: 18.962 s
[INFO] Finished at: 2020-10-13T18:19:28+00:00
[INFO] Final Memory: 112M/907M
[INFO] ------------------------------------------------------------------------
[ERROR] Failed to execute goal org.apache.maven.plugins:maven-compiler-plugin:2.3.2:compile (default-compile) on project jans-core-service: Compilation failure: Compilation failure:
[ERROR] /home/jenkins/.jenkins/jobs/_jans-core_master/workspace/service/src/main/java/io/jans/config/oxtrust/ImportPersonConfig.java:[7,30] error: ';' expected
[ERROR] /home/jenkins/.jenkins/jobs/_jans-core_master/workspace/service/src/main/java/io/jans/config/oxtrust/LdapOxAuthConfiguration.java:[7,30] error: ';' expected
[ERROR] /home/jenkins/.jenkins/jobs/_jans-core_master/workspace/service/src/main/java/io/jans/config/oxtrust/ScimProperties.java:[7,30] error: ';' expected
[ERROR] /home/jenkins/.jenkins/jobs/_jans-core_master/workspace/service/src/main/java/io/jans/config/oxtrust/ImportPerson.java:[7,30] error: ';' expected
[ERROR] /home/jenkins/.jenkins/jobs/_jans-core_master/workspace/service/src/main/java/io/jans/config/oxtrust/AttributeResolverConfiguration.java:[7,30] error: ';' expected
[ERROR] /home/jenkins/.jenkins/jobs/_jans-core_master/workspace/service/src/main/java/io/jans/config/oxtrust/ShibbolethCASProtocolConfiguration.java:[7,30] error: ';' expected
[ERROR] /home/jenkins/.jenkins/jobs/_jans-core_master/workspace/service/src/main/java/io/jans/config/oxtrust/DbApplicationConfiguration.java:[7,30] error: ';' expected
[ERROR] /home/jenkins/.jenkins/jobs/_jans-core_master/workspace/service/src/main/java/io/jans/config/oxtrust/AsimbaConfiguration.java:[7,30] error: ';' expected
[ERROR] /home/jenkins/.jenkins/jobs/_jans-core_master/workspace/service/src/main/java/io/jans/config/oxtrust/LdapOxAsimbaConfiguration.java:[7,30] error: ';' expected
[ERROR] /home/jenkins/.jenkins/jobs/_jans-core_master/workspace/service/src/main/java/io/jans/config/oxtrust/Configuration.java:[7,30] error: ';' expected
[ERROR] /home/jenkins/.jenkins/jobs/_jans-core_master/workspace/service/src/main/java/io/jans/config/oxtrust/CacheRefreshAttributeMapping.java:[7,30] error: ';' expected
[ERROR] /home/jenkins/.jenkins/jobs/_jans-core_master/workspace/service/src/main/java/io/jans/config/oxtrust/LdapOxPassportConfiguration.java:[7,30] error: ';' expected
[ERROR] /home/jenkins/.jenkins/jobs/_jans-core_master/workspace/service/src/main/java/io/jans/config/oxtrust/NameIdConfig.java:[7,30] error: ';' expected
[ERROR] /home/jenkins/.jenkins/jobs/_jans-core_master/workspace/service/src/main/java/io/jans/config/oxtrust/CacheRefreshConfiguration.java:[7,30] error: ';' expected
[ERROR] /home/jenkins/.jenkins/jobs/_jans-core_master/workspace/service/src/main/java/io/jans/config/oxtrust/LdapShibbolethCASProtocolConfiguration.java:[7,30] error: ';' expected
[ERROR] /home/jenkins/.jenkins/jobs/_jans-core_master/workspace/service/src/main/java/io/jans/config/oxtrust/AppConfiguration.java:[7,30] error: ';' expected
[ERROR] /home/jenkins/.jenkins/jobs/_jans-core_master/workspace/service/src/main/java/io/jans/config/oxtrust/AppConfiguration.java:[130,27] error: ';' expected
[ERROR] /home/jenkins/.jenkins/jobs/_jans-core_master/workspace/service/src/main/java/io/jans/config/oxtrust/AppConfiguration.java:[130,46] error: <identifier> expected
[ERROR] /home/jenkins/.jenkins/jobs/_jans-core_master/workspace/service/src/main/java/io/jans/config/oxtrust/AppConfiguration.java:[667,28] error: ';' expected
[ERROR] /home/jenkins/.jenkins/jobs/_jans-core_master/workspace/service/src/main/java/io/jans/config/oxtrust/AppConfiguration.java:[667,29] error: invalid method declaration; return type required
[ERROR] /home/jenkins/.jenkins/jobs/_jans-core_master/workspace/service/src/main/java/io/jans/config/oxtrust/AppConfiguration.java:[668,22] error: ';' expected
[ERROR] /home/jenkins/.jenkins/jobs/_jans-core_master/workspace/service/src/main/java/io/jans/config/oxtrust/AppConfiguration.java:[668,23] error: not a statement
[ERROR] /home/jenkins/.jenkins/jobs/_jans-core_master/workspace/service/src/main/java/io/jans/config/oxtrust/AppConfiguration.java:[671,27] error: '(' expected
[ERROR] /home/jenkins/.jenkins/jobs/_jans-core_master/workspace/service/src/main/java/io/jans/config/oxtrust/AppConfiguration.java:[671,61] error: ')' expected
[ERROR] /home/jenkins/.jenkins/jobs/_jans-core_master/workspace/service/src/main/java/io/jans/config/oxtrust/AppConfiguration.java:[671,80] error: illegal start of type
[ERROR] /home/jenkins/.jenkins/jobs/_jans-core_master/workspace/service/src/main/java/io/jans/config/oxtrust/AppConfiguration.java:[671,81] error: <identifier> expected
[ERROR] /home/jenkins/.jenkins/jobs/_jans-core_master/workspace/service/src/main/java/io/jans/config/oxtrust/AppConfiguration.java:[671,83] error: ';' expected
[ERROR] /home/jenkins/.jenkins/jobs/_jans-core_master/workspace/service/src/main/java/io/jans/config/oxtrust/AppConfiguration.java:[672,12] error: illegal start of type
[ERROR] /home/jenkins/.jenkins/jobs/_jans-core_master/workspace/service/src/main/java/io/jans/config/oxtrust/AppConfiguration.java:[672,20] error: ';' expected
[ERROR] /home/jenkins/.jenkins/jobs/_jans-core_master/workspace/service/src/main/java/io/jans/config/oxtrust/AppConfiguration.java:[672,39] error: <identifier> expected
[ERROR] /home/jenkins/.jenkins/jobs/_jans-core_master/workspace/service/src/main/java/io/jans/config/oxtrust/AppConfiguration.java:[672,49] error: ';' expected
[ERROR] /home/jenkins/.jenkins/jobs/_jans-core_master/workspace/service/src/main/java/io/jans/config/oxtrust/AppConfiguration.java:[672,68] error: <identifier> expected
[ERROR] /home/jenkins/.jenkins/jobs/_jans-core_master/workspace/service/src/main/java/io/jans/config/oxtrust/AppConfiguration.java:[675,11] error: class, interface, or enum expected
[ERROR] /home/jenkins/.jenkins/jobs/_jans-core_master/workspace/service/src/main/java/io/jans/config/oxtrust/AppConfiguration.java:[677,4] error: class, interface, or enum expected
[ERROR] /home/jenkins/.jenkins/jobs/_jans-core_master/workspace/service/src/main/java/io/jans/config/oxtrust/AppConfiguration.java:[679,11] error: class, interface, or enum expected
[ERROR] /home/jenkins/.jenkins/jobs/_jans-core_master/workspace/service/src/main/java/io/jans/config/oxtrust/AppConfiguration.java:[681,4] error: class, interface, or enum expected
[ERROR] /home/jenkins/.jenkins/jobs/_jans-core_master/workspace/service/src/main/java/io/jans/config/oxtrust/AppConfiguration.java:[683,11] error: class, interface, or enum expected
[ERROR] /home/jenkins/.jenkins/jobs/_jans-core_master/workspace/service/src/main/java/io/jans/config/oxtrust/AppConfiguration.java:[685,4] error: class, interface, or enum expected
[ERROR] /home/jenkins/.jenkins/jobs/_jans-core_master/workspace/service/src/main/java/io/jans/config/oxtrust/AppConfiguration.java:[687,11] error: class, interface, or enum expected
[ERROR] /home/jenkins/.jenkins/jobs/_jans-core_master/workspace/service/src/main/java/io/jans/config/oxtrust/AppConfiguration.java:[689,4] error: class, interface, or enum expected
[ERROR] /home/jenkins/.jenkins/jobs/_jans-core_master/workspace/service/src/main/java/io/jans/config/oxtrust/AppConfiguration.java:[691,11] error: class, interface, or enum expected
[ERROR] /home/jenkins/.jenkins/jobs/_jans-core_master/workspace/service/src/main/java/io/jans/config/oxtrust/AppConfiguration.java:[693,4] error: class, interface, or enum expected
[ERROR] /home/jenkins/.jenkins/jobs/_jans-core_master/workspace/service/src/main/java/io/jans/config/oxtrust/AppConfiguration.java:[695,11] error: class, interface, or enum expected
[ERROR] /home/jenkins/.jenkins/jobs/_jans-core_master/workspace/service/src/main/java/io/jans/config/oxtrust/AppConfiguration.java:[697,4] error: class, interface, or enum expected
[ERROR] /home/jenkins/.jenkins/jobs/_jans-core_master/workspace/service/src/main/java/io/jans/config/oxtrust/AppConfiguration.java:[699,11] error: class, interface, or enum expected
[ERROR] /home/jenkins/.jenkins/jobs/_jans-core_master/workspace/service/src/main/java/io/jans/config/oxtrust/AppConfiguration.java:[701,4] error: class, interface, or enum expected
[ERROR] /home/jenkins/.jenkins/jobs/_jans-core_master/workspace/service/src/main/java/io/jans/config/oxtrust/AppConfiguration.java:[703,11] error: class, interface, or enum expected
[ERROR] /home/jenkins/.jenkins/jobs/_jans-core_master/workspace/service/src/main/java/io/jans/config/oxtrust/AppConfiguration.java:[705,4] error: class, interface, or enum expected
[ERROR] /home/jenkins/.jenkins/jobs/_jans-core_master/workspace/service/src/main/java/io/jans/config/oxtrust/AppConfiguration.java:[707,11] error: class, interface, or enum expected
[ERROR] /home/jenkins/.jenkins/jobs/_jans-core_master/workspace/service/src/main/java/io/jans/config/oxtrust/AppConfiguration.java:[709,4] error: class, interface, or enum expected
[ERROR] /home/jenkins/.jenkins/jobs/_jans-core_master/workspace/service/src/main/java/io/jans/config/oxtrust/AppConfiguration.java:[711,11] error: class, interface, or enum expected
[ERROR] /home/jenkins/.jenkins/jobs/_jans-core_master/workspace/service/src/main/java/io/jans/config/oxtrust/AppConfiguration.java:[713,4] error: class, interface, or enum expected
[ERROR] /home/jenkins/.jenkins/jobs/_jans-core_master/workspace/service/src/main/java/io/jans/config/oxtrust/AppConfiguration.java:[715,11] error: class, interface, or enum expected
[ERROR] /home/jenkins/.jenkins/jobs/_jans-core_master/workspace/service/src/main/java/io/jans/config/oxtrust/AppConfiguration.java:[717,4] error: class, interface, or enum expected
[ERROR] /home/jenkins/.jenkins/jobs/_jans-core_master/workspace/service/src/main/java/io/jans/config/oxtrust/AppConfiguration.java:[719,11] error: class, interface, or enum expected
[ERROR] /home/jenkins/.jenkins/jobs/_jans-core_master/workspace/service/src/main/java/io/jans/config/oxtrust/AppConfiguration.java:[721,4] error: class, interface, or enum expected
[ERROR] /home/jenkins/.jenkins/jobs/_jans-core_master/workspace/service/src/main/java/io/jans/config/oxtrust/AppConfiguration.java:[723,11] error: class, interface, or enum expected
[ERROR] /home/jenkins/.jenkins/jobs/_jans-core_master/workspace/service/src/main/java/io/jans/config/oxtrust/AppConfiguration.java:[725,4] error: class, interface, or enum expected
[ERROR] /home/jenkins/.jenkins/jobs/_jans-core_master/workspace/service/src/main/java/io/jans/config/oxtrust/AppConfiguration.java:[727,11] error: class, interface, or enum expected
[ERROR] /home/jenkins/.jenkins/jobs/_jans-core_master/workspace/service/src/main/java/io/jans/config/oxtrust/AppConfiguration.java:[729,4] error: class, interface, or enum expected
[ERROR] /home/jenkins/.jenkins/jobs/_jans-core_master/workspace/service/src/main/java/io/jans/config/oxtrust/AppConfiguration.java:[731,11] error: class, interface, or enum expected
[ERROR] /home/jenkins/.jenkins/jobs/_jans-core_master/workspace/service/src/main/java/io/jans/config/oxtrust/AppConfiguration.java:[733,4] error: class, interface, or enum expected
[ERROR] /home/jenkins/.jenkins/jobs/_jans-core_master/workspace/service/src/main/java/io/jans/config/oxtrust/AppConfiguration.java:[735,11] error: class, interface, or enum expected
[ERROR] /home/jenkins/.jenkins/jobs/_jans-core_master/workspace/service/src/main/java/io/jans/config/oxtrust/AppConfiguration.java:[737,4] error: class, interface, or enum expected
[ERROR] /home/jenkins/.jenkins/jobs/_jans-core_master/workspace/service/src/main/java/io/jans/config/oxtrust/AppConfiguration.java:[739,11] error: class, interface, or enum expected
[ERROR] /home/jenkins/.jenkins/jobs/_jans-core_master/workspace/service/src/main/java/io/jans/config/oxtrust/AppConfiguration.java:[741,4] error: class, interface, or enum expected
[ERROR] /home/jenkins/.jenkins/jobs/_jans-core_master/workspace/service/src/main/java/io/jans/config/oxtrust/AppConfiguration.java:[743,11] error: class, interface, or enum expected
[ERROR] /home/jenkins/.jenkins/jobs/_jans-core_master/workspace/service/src/main/java/io/jans/config/oxtrust/AppConfiguration.java:[745,4] error: class, interface, or enum expected
[ERROR] /home/jenkins/.jenkins/jobs/_jans-core_master/workspace/service/src/main/java/io/jans/config/oxtrust/AppConfiguration.java:[747,11] error: class, interface, or enum expected
[ERROR] /home/jenkins/.jenkins/jobs/_jans-core_master/workspace/service/src/main/java/io/jans/config/oxtrust/AppConfiguration.java:[749,4] error: class, interface, or enum expected
[ERROR] /home/jenkins/.jenkins/jobs/_jans-core_master/workspace/service/src/main/java/io/jans/config/oxtrust/AppConfiguration.java:[751,11] error: class, interface, or enum expected
[ERROR] /home/jenkins/.jenkins/jobs/_jans-core_master/workspace/service/src/main/java/io/jans/config/oxtrust/AppConfiguration.java:[753,4] error: class, interface, or enum expected
[ERROR] /home/jenkins/.jenkins/jobs/_jans-core_master/workspace/service/src/main/java/io/jans/config/oxtrust/AppConfiguration.java:[755,11] error: class, interface, or enum expected
[ERROR] /home/jenkins/.jenkins/jobs/_jans-core_master/workspace/service/src/main/java/io/jans/config/oxtrust/AppConfiguration.java:[757,4] error: class, interface, or enum expected
[ERROR] /home/jenkins/.jenkins/jobs/_jans-core_master/workspace/service/src/main/java/io/jans/config/oxtrust/AppConfiguration.java:[759,11] error: class, interface, or enum expected
[ERROR] /home/jenkins/.jenkins/jobs/_jans-core_master/workspace/service/src/main/java/io/jans/config/oxtrust/AppConfiguration.java:[761,4] error: class, interface, or enum expected
[ERROR] /home/jenkins/.jenkins/jobs/_jans-core_master/workspace/service/src/main/java/io/jans/config/oxtrust/AppConfiguration.java:[763,11] error: class, interface, or enum expected
[ERROR] /home/jenkins/.jenkins/jobs/_jans-core_master/workspace/service/src/main/java/io/jans/config/oxtrust/AppConfiguration.java:[765,4] error: class, interface, or enum expected
[ERROR] /home/jenkins/.jenkins/jobs/_jans-core_master/workspace/service/src/main/java/io/jans/config/oxtrust/AppConfiguration.java:[767,11] error: class, interface, or enum expected
[ERROR] /home/jenkins/.jenkins/jobs/_jans-core_master/workspace/service/src/main/java/io/jans/config/oxtrust/AppConfiguration.java:[769,4] error: class, interface, or enum expected
[ERROR] /home/jenkins/.jenkins/jobs/_jans-core_master/workspace/service/src/main/java/io/jans/config/oxtrust/AppConfiguration.java:[771,11] error: class, interface, or enum expected
[ERROR] /home/jenkins/.jenkins/jobs/_jans-core_master/workspace/service/src/main/java/io/jans/config/oxtrust/AppConfiguration.java:[773,4] error: class, interface, or enum expected
[ERROR] /home/jenkins/.jenkins/jobs/_jans-core_master/workspace/service/src/main/java/io/jans/config/oxtrust/AppConfiguration.java:[775,11] error: class, interface, or enum expected
[ERROR] /home/jenkins/.jenkins/jobs/_jans-core_master/workspace/service/src/main/java/io/jans/config/oxtrust/AppConfiguration.java:[777,4] error: class, interface, or enum expected
[ERROR] /home/jenkins/.jenkins/jobs/_jans-core_master/workspace/service/src/main/java/io/jans/config/oxtrust/AppConfiguration.java:[779,11] error: class, interface, or enum expected
[ERROR] /home/jenkins/.jenkins/jobs/_jans-core_master/workspace/service/src/main/java/io/jans/config/oxtrust/AppConfiguration.java:[781,4] error: class, interface, or enum expected
[ERROR] /home/jenkins/.jenkins/jobs/_jans-core_master/workspace/service/src/main/java/io/jans/config/oxtrust/AppConfiguration.java:[783,11] error: class, interface, or enum expected
[ERROR] /home/jenkins/.jenkins/jobs/_jans-core_master/workspace/service/src/main/java/io/jans/config/oxtrust/AppConfiguration.java:[785,4] error: class, interface, or enum expected
[ERROR] /home/jenkins/.jenkins/jobs/_jans-core_master/workspace/service/src/main/java/io/jans/config/oxtrust/AppConfiguration.java:[787,11] error: class, interface, or enum expected
[ERROR] /home/jenkins/.jenkins/jobs/_jans-core_master/workspace/service/src/main/java/io/jans/config/oxtrust/AppConfiguration.java:[789,4] error: class, interface, or enum expected
[ERROR] /home/jenkins/.jenkins/jobs/_jans-core_master/workspace/service/src/main/java/io/jans/config/oxtrust/AppConfiguration.java:[791,11] error: class, interface, or enum expected
[ERROR] /home/jenkins/.jenkins/jobs/_jans-core_master/workspace/service/src/main/java/io/jans/config/oxtrust/AppConfiguration.java:[793,4] error: class, interface, or enum expected
[ERROR] /home/jenkins/.jenkins/jobs/_jans-core_master/workspace/service/src/main/java/io/jans/config/oxtrust/AppConfiguration.java:[795,11] error: class, interface, or enum expected
[ERROR] /home/jenkins/.jenkins/jobs/_jans-core_master/workspace/service/src/main/java/io/jans/config/oxtrust/AppConfiguration.java:[797,4] error: class, interface, or enum expected
[ERROR] /home/jenkins/.jenkins/jobs/_jans-core_master/workspace/service/src/main/java/io/jans/config/oxtrust/AppConfiguration.java:[799,11] error: class, interface, or enum expected
[ERROR] /home/jenkins/.jenkins/jobs/_jans-core_master/workspace/service/src/main/java/io/jans/config/oxtrust/AppConfiguration.java:[801,4] error: class, interface, or enum expected
[ERROR] /home/jenkins/.jenkins/jobs/_jans-core_master/workspace/service/src/main/java/io/jans/config/oxtrust/AppConfiguration.java:[803,11] error: class, interface, or enum expected
[ERROR] /home/jenkins/.jenkins/jobs/_jans-core_master/workspace/service/src/main/java/io/jans/config/oxtrust/AppConfiguration.java:[805,4] error: class, interface, or enum expected
[ERROR] /home/jenkins/.jenkins/jobs/_jans-core_master/workspace/service/src/main/java/io/jans/config/oxtrust/AppConfiguration.java:[807,11] error: class, interface, or enum expected
[ERROR] /home/jenkins/.jenkins/jobs/_jans-core_master/workspace/service/src/main/java/io/jans/config/oxtrust/AppConfiguration.java:[809,4] error: class, interface, or enum expected
[ERROR] -> [Help 1]
[ERROR] 
[ERROR] To see the full stack trace of the errors, re-run Maven with the -e switch.
[ERROR] Re-run Maven using the -X switch to enable full debug logging.
[ERROR] 
[ERROR] For more information about the errors and possible solutions, please read the following articles:
[ERROR] [Help 1] http://cwiki.apache.org/confluence/display/MAVEN/MojoFailureException
[ERROR] 
[ERROR] After correcting the problems, you can resume the build with the command
[ERROR]   mvn <goals> -rf :jans-core-service
Build step 'Invoke top-level Maven targets' marked build as failure
[FINDBUGS] Skipping publisher since build result is FAILURE
TestNG Reports Processing: START
Looking for TestNG results report in workspace using pattern: **/testng-results.xml
testng-results.xml was last modified before this build started. Ignoring it.
testng-results.xml was last modified before this build started. Ignoring it.
testng-results.xml was last modified before this build started. Ignoring it.
testng-results.xml was last modified before this build started. Ignoring it.
Saving reports...
Processing '/home/jenkins/.jenkins/jobs/_jans-core_master/builds/35/testng/testng-results.xml'
TestNG Reports Processing: FINISH
Not sending mail to unregistered user Yuriy.Movchan@gmail.com
Sending e-mails to: support@gluu.org
Finished: FAILURE