FailedConsole Output

Started by user Yuriy Movchan
Running as SYSTEM
Building on master in workspace /home/jenkins/.jenkins/jobs/_jans-core_master/workspace
The recommended git tool is: NONE
No credentials specified
 > git rev-parse --is-inside-work-tree # timeout=10
Fetching changes from the remote Git repository
 > git config remote.origin.url https://github.com/JanssenProject/jans-core # timeout=10
Fetching upstream changes from https://github.com/JanssenProject/jans-core
 > git --version # timeout=10
 > git --version # 'git version 1.8.3.1'
 > git fetch --tags --progress https://github.com/JanssenProject/jans-core +refs/heads/*:refs/remotes/origin/* # timeout=10
 > git rev-parse refs/remotes/origin/master^{commit} # timeout=10
 > git rev-parse refs/remotes/origin/origin/master^{commit} # timeout=10
Checking out Revision 2d7651b960354e982197407602a3d333a693de42 (refs/remotes/origin/master)
 > git config core.sparsecheckout # timeout=10
 > git checkout -f 2d7651b960354e982197407602a3d333a693de42 # timeout=10
Commit message: "Fix dependencies"
 > git rev-list --no-walk 38710d9cfacdb582cfdf5159ed25423171e056ab # timeout=10
[workspace] $ /home/jenkins/.jenkins/tools/hudson.tasks.Maven_MavenInstallation/maven_3.3.9/bin/mvn -DVERSION_NAME=master -DMAVEN_SKIP_TESTS=false -Dmaven.test.skip=false clean compile install
[INFO] Scanning for projects...
[INFO] ------------------------------------------------------------------------
[INFO] Reactor Build Order:
[INFO] 
[INFO] jans-core
[INFO] jans-core-util
[INFO] jans-core-model
[INFO] Caches support
[INFO] Caches support
[INFO] Configuration factories for standalone applications
[INFO] jans-core-saml
[INFO] jans-core-cdi
[INFO] jans-core-script
[INFO] jans-core-service
[INFO] jans-core-jsf-util
[INFO] Java extensions
[INFO] Weld CDI timer implementation
[INFO] security-extension-cdi
[INFO] exception-extension-cdi
[INFO] Web application specific classes
[INFO] jans-core-radius
[INFO] Demo CDI services
[INFO]                                                                         
[INFO] ------------------------------------------------------------------------
[INFO] Building jans-core 5.0.0-SNAPSHOT
[INFO] ------------------------------------------------------------------------
[INFO] 
[INFO] --- maven-clean-plugin:2.4.1:clean (default-clean) @ jans-core-parent ---
[INFO] 
[INFO] --- maven-install-plugin:2.3.1:install (default-install) @ jans-core-parent ---
[INFO] Installing /home/jenkins/.jenkins/jobs/_jans-core_master/workspace/pom.xml to /var/www/html/maven/io/jans/jans-core-parent/5.0.0-SNAPSHOT/jans-core-parent-5.0.0-SNAPSHOT.pom
[INFO]                                                                         
[INFO] ------------------------------------------------------------------------
[INFO] Building jans-core-util 5.0.0-SNAPSHOT
[INFO] ------------------------------------------------------------------------
[INFO] 
[INFO] --- maven-clean-plugin:2.4.1:clean (default-clean) @ jans-core-util ---
[INFO] Deleting /home/jenkins/.jenkins/jobs/_jans-core_master/workspace/util/target
[INFO] 
[INFO] --- maven-resources-plugin:2.4:resources (default-resources) @ jans-core-util ---
[INFO] Using 'UTF-8' encoding to copy filtered resources.
[INFO] skip non existing resourceDirectory /home/jenkins/.jenkins/jobs/_jans-core_master/workspace/util/src/main/resources
[INFO] 
[INFO] --- maven-compiler-plugin:2.3.2:compile (default-compile) @ jans-core-util ---
[INFO] Compiling 62 source files to /home/jenkins/.jenkins/jobs/_jans-core_master/workspace/util/target/classes
[INFO] 
[INFO] --- maven-resources-plugin:2.4:resources (default-resources) @ jans-core-util ---
[INFO] Using 'UTF-8' encoding to copy filtered resources.
[INFO] skip non existing resourceDirectory /home/jenkins/.jenkins/jobs/_jans-core_master/workspace/util/src/main/resources
[INFO] 
[INFO] --- maven-compiler-plugin:2.3.2:compile (default-compile) @ jans-core-util ---
[INFO] Nothing to compile - all classes are up to date
[INFO] 
[INFO] --- maven-resources-plugin:2.4:testResources (default-testResources) @ jans-core-util ---
[INFO] Using 'UTF-8' encoding to copy filtered resources.
[INFO] skip non existing resourceDirectory /home/jenkins/.jenkins/jobs/_jans-core_master/workspace/util/src/test/resources
[INFO] 
[INFO] --- maven-compiler-plugin:2.3.2:testCompile (default-testCompile) @ jans-core-util ---
[INFO] No sources to compile
[INFO] 
[INFO] --- maven-surefire-plugin:2.7.2:test (default-test) @ jans-core-util ---
[INFO] No tests to run.
[INFO] Surefire report directory: /home/jenkins/.jenkins/jobs/_jans-core_master/workspace/util/target/surefire-reports

-------------------------------------------------------
 T E S T S
-------------------------------------------------------
There are no tests to run.

Results :

Tests run: 0, Failures: 0, Errors: 0, Skipped: 0

[INFO] 
[INFO] --- maven-jar-plugin:2.4:jar (default-jar) @ jans-core-util ---
[INFO] Building jar: /home/jenkins/.jenkins/jobs/_jans-core_master/workspace/util/target/jans-core-util-5.0.0-SNAPSHOT.jar
[INFO] 
[INFO] --- maven-install-plugin:2.3.1:install (default-install) @ jans-core-util ---
[INFO] Installing /home/jenkins/.jenkins/jobs/_jans-core_master/workspace/util/target/jans-core-util-5.0.0-SNAPSHOT.jar to /var/www/html/maven/io/jans/jans-core-util/5.0.0-SNAPSHOT/jans-core-util-5.0.0-SNAPSHOT.jar
[INFO] Installing /home/jenkins/.jenkins/jobs/_jans-core_master/workspace/util/pom.xml to /var/www/html/maven/io/jans/jans-core-util/5.0.0-SNAPSHOT/jans-core-util-5.0.0-SNAPSHOT.pom
[INFO]                                                                         
[INFO] ------------------------------------------------------------------------
[INFO] Building jans-core-model 5.0.0-SNAPSHOT
[INFO] ------------------------------------------------------------------------
[INFO] 
[INFO] --- maven-clean-plugin:2.4.1:clean (default-clean) @ jans-core-model ---
[INFO] Deleting /home/jenkins/.jenkins/jobs/_jans-core_master/workspace/model/target
[INFO] 
[INFO] --- maven-resources-plugin:2.4:resources (default-resources) @ jans-core-model ---
[INFO] Using 'UTF-8' encoding to copy filtered resources.
[INFO] skip non existing resourceDirectory /home/jenkins/.jenkins/jobs/_jans-core_master/workspace/model/src/main/resources
[INFO] 
[INFO] --- maven-compiler-plugin:2.3.2:compile (default-compile) @ jans-core-model ---
[INFO] Compiling 18 source files to /home/jenkins/.jenkins/jobs/_jans-core_master/workspace/model/target/classes
[INFO] 
[INFO] --- maven-resources-plugin:2.4:resources (default-resources) @ jans-core-model ---
[INFO] Using 'UTF-8' encoding to copy filtered resources.
[INFO] skip non existing resourceDirectory /home/jenkins/.jenkins/jobs/_jans-core_master/workspace/model/src/main/resources
[INFO] 
[INFO] --- maven-compiler-plugin:2.3.2:compile (default-compile) @ jans-core-model ---
[INFO] Nothing to compile - all classes are up to date
[INFO] 
[INFO] --- maven-resources-plugin:2.4:testResources (default-testResources) @ jans-core-model ---
[INFO] Using 'UTF-8' encoding to copy filtered resources.
[INFO] skip non existing resourceDirectory /home/jenkins/.jenkins/jobs/_jans-core_master/workspace/model/src/test/resources
[INFO] 
[INFO] --- maven-compiler-plugin:2.3.2:testCompile (default-testCompile) @ jans-core-model ---
[INFO] No sources to compile
[INFO] 
[INFO] --- maven-surefire-plugin:2.7.2:test (default-test) @ jans-core-model ---
[INFO] No tests to run.
[INFO] Surefire report directory: /home/jenkins/.jenkins/jobs/_jans-core_master/workspace/model/target/surefire-reports

-------------------------------------------------------
 T E S T S
-------------------------------------------------------
There are no tests to run.

Results :

Tests run: 0, Failures: 0, Errors: 0, Skipped: 0

[INFO] 
[INFO] --- maven-jar-plugin:2.4:jar (default-jar) @ jans-core-model ---
[INFO] Building jar: /home/jenkins/.jenkins/jobs/_jans-core_master/workspace/model/target/jans-core-model-5.0.0-SNAPSHOT.jar
[INFO] 
[INFO] --- maven-install-plugin:2.3.1:install (default-install) @ jans-core-model ---
[INFO] Installing /home/jenkins/.jenkins/jobs/_jans-core_master/workspace/model/target/jans-core-model-5.0.0-SNAPSHOT.jar to /var/www/html/maven/io/jans/jans-core-model/5.0.0-SNAPSHOT/jans-core-model-5.0.0-SNAPSHOT.jar
[INFO] Installing /home/jenkins/.jenkins/jobs/_jans-core_master/workspace/model/pom.xml to /var/www/html/maven/io/jans/jans-core-model/5.0.0-SNAPSHOT/jans-core-model-5.0.0-SNAPSHOT.pom
[INFO]                                                                         
[INFO] ------------------------------------------------------------------------
[INFO] Building Caches support 5.0.0-SNAPSHOT
[INFO] ------------------------------------------------------------------------
[INFO] 
[INFO] --- maven-clean-plugin:2.4.1:clean (default-clean) @ jans-core-cache ---
[INFO] Deleting /home/jenkins/.jenkins/jobs/_jans-core_master/workspace/cache/target
[INFO] 
[INFO] --- maven-resources-plugin:2.4:resources (default-resources) @ jans-core-cache ---
[INFO] Using 'UTF-8' encoding to copy filtered resources.
[INFO] Copying 1 resource
[INFO] 
[INFO] --- maven-compiler-plugin:2.3.2:compile (default-compile) @ jans-core-cache ---
[INFO] Compiling 28 source files to /home/jenkins/.jenkins/jobs/_jans-core_master/workspace/cache/target/classes
[INFO] -------------------------------------------------------------
[ERROR] COMPILATION ERROR : 
[INFO] -------------------------------------------------------------
[ERROR] /home/jenkins/.jenkins/jobs/_jans-core_master/workspace/cache/src/main/java/io/jans/service/cache/RedisProvider.java:[3,28] error: package io.jans.util.security does not exist
[ERROR] /home/jenkins/.jenkins/jobs/_jans-core_master/workspace/cache/src/main/java/io/jans/service/cache/RedisProvider.java:[28,12] error: cannot find symbol
[ERROR]  class RedisProvider
/home/jenkins/.jenkins/jobs/_jans-core_master/workspace/cache/src/main/java/io/jans/service/cache/RedisProvider.java:[57,62] error: cannot find symbol
[ERROR]  class RedisProvider
/home/jenkins/.jenkins/jobs/_jans-core_master/workspace/cache/src/main/java/io/jans/service/cache/StandaloneCacheProviderFactory.java:[5,19] error: package io.jans.util does not exist
[ERROR] /home/jenkins/.jenkins/jobs/_jans-core_master/workspace/cache/src/main/java/io/jans/service/cache/StandaloneCacheProviderFactory.java:[6,28] error: package io.jans.util.security does not exist
[ERROR] /home/jenkins/.jenkins/jobs/_jans-core_master/workspace/cache/src/main/java/io/jans/service/cache/StandaloneCacheProviderFactory.java:[18,9] error: cannot find symbol
[ERROR]  class StandaloneCacheProviderFactory
/home/jenkins/.jenkins/jobs/_jans-core_master/workspace/cache/src/main/java/io/jans/service/cache/StandaloneCacheProviderFactory.java:[20,77] error: cannot find symbol
[INFO] 7 errors 
[INFO] -------------------------------------------------------------
[INFO] ------------------------------------------------------------------------
[INFO] Reactor Summary:
[INFO] 
[INFO] jans-core .......................................... SUCCESS [  0.284 s]
[INFO] jans-core-util ..................................... SUCCESS [  3.764 s]
[INFO] jans-core-model .................................... SUCCESS [  1.522 s]
[INFO] Caches support ..................................... FAILURE [  0.968 s]
[INFO] Caches support ..................................... SKIPPED
[INFO] Configuration factories for standalone applications  SKIPPED
[INFO] jans-core-saml ..................................... SKIPPED
[INFO] jans-core-cdi ...................................... SKIPPED
[INFO] jans-core-script ................................... SKIPPED
[INFO] jans-core-service .................................. SKIPPED
[INFO] jans-core-jsf-util ................................. SKIPPED
[INFO] Java extensions .................................... SKIPPED
[INFO] Weld CDI timer implementation ...................... SKIPPED
[INFO] security-extension-cdi ............................. SKIPPED
[INFO] exception-extension-cdi ............................ SKIPPED
[INFO] Web application specific classes ................... SKIPPED
[INFO] jans-core-radius ................................... SKIPPED
[INFO] Demo CDI services .................................. SKIPPED
[INFO] ------------------------------------------------------------------------
[INFO] BUILD FAILURE
[INFO] ------------------------------------------------------------------------
[INFO] Total time: 7.456 s
[INFO] Finished at: 2020-10-09T18:43:45+00:00
[INFO] Final Memory: 45M/595M
[INFO] ------------------------------------------------------------------------
[ERROR] Failed to execute goal org.apache.maven.plugins:maven-compiler-plugin:2.3.2:compile (default-compile) on project jans-core-cache: Compilation failure: Compilation failure:
[ERROR] /home/jenkins/.jenkins/jobs/_jans-core_master/workspace/cache/src/main/java/io/jans/service/cache/RedisProvider.java:[3,28] error: package io.jans.util.security does not exist
[ERROR] /home/jenkins/.jenkins/jobs/_jans-core_master/workspace/cache/src/main/java/io/jans/service/cache/RedisProvider.java:[28,12] error: cannot find symbol
[ERROR] class RedisProvider
[ERROR] /home/jenkins/.jenkins/jobs/_jans-core_master/workspace/cache/src/main/java/io/jans/service/cache/RedisProvider.java:[57,62] error: cannot find symbol
[ERROR] class RedisProvider
[ERROR] /home/jenkins/.jenkins/jobs/_jans-core_master/workspace/cache/src/main/java/io/jans/service/cache/StandaloneCacheProviderFactory.java:[5,19] error: package io.jans.util does not exist
[ERROR] /home/jenkins/.jenkins/jobs/_jans-core_master/workspace/cache/src/main/java/io/jans/service/cache/StandaloneCacheProviderFactory.java:[6,28] error: package io.jans.util.security does not exist
[ERROR] /home/jenkins/.jenkins/jobs/_jans-core_master/workspace/cache/src/main/java/io/jans/service/cache/StandaloneCacheProviderFactory.java:[18,9] error: cannot find symbol
[ERROR] class StandaloneCacheProviderFactory
[ERROR] /home/jenkins/.jenkins/jobs/_jans-core_master/workspace/cache/src/main/java/io/jans/service/cache/StandaloneCacheProviderFactory.java:[20,77] error: cannot find symbol
[ERROR] -> [Help 1]
[ERROR] 
[ERROR] To see the full stack trace of the errors, re-run Maven with the -e switch.
[ERROR] Re-run Maven using the -X switch to enable full debug logging.
[ERROR] 
[ERROR] For more information about the errors and possible solutions, please read the following articles:
[ERROR] [Help 1] http://cwiki.apache.org/confluence/display/MAVEN/MojoFailureException
[ERROR] 
[ERROR] After correcting the problems, you can resume the build with the command
[ERROR]   mvn <goals> -rf :jans-core-cache
Build step 'Invoke top-level Maven targets' marked build as failure
[FINDBUGS] Skipping publisher since build result is FAILURE
TestNG Reports Processing: START
Looking for TestNG results report in workspace using pattern: **/testng-results.xml
testng-results.xml was last modified before this build started. Ignoring it.
testng-results.xml was last modified before this build started. Ignoring it.
testng-results.xml was last modified before this build started. Ignoring it.
testng-results.xml was last modified before this build started. Ignoring it.
testng-results.xml was last modified before this build started. Ignoring it.
testng-results.xml was last modified before this build started. Ignoring it.
Saving reports...
Found matching files but did not find any TestNG results.
Not sending mail to unregistered user Yuriy.Movchan@gmail.com
Sending e-mails to: support@gluu.org
Finished: FAILURE