FailedConsole Output

Started by an SCM change
Running as SYSTEM
Building on master in workspace /home/jenkins/.jenkins/jobs/_jans-core_master/workspace
The recommended git tool is: NONE
No credentials specified
 > git rev-parse --is-inside-work-tree # timeout=10
Fetching changes from the remote Git repository
 > git config remote.origin.url https://github.com/JanssenProject/jans-core # timeout=10
Fetching upstream changes from https://github.com/JanssenProject/jans-core
 > git --version # timeout=10
 > git --version # 'git version 1.8.3.1'
 > git fetch --tags --progress https://github.com/JanssenProject/jans-core +refs/heads/*:refs/remotes/origin/* # timeout=10
 > git rev-parse refs/remotes/origin/master^{commit} # timeout=10
 > git rev-parse refs/remotes/origin/origin/master^{commit} # timeout=10
Checking out Revision 3de6233aa9949ecead392b1b8caada3d8998fb7c (refs/remotes/origin/master)
 > git config core.sparsecheckout # timeout=10
 > git checkout -f 3de6233aa9949ecead392b1b8caada3d8998fb7c # timeout=10
Commit message: "Update dependecies"
 > git rev-list --no-walk 18cec6ab3cca98684b3875cb10288537820d143a # timeout=10
[workspace] $ /home/jenkins/.jenkins/tools/hudson.tasks.Maven_MavenInstallation/maven_3.3.9/bin/mvn -DVERSION_NAME=master -DMAVEN_SKIP_TESTS=false -Dmaven.test.skip=false clean compile install
[INFO] Scanning for projects...
[INFO] ------------------------------------------------------------------------
[INFO] Reactor Build Order:
[INFO] 
[INFO] jans-core
[INFO] jans-core-util
[INFO] jans-core-model
[INFO] Caches support
[INFO] Caches support
[INFO] Configuration factories for standalone applications
[INFO] jans-core-saml
[INFO] jans-core-cdi
[INFO] jans-core-script
[INFO] jans-core-service
[INFO] jans-core-jsf-util
[INFO] Java extensions
[INFO] Weld CDI timer implementation
[INFO] security-extension-cdi
[INFO] exception-extension-cdi
[INFO] Web application specific classes
[INFO] jans-core-radius
[INFO] Demo CDI services
[INFO]                                                                         
[INFO] ------------------------------------------------------------------------
[INFO] Building jans-core 5.0.0-SNAPSHOT
[INFO] ------------------------------------------------------------------------
[INFO] 
[INFO] --- maven-clean-plugin:2.4.1:clean (default-clean) @ jans-core-parent ---
[INFO] 
[INFO] --- maven-install-plugin:2.3.1:install (default-install) @ jans-core-parent ---
[INFO] Installing /home/jenkins/.jenkins/jobs/_jans-core_master/workspace/pom.xml to /var/www/html/maven/io/jans/jans-core-parent/5.0.0-SNAPSHOT/jans-core-parent-5.0.0-SNAPSHOT.pom
[INFO]                                                                         
[INFO] ------------------------------------------------------------------------
[INFO] Building jans-core-util 5.0.0-SNAPSHOT
[INFO] ------------------------------------------------------------------------
[INFO] 
[INFO] --- maven-clean-plugin:2.4.1:clean (default-clean) @ jans-core-util ---
[INFO] 
[INFO] --- maven-resources-plugin:2.4:resources (default-resources) @ jans-core-util ---
[INFO] Using 'UTF-8' encoding to copy filtered resources.
[INFO] skip non existing resourceDirectory /home/jenkins/.jenkins/jobs/_jans-core_master/workspace/util/src/main/resources
[INFO] 
[INFO] --- maven-compiler-plugin:2.3.2:compile (default-compile) @ jans-core-util ---
[INFO] Compiling 57 source files to /home/jenkins/.jenkins/jobs/_jans-core_master/workspace/util/target/classes
[INFO] -------------------------------------------------------------
[ERROR] COMPILATION ERROR : 
[INFO] -------------------------------------------------------------
[ERROR] /home/jenkins/.jenkins/jobs/_jans-core_master/workspace/util/src/main/java/io/jans/model/ScriptLocationType.java:[9,33] error: package io.jans.persist.annotation does not exist
[ERROR] /home/jenkins/.jenkins/jobs/_jans-core_master/workspace/util/src/main/java/io/jans/model/ScriptLocationType.java:[19,42] error: cannot find symbol
[ERROR]  class AttributeEnum
/home/jenkins/.jenkins/jobs/_jans-core_master/workspace/util/src/main/java/io/jans/model/ScriptLocationType.java:[51,26] error: cannot find symbol
[ERROR]  class ScriptLocationType
/home/jenkins/.jenkins/jobs/_jans-core_master/workspace/util/src/main/java/io/jans/model/AuthenticationScriptUsageType.java:[12,33] error: package io.jans.persist.annotation does not exist
[ERROR] /home/jenkins/.jenkins/jobs/_jans-core_master/workspace/util/src/main/java/io/jans/model/AuthenticationScriptUsageType.java:[19,53] error: cannot find symbol
[ERROR]  class AttributeEnum
/home/jenkins/.jenkins/jobs/_jans-core_master/workspace/util/src/main/java/io/jans/model/AuthenticationScriptUsageType.java:[51,26] error: cannot find symbol
[ERROR]  class AuthenticationScriptUsageType
/home/jenkins/.jenkins/jobs/_jans-core_master/workspace/util/src/main/java/io/jans/model/ProgrammingLanguage.java:[12,33] error: package io.jans.persist.annotation does not exist
[ERROR] /home/jenkins/.jenkins/jobs/_jans-core_master/workspace/util/src/main/java/io/jans/model/ProgrammingLanguage.java:[19,43] error: cannot find symbol
[ERROR]  class AttributeEnum
/home/jenkins/.jenkins/jobs/_jans-core_master/workspace/util/src/main/java/io/jans/model/ProgrammingLanguage.java:[51,26] error: cannot find symbol
[INFO] 9 errors 
[INFO] -------------------------------------------------------------
[INFO] ------------------------------------------------------------------------
[INFO] Reactor Summary:
[INFO] 
[INFO] jans-core .......................................... SUCCESS [  0.265 s]
[INFO] jans-core-util ..................................... FAILURE [  1.769 s]
[INFO] jans-core-model .................................... SKIPPED
[INFO] Caches support ..................................... SKIPPED
[INFO] Caches support ..................................... SKIPPED
[INFO] Configuration factories for standalone applications  SKIPPED
[INFO] jans-core-saml ..................................... SKIPPED
[INFO] jans-core-cdi ...................................... SKIPPED
[INFO] jans-core-script ................................... SKIPPED
[INFO] jans-core-service .................................. SKIPPED
[INFO] jans-core-jsf-util ................................. SKIPPED
[INFO] Java extensions .................................... SKIPPED
[INFO] Weld CDI timer implementation ...................... SKIPPED
[INFO] security-extension-cdi ............................. SKIPPED
[INFO] exception-extension-cdi ............................ SKIPPED
[INFO] Web application specific classes ................... SKIPPED
[INFO] jans-core-radius ................................... SKIPPED
[INFO] Demo CDI services .................................. SKIPPED
[INFO] ------------------------------------------------------------------------
[INFO] BUILD FAILURE
[INFO] ------------------------------------------------------------------------
[INFO] Total time: 2.910 s
[INFO] Finished at: 2020-10-08T12:44:13+00:00
[INFO] Final Memory: 28M/380M
[INFO] ------------------------------------------------------------------------
[ERROR] Failed to execute goal org.apache.maven.plugins:maven-compiler-plugin:2.3.2:compile (default-compile) on project jans-core-util: Compilation failure: Compilation failure:
[ERROR] /home/jenkins/.jenkins/jobs/_jans-core_master/workspace/util/src/main/java/io/jans/model/ScriptLocationType.java:[9,33] error: package io.jans.persist.annotation does not exist
[ERROR] /home/jenkins/.jenkins/jobs/_jans-core_master/workspace/util/src/main/java/io/jans/model/ScriptLocationType.java:[19,42] error: cannot find symbol
[ERROR] class AttributeEnum
[ERROR] /home/jenkins/.jenkins/jobs/_jans-core_master/workspace/util/src/main/java/io/jans/model/ScriptLocationType.java:[51,26] error: cannot find symbol
[ERROR] class ScriptLocationType
[ERROR] /home/jenkins/.jenkins/jobs/_jans-core_master/workspace/util/src/main/java/io/jans/model/AuthenticationScriptUsageType.java:[12,33] error: package io.jans.persist.annotation does not exist
[ERROR] /home/jenkins/.jenkins/jobs/_jans-core_master/workspace/util/src/main/java/io/jans/model/AuthenticationScriptUsageType.java:[19,53] error: cannot find symbol
[ERROR] class AttributeEnum
[ERROR] /home/jenkins/.jenkins/jobs/_jans-core_master/workspace/util/src/main/java/io/jans/model/AuthenticationScriptUsageType.java:[51,26] error: cannot find symbol
[ERROR] class AuthenticationScriptUsageType
[ERROR] /home/jenkins/.jenkins/jobs/_jans-core_master/workspace/util/src/main/java/io/jans/model/ProgrammingLanguage.java:[12,33] error: package io.jans.persist.annotation does not exist
[ERROR] /home/jenkins/.jenkins/jobs/_jans-core_master/workspace/util/src/main/java/io/jans/model/ProgrammingLanguage.java:[19,43] error: cannot find symbol
[ERROR] class AttributeEnum
[ERROR] /home/jenkins/.jenkins/jobs/_jans-core_master/workspace/util/src/main/java/io/jans/model/ProgrammingLanguage.java:[51,26] error: cannot find symbol
[ERROR] -> [Help 1]
[ERROR] 
[ERROR] To see the full stack trace of the errors, re-run Maven with the -e switch.
[ERROR] Re-run Maven using the -X switch to enable full debug logging.
[ERROR] 
[ERROR] For more information about the errors and possible solutions, please read the following articles:
[ERROR] [Help 1] http://cwiki.apache.org/confluence/display/MAVEN/MojoFailureException
[ERROR] 
[ERROR] After correcting the problems, you can resume the build with the command
[ERROR]   mvn <goals> -rf :jans-core-util
Build step 'Invoke top-level Maven targets' marked build as failure
[FINDBUGS] Skipping publisher since build result is FAILURE
TestNG Reports Processing: START
Looking for TestNG results report in workspace using pattern: **/testng-results.xml
testng-results.xml was last modified before this build started. Ignoring it.
testng-results.xml was last modified before this build started. Ignoring it.
testng-results.xml was last modified before this build started. Ignoring it.
testng-results.xml was last modified before this build started. Ignoring it.
Saving reports...
Found matching files but did not find any TestNG results.
Not sending mail to unregistered user Yuriy.Movchan@gmail.com
Sending e-mails to: support@gluu.org
Finished: FAILURE