FailedConsole Output

Started by an SCM change
Running as SYSTEM
Building on master in workspace /home/jenkins/.jenkins/jobs/_core_master/workspace
The recommended git tool is: NONE
No credentials specified
 > git rev-parse --is-inside-work-tree # timeout=10
Fetching changes from the remote Git repository
 > git config remote.origin.url https://github.com/JanssenProject/core # timeout=10
Fetching upstream changes from https://github.com/JanssenProject/core
 > git --version # timeout=10
 > git --version # 'git version 1.8.3.1'
 > git fetch --tags --progress https://github.com/JanssenProject/core +refs/heads/*:refs/remotes/origin/* # timeout=10
 > git rev-parse refs/remotes/origin/master^{commit} # timeout=10
 > git rev-parse refs/remotes/origin/origin/master^{commit} # timeout=10
Checking out Revision 81e10d20ea46427a1d035b2ec18629e783ac4e88 (refs/remotes/origin/master)
 > git config core.sparsecheckout # timeout=10
 > git checkout -f 81e10d20ea46427a1d035b2ec18629e783ac4e88 # timeout=10
Commit message: "Missed files"
 > git rev-list --no-walk e75a4a67755378e7dae17e55bc5d04436bd42dcd # timeout=10
[workspace] $ /home/jenkins/.jenkins/tools/hudson.tasks.Maven_MavenInstallation/maven_3.3.9/bin/mvn -DVERSION_NAME=master -DMAVEN_SKIP_TESTS=false -Dmaven.test.skip=false clean compile install
[INFO] Scanning for projects...
[INFO] ------------------------------------------------------------------------
[INFO] Reactor Build Order:
[INFO] 
[INFO] core
[INFO] oxUtil
[INFO] core-model
[INFO] Caches support
[INFO] Caches support
[INFO] Configuration factories for standalone applications
[INFO] oxSaml
[INFO] core-cdi
[INFO] core-script
[INFO] core-service
[INFO] oxJsfUtil
[INFO] Java extensions
[INFO] Weld CDI timer implementation
[INFO] security-extension-cdi
[INFO] exception-extension-cdi
[INFO] Web application specific classes
[INFO] oxRadius
[INFO] Demo CDI services
[INFO]                                                                         
[INFO] ------------------------------------------------------------------------
[INFO] Building core 5.0.0-SNAPSHOT
[INFO] ------------------------------------------------------------------------
[INFO] 
[INFO] --- maven-clean-plugin:2.4.1:clean (default-clean) @ core ---
[INFO] 
[INFO] --- maven-install-plugin:2.3.1:install (default-install) @ core ---
[INFO] Installing /home/jenkins/.jenkins/jobs/_core_master/workspace/pom.xml to /var/www/html/maven/io/jans/core/5.0.0-SNAPSHOT/core-5.0.0-SNAPSHOT.pom
[INFO]                                                                         
[INFO] ------------------------------------------------------------------------
[INFO] Building oxUtil 5.0.0-SNAPSHOT
[INFO] ------------------------------------------------------------------------
[INFO] 
[INFO] --- maven-clean-plugin:2.4.1:clean (default-clean) @ core-util ---
[INFO] Deleting /home/jenkins/.jenkins/jobs/_core_master/workspace/oxUtil/target
[INFO] 
[INFO] --- maven-resources-plugin:2.4:resources (default-resources) @ core-util ---
[INFO] Using 'UTF-8' encoding to copy filtered resources.
[INFO] skip non existing resourceDirectory /home/jenkins/.jenkins/jobs/_core_master/workspace/oxUtil/src/main/resources
[INFO] 
[INFO] --- maven-compiler-plugin:2.3.2:compile (default-compile) @ core-util ---
[INFO] Compiling 57 source files to /home/jenkins/.jenkins/jobs/_core_master/workspace/oxUtil/target/classes
[INFO] 
[INFO] --- maven-resources-plugin:2.4:resources (default-resources) @ core-util ---
[INFO] Using 'UTF-8' encoding to copy filtered resources.
[INFO] skip non existing resourceDirectory /home/jenkins/.jenkins/jobs/_core_master/workspace/oxUtil/src/main/resources
[INFO] 
[INFO] --- maven-compiler-plugin:2.3.2:compile (default-compile) @ core-util ---
[INFO] Nothing to compile - all classes are up to date
[INFO] 
[INFO] --- maven-resources-plugin:2.4:testResources (default-testResources) @ core-util ---
[INFO] Using 'UTF-8' encoding to copy filtered resources.
[INFO] skip non existing resourceDirectory /home/jenkins/.jenkins/jobs/_core_master/workspace/oxUtil/src/test/resources
[INFO] 
[INFO] --- maven-compiler-plugin:2.3.2:testCompile (default-testCompile) @ core-util ---
[INFO] No sources to compile
[INFO] 
[INFO] --- maven-surefire-plugin:2.7.2:test (default-test) @ core-util ---
[INFO] No tests to run.
[INFO] Surefire report directory: /home/jenkins/.jenkins/jobs/_core_master/workspace/oxUtil/target/surefire-reports

-------------------------------------------------------
 T E S T S
-------------------------------------------------------
There are no tests to run.

Results :

Tests run: 0, Failures: 0, Errors: 0, Skipped: 0

[INFO] 
[INFO] --- maven-jar-plugin:2.4:jar (default-jar) @ core-util ---
[INFO] Building jar: /home/jenkins/.jenkins/jobs/_core_master/workspace/oxUtil/target/core-util-5.0.0-SNAPSHOT.jar
[INFO] 
[INFO] --- maven-install-plugin:2.3.1:install (default-install) @ core-util ---
[INFO] Installing /home/jenkins/.jenkins/jobs/_core_master/workspace/oxUtil/target/core-util-5.0.0-SNAPSHOT.jar to /var/www/html/maven/io/jans/core-util/5.0.0-SNAPSHOT/core-util-5.0.0-SNAPSHOT.jar
[INFO] Installing /home/jenkins/.jenkins/jobs/_core_master/workspace/oxUtil/pom.xml to /var/www/html/maven/io/jans/core-util/5.0.0-SNAPSHOT/core-util-5.0.0-SNAPSHOT.pom
[INFO]                                                                         
[INFO] ------------------------------------------------------------------------
[INFO] Building core-model 5.0.0-SNAPSHOT
[INFO] ------------------------------------------------------------------------
[INFO] 
[INFO] --- maven-clean-plugin:2.4.1:clean (default-clean) @ core-model ---
[INFO] Deleting /home/jenkins/.jenkins/jobs/_core_master/workspace/oxModel/target
[INFO] 
[INFO] --- maven-resources-plugin:2.4:resources (default-resources) @ core-model ---
[INFO] Using 'UTF-8' encoding to copy filtered resources.
[INFO] skip non existing resourceDirectory /home/jenkins/.jenkins/jobs/_core_master/workspace/oxModel/src/main/resources
[INFO] 
[INFO] --- maven-compiler-plugin:2.3.2:compile (default-compile) @ core-model ---
[INFO] Compiling 18 source files to /home/jenkins/.jenkins/jobs/_core_master/workspace/oxModel/target/classes
[INFO] 
[INFO] --- maven-resources-plugin:2.4:resources (default-resources) @ core-model ---
[INFO] Using 'UTF-8' encoding to copy filtered resources.
[INFO] skip non existing resourceDirectory /home/jenkins/.jenkins/jobs/_core_master/workspace/oxModel/src/main/resources
[INFO] 
[INFO] --- maven-compiler-plugin:2.3.2:compile (default-compile) @ core-model ---
[INFO] Nothing to compile - all classes are up to date
[INFO] 
[INFO] --- maven-resources-plugin:2.4:testResources (default-testResources) @ core-model ---
[INFO] Using 'UTF-8' encoding to copy filtered resources.
[INFO] skip non existing resourceDirectory /home/jenkins/.jenkins/jobs/_core_master/workspace/oxModel/src/test/resources
[INFO] 
[INFO] --- maven-compiler-plugin:2.3.2:testCompile (default-testCompile) @ core-model ---
[INFO] No sources to compile
[INFO] 
[INFO] --- maven-surefire-plugin:2.7.2:test (default-test) @ core-model ---
[INFO] No tests to run.
[INFO] Surefire report directory: /home/jenkins/.jenkins/jobs/_core_master/workspace/oxModel/target/surefire-reports

-------------------------------------------------------
 T E S T S
-------------------------------------------------------
There are no tests to run.

Results :

Tests run: 0, Failures: 0, Errors: 0, Skipped: 0

[INFO] 
[INFO] --- maven-jar-plugin:2.4:jar (default-jar) @ core-model ---
[INFO] Building jar: /home/jenkins/.jenkins/jobs/_core_master/workspace/oxModel/target/core-model-5.0.0-SNAPSHOT.jar
[INFO] 
[INFO] --- maven-install-plugin:2.3.1:install (default-install) @ core-model ---
[INFO] Installing /home/jenkins/.jenkins/jobs/_core_master/workspace/oxModel/target/core-model-5.0.0-SNAPSHOT.jar to /var/www/html/maven/io/jans/core-model/5.0.0-SNAPSHOT/core-model-5.0.0-SNAPSHOT.jar
[INFO] Installing /home/jenkins/.jenkins/jobs/_core_master/workspace/oxModel/pom.xml to /var/www/html/maven/io/jans/core-model/5.0.0-SNAPSHOT/core-model-5.0.0-SNAPSHOT.pom
[INFO]                                                                         
[INFO] ------------------------------------------------------------------------
[INFO] Building Caches support 5.0.0-SNAPSHOT
[INFO] ------------------------------------------------------------------------
[INFO] 
[INFO] --- maven-clean-plugin:2.4.1:clean (default-clean) @ core-cache ---
[INFO] Deleting /home/jenkins/.jenkins/jobs/_core_master/workspace/core-cache/target
[INFO] 
[INFO] --- maven-resources-plugin:2.4:resources (default-resources) @ core-cache ---
[INFO] Using 'UTF-8' encoding to copy filtered resources.
[INFO] Copying 1 resource
[INFO] 
[INFO] --- maven-compiler-plugin:2.3.2:compile (default-compile) @ core-cache ---
[INFO] Compiling 28 source files to /home/jenkins/.jenkins/jobs/_core_master/workspace/core-cache/target/classes
[INFO] 
[INFO] --- maven-resources-plugin:2.4:resources (default-resources) @ core-cache ---
[INFO] Using 'UTF-8' encoding to copy filtered resources.
[INFO] Copying 1 resource
[INFO] 
[INFO] --- maven-compiler-plugin:2.3.2:compile (default-compile) @ core-cache ---
[INFO] Nothing to compile - all classes are up to date
[INFO] 
[INFO] --- maven-resources-plugin:2.4:testResources (default-testResources) @ core-cache ---
[INFO] Using 'UTF-8' encoding to copy filtered resources.
[INFO] skip non existing resourceDirectory /home/jenkins/.jenkins/jobs/_core_master/workspace/core-cache/src/test/resources
[INFO] 
[INFO] --- maven-compiler-plugin:2.3.2:testCompile (default-testCompile) @ core-cache ---
[INFO] No sources to compile
[INFO] 
[INFO] --- maven-surefire-plugin:2.7.2:test (default-test) @ core-cache ---
[INFO] No tests to run.
[INFO] Surefire report directory: /home/jenkins/.jenkins/jobs/_core_master/workspace/core-cache/target/surefire-reports
There are no tests to run.
[INFO] 
[INFO] --- maven-jar-plugin:2.4:jar (default-jar) @ core-cache ---
[INFO] Building jar: /home/jenkins/.jenkins/jobs/_core_master/workspace/core-cache/target/core-cache-5.0.0-SNAPSHOT.jar
[INFO] 
[INFO] --- maven-install-plugin:2.3.1:install (default-install) @ core-cache ---
[INFO] Installing /home/jenkins/.jenkins/jobs/_core_master/workspace/core-cache/target/core-cache-5.0.0-SNAPSHOT.jar to /var/www/html/maven/io/jans/core-cache/5.0.0-SNAPSHOT/core-cache-5.0.0-SNAPSHOT.jar
[INFO] Installing /home/jenkins/.jenkins/jobs/_core_master/workspace/core-cache/pom.xml to /var/www/html/maven/io/jans/core-cache/5.0.0-SNAPSHOT/core-cache-5.0.0-SNAPSHOT.pom
[INFO]                                                                         
[INFO] ------------------------------------------------------------------------
[INFO] Building Caches support 5.0.0-SNAPSHOT
[INFO] ------------------------------------------------------------------------
[INFO] 
[INFO] --- maven-clean-plugin:2.4.1:clean (default-clean) @ core-document-store ---
[INFO] Deleting /home/jenkins/.jenkins/jobs/_core_master/workspace/core-document-store/target
[INFO] 
[INFO] --- maven-resources-plugin:2.4:resources (default-resources) @ core-document-store ---
[INFO] Using 'UTF-8' encoding to copy filtered resources.
[INFO] Copying 1 resource
[INFO] 
[INFO] --- maven-compiler-plugin:2.3.2:compile (default-compile) @ core-document-store ---
[INFO] Compiling 16 source files to /home/jenkins/.jenkins/jobs/_core_master/workspace/core-document-store/target/classes
[INFO] 
[INFO] --- maven-resources-plugin:2.4:resources (default-resources) @ core-document-store ---
[INFO] Using 'UTF-8' encoding to copy filtered resources.
[INFO] Copying 1 resource
[INFO] 
[INFO] --- maven-compiler-plugin:2.3.2:compile (default-compile) @ core-document-store ---
[INFO] Nothing to compile - all classes are up to date
[INFO] 
[INFO] --- maven-resources-plugin:2.4:testResources (default-testResources) @ core-document-store ---
[INFO] Using 'UTF-8' encoding to copy filtered resources.
[INFO] skip non existing resourceDirectory /home/jenkins/.jenkins/jobs/_core_master/workspace/core-document-store/src/test/resources
[INFO] 
[INFO] --- maven-compiler-plugin:2.3.2:testCompile (default-testCompile) @ core-document-store ---
[INFO] Compiling 1 source file to /home/jenkins/.jenkins/jobs/_core_master/workspace/core-document-store/target/test-classes
[INFO] 
[INFO] --- maven-surefire-plugin:2.7.2:test (default-test) @ core-document-store ---
[INFO] Surefire report directory: /home/jenkins/.jenkins/jobs/_core_master/workspace/core-document-store/target/surefire-reports

-------------------------------------------------------
 T E S T S
-------------------------------------------------------
Running TestSuite
Tests run: 0, Failures: 0, Errors: 0, Skipped: 0, Time elapsed: 0.235 sec
There are no tests to run.

Results :

Tests run: 0, Failures: 0, Errors: 0, Skipped: 0

[INFO] 
[INFO] --- maven-jar-plugin:2.4:jar (default-jar) @ core-document-store ---
[INFO] Building jar: /home/jenkins/.jenkins/jobs/_core_master/workspace/core-document-store/target/core-document-store-5.0.0-SNAPSHOT.jar
[INFO] 
[INFO] --- maven-install-plugin:2.3.1:install (default-install) @ core-document-store ---
[INFO] Installing /home/jenkins/.jenkins/jobs/_core_master/workspace/core-document-store/target/core-document-store-5.0.0-SNAPSHOT.jar to /var/www/html/maven/io/jans/core-document-store/5.0.0-SNAPSHOT/core-document-store-5.0.0-SNAPSHOT.jar
[INFO] Installing /home/jenkins/.jenkins/jobs/_core_master/workspace/core-document-store/pom.xml to /var/www/html/maven/io/jans/core-document-store/5.0.0-SNAPSHOT/core-document-store-5.0.0-SNAPSHOT.pom
[INFO]                                                                         
[INFO] ------------------------------------------------------------------------
[INFO] Building Configuration factories for standalone applications 5.0.0-SNAPSHOT
[INFO] ------------------------------------------------------------------------
[INFO] 
[INFO] --- maven-clean-plugin:2.4.1:clean (default-clean) @ core-standalone ---
[INFO] Deleting /home/jenkins/.jenkins/jobs/_core_master/workspace/core-standalone/target
[INFO] 
[INFO] --- maven-resources-plugin:2.4:resources (default-resources) @ core-standalone ---
[INFO] Using 'UTF-8' encoding to copy filtered resources.
[INFO] skip non existing resourceDirectory /home/jenkins/.jenkins/jobs/_core_master/workspace/core-standalone/src/main/resources
[INFO] 
[INFO] --- maven-compiler-plugin:2.3.2:compile (default-compile) @ core-standalone ---
[INFO] No sources to compile
[INFO] 
[INFO] --- maven-resources-plugin:2.4:resources (default-resources) @ core-standalone ---
[INFO] Using 'UTF-8' encoding to copy filtered resources.
[INFO] skip non existing resourceDirectory /home/jenkins/.jenkins/jobs/_core_master/workspace/core-standalone/src/main/resources
[INFO] 
[INFO] --- maven-compiler-plugin:2.3.2:compile (default-compile) @ core-standalone ---
[INFO] No sources to compile
[INFO] 
[INFO] --- maven-resources-plugin:2.4:testResources (default-testResources) @ core-standalone ---
[INFO] Using 'UTF-8' encoding to copy filtered resources.
[INFO] skip non existing resourceDirectory /home/jenkins/.jenkins/jobs/_core_master/workspace/core-standalone/src/test/resources
[INFO] 
[INFO] --- maven-compiler-plugin:2.3.2:testCompile (default-testCompile) @ core-standalone ---
[INFO] No sources to compile
[INFO] 
[INFO] --- maven-surefire-plugin:2.7.2:test (default-test) @ core-standalone ---
[INFO] No tests to run.
[INFO] Surefire report directory: /home/jenkins/.jenkins/jobs/_core_master/workspace/core-standalone/target/surefire-reports
There are no tests to run.
[INFO] 
[INFO] --- maven-jar-plugin:2.4:jar (default-jar) @ core-standalone ---
[WARNING] JAR will be empty - no content was marked for inclusion!
[INFO] Building jar: /home/jenkins/.jenkins/jobs/_core_master/workspace/core-standalone/target/core-standalone-5.0.0-SNAPSHOT.jar
[INFO] 
[INFO] --- maven-install-plugin:2.3.1:install (default-install) @ core-standalone ---
[INFO] Installing /home/jenkins/.jenkins/jobs/_core_master/workspace/core-standalone/target/core-standalone-5.0.0-SNAPSHOT.jar to /var/www/html/maven/io/jans/core-standalone/5.0.0-SNAPSHOT/core-standalone-5.0.0-SNAPSHOT.jar
[INFO] Installing /home/jenkins/.jenkins/jobs/_core_master/workspace/core-standalone/pom.xml to /var/www/html/maven/io/jans/core-standalone/5.0.0-SNAPSHOT/core-standalone-5.0.0-SNAPSHOT.pom
[INFO]                                                                         
[INFO] ------------------------------------------------------------------------
[INFO] Building oxSaml 5.0.0-SNAPSHOT
[INFO] ------------------------------------------------------------------------
[INFO] 
[INFO] --- maven-clean-plugin:2.4.1:clean (default-clean) @ core-saml ---
[INFO] Deleting /home/jenkins/.jenkins/jobs/_core_master/workspace/oxSaml/target
[INFO] 
[INFO] --- maven-resources-plugin:2.4:resources (default-resources) @ core-saml ---
[INFO] Using 'UTF-8' encoding to copy filtered resources.
[INFO] Copying 1 resource
[INFO] 
[INFO] --- maven-compiler-plugin:2.3.2:compile (default-compile) @ core-saml ---
[INFO] No sources to compile
[INFO] 
[INFO] --- maven-resources-plugin:2.4:resources (default-resources) @ core-saml ---
[INFO] Using 'UTF-8' encoding to copy filtered resources.
[INFO] Copying 1 resource
[INFO] 
[INFO] --- maven-compiler-plugin:2.3.2:compile (default-compile) @ core-saml ---
[INFO] No sources to compile
[INFO] 
[INFO] --- maven-resources-plugin:2.4:testResources (default-testResources) @ core-saml ---
[INFO] Using 'UTF-8' encoding to copy filtered resources.
[INFO] skip non existing resourceDirectory /home/jenkins/.jenkins/jobs/_core_master/workspace/oxSaml/src/test/resources
[INFO] 
[INFO] --- maven-compiler-plugin:2.3.2:testCompile (default-testCompile) @ core-saml ---
[INFO] No sources to compile
[INFO] 
[INFO] --- maven-surefire-plugin:2.7.2:test (default-test) @ core-saml ---
[INFO] No tests to run.
[INFO] Surefire report directory: /home/jenkins/.jenkins/jobs/_core_master/workspace/oxSaml/target/surefire-reports

-------------------------------------------------------
 T E S T S
-------------------------------------------------------
There are no tests to run.

Results :

Tests run: 0, Failures: 0, Errors: 0, Skipped: 0

[INFO] 
[INFO] --- maven-jar-plugin:2.4:jar (default-jar) @ core-saml ---
[INFO] Building jar: /home/jenkins/.jenkins/jobs/_core_master/workspace/oxSaml/target/core-saml-5.0.0-SNAPSHOT.jar
[INFO] 
[INFO] --- maven-install-plugin:2.3.1:install (default-install) @ core-saml ---
[INFO] Installing /home/jenkins/.jenkins/jobs/_core_master/workspace/oxSaml/target/core-saml-5.0.0-SNAPSHOT.jar to /var/www/html/maven/io/jans/core-saml/5.0.0-SNAPSHOT/core-saml-5.0.0-SNAPSHOT.jar
[INFO] Installing /home/jenkins/.jenkins/jobs/_core_master/workspace/oxSaml/pom.xml to /var/www/html/maven/io/jans/core-saml/5.0.0-SNAPSHOT/core-saml-5.0.0-SNAPSHOT.pom
[INFO]                                                                         
[INFO] ------------------------------------------------------------------------
[INFO] Building core-cdi 5.0.0-SNAPSHOT
[INFO] ------------------------------------------------------------------------
[INFO] 
[INFO] --- maven-clean-plugin:2.4.1:clean (default-clean) @ core-cdi ---
[INFO] Deleting /home/jenkins/.jenkins/jobs/_core_master/workspace/core-cdi/target
[INFO] 
[INFO] --- maven-resources-plugin:2.4:resources (default-resources) @ core-cdi ---
[INFO] Using 'UTF-8' encoding to copy filtered resources.
[INFO] Copying 1 resource
[INFO] 
[INFO] --- maven-compiler-plugin:2.3.2:compile (default-compile) @ core-cdi ---
[INFO] Compiling 5 source files to /home/jenkins/.jenkins/jobs/_core_master/workspace/core-cdi/target/classes
[INFO] 
[INFO] --- maven-resources-plugin:2.4:resources (default-resources) @ core-cdi ---
[INFO] Using 'UTF-8' encoding to copy filtered resources.
[INFO] Copying 1 resource
[INFO] 
[INFO] --- maven-compiler-plugin:2.3.2:compile (default-compile) @ core-cdi ---
[INFO] Nothing to compile - all classes are up to date
[INFO] 
[INFO] --- maven-resources-plugin:2.4:testResources (default-testResources) @ core-cdi ---
[INFO] Using 'UTF-8' encoding to copy filtered resources.
[INFO] skip non existing resourceDirectory /home/jenkins/.jenkins/jobs/_core_master/workspace/core-cdi/src/test/resources
[INFO] 
[INFO] --- maven-compiler-plugin:2.3.2:testCompile (default-testCompile) @ core-cdi ---
[INFO] No sources to compile
[INFO] 
[INFO] --- maven-surefire-plugin:2.7.2:test (default-test) @ core-cdi ---
[INFO] No tests to run.
[INFO] Surefire report directory: /home/jenkins/.jenkins/jobs/_core_master/workspace/core-cdi/target/surefire-reports

-------------------------------------------------------
 T E S T S
-------------------------------------------------------
There are no tests to run.

Results :

Tests run: 0, Failures: 0, Errors: 0, Skipped: 0

[INFO] 
[INFO] --- maven-jar-plugin:2.4:jar (default-jar) @ core-cdi ---
[INFO] Building jar: /home/jenkins/.jenkins/jobs/_core_master/workspace/core-cdi/target/core-cdi-5.0.0-SNAPSHOT.jar
[INFO] 
[INFO] --- maven-install-plugin:2.3.1:install (default-install) @ core-cdi ---
[INFO] Installing /home/jenkins/.jenkins/jobs/_core_master/workspace/core-cdi/target/core-cdi-5.0.0-SNAPSHOT.jar to /var/www/html/maven/io/jans/core-cdi/5.0.0-SNAPSHOT/core-cdi-5.0.0-SNAPSHOT.jar
[INFO] Installing /home/jenkins/.jenkins/jobs/_core_master/workspace/core-cdi/pom.xml to /var/www/html/maven/io/jans/core-cdi/5.0.0-SNAPSHOT/core-cdi-5.0.0-SNAPSHOT.pom
[INFO]                                                                         
[INFO] ------------------------------------------------------------------------
[INFO] Building core-script 5.0.0-SNAPSHOT
[INFO] ------------------------------------------------------------------------
[INFO] 
[INFO] --- maven-clean-plugin:2.4.1:clean (default-clean) @ core-script ---
[INFO] Deleting /home/jenkins/.jenkins/jobs/_core_master/workspace/core-script/target
[INFO] 
[INFO] --- maven-resources-plugin:2.4:resources (default-resources) @ core-script ---
[INFO] Using 'UTF-8' encoding to copy filtered resources.
[INFO] Copying 1 resource
[INFO] 
[INFO] --- maven-compiler-plugin:2.3.2:compile (default-compile) @ core-script ---
[INFO] Compiling 45 source files to /home/jenkins/.jenkins/jobs/_core_master/workspace/core-script/target/classes
[INFO] -------------------------------------------------------------
[ERROR] COMPILATION ERROR : 
[INFO] -------------------------------------------------------------
[ERROR] /home/jenkins/.jenkins/jobs/_core_master/workspace/core-script/src/main/java/io/jans/model/custom/script/type/uma/UmaDummyClaimsGatheringType.java:[6,40] error: package io.jans.model.custom.script.model does not exist
[ERROR] /home/jenkins/.jenkins/jobs/_core_master/workspace/core-script/src/main/java/io/jans/model/custom/script/type/BaseExternalType.java:[10,40] error: package io.jans.model.custom.script.model does not exist
[ERROR] /home/jenkins/.jenkins/jobs/_core_master/workspace/core-script/src/main/java/io/jans/model/custom/script/type/uma/UmaDummyClaimsGatheringType.java:[43,24] error: cannot find symbol
[ERROR]  class UmaDummyClaimsGatheringType
/home/jenkins/.jenkins/jobs/_core_master/workspace/core-script/src/main/java/io/jans/model/custom/script/type/BaseExternalType.java:[21,17] error: cannot find symbol
[ERROR]  interface BaseExternalType
/home/jenkins/.jenkins/jobs/_core_master/workspace/core-script/src/main/java/io/jans/service/custom/script/CustomScriptManager.java:[41,40] error: package io.jans.model.custom.script.model does not exist
[ERROR] /home/jenkins/.jenkins/jobs/_core_master/workspace/core-script/src/main/java/io/jans/service/custom/script/CustomScriptManager.java:[42,40] error: package io.jans.model.custom.script.model does not exist
[ERROR] /home/jenkins/.jenkins/jobs/_core_master/workspace/core-script/src/main/java/io/jans/service/custom/script/ExternalScriptService.java:[21,40] error: package io.jans.model.custom.script.model does not exist
[ERROR] /home/jenkins/.jenkins/jobs/_core_master/workspace/core-script/src/main/java/io/jans/service/PythonService.java:[23,24] error: package io.jans.exception does not exist
[ERROR] /home/jenkins/.jenkins/jobs/_core_master/workspace/core-script/src/main/java/io/jans/service/custom/script/AbstractCustomScriptService.java:[10,40] error: package io.jans.model.custom.script.model does not exist
[ERROR] /home/jenkins/.jenkins/jobs/_core_master/workspace/core-script/src/main/java/io/jans/model/custom/script/CustomScriptType.java:[9,40] error: package io.jans.model.custom.script.model does not exist
[ERROR] /home/jenkins/.jenkins/jobs/_core_master/workspace/core-script/src/main/java/io/jans/model/custom/script/CustomScriptType.java:[10,45] error: package io.jans.model.custom.script.model.auth does not exist
[ERROR] /home/jenkins/.jenkins/jobs/_core_master/workspace/core-script/src/main/java/io/jans/model/custom/script/CustomScriptType.java:[14,45] error: cannot find symbol
[ERROR]  package io.jans.model.custom.script.type.authz
/home/jenkins/.jenkins/jobs/_core_master/workspace/core-script/src/main/java/io/jans/model/custom/script/CustomScriptType.java:[23,53] error: package io.jans.model.custom.script.type.introspection does not exist
[ERROR] /home/jenkins/.jenkins/jobs/_core_master/workspace/core-script/src/main/java/io/jans/model/custom/script/CustomScriptType.java:[24,53] error: package io.jans.model.custom.script.type.introspection does not exist
[ERROR] /home/jenkins/.jenkins/jobs/_core_master/workspace/core-script/src/main/java/io/jans/model/custom/script/CustomScriptType.java:[27,45] error: package io.jans.model.custom.script.type.owner does not exist
[ERROR] /home/jenkins/.jenkins/jobs/_core_master/workspace/core-script/src/main/java/io/jans/model/custom/script/CustomScriptType.java:[28,45] error: package io.jans.model.custom.script.type.owner does not exist
[ERROR] /home/jenkins/.jenkins/jobs/_core_master/workspace/core-script/src/main/java/io/jans/model/custom/script/CustomScriptType.java:[36,45] error: cannot find symbol
[ERROR]  package io.jans.model.custom.script.type.scope
/home/jenkins/.jenkins/jobs/_core_master/workspace/core-script/src/main/java/io/jans/model/custom/script/CustomScriptType.java:[40,51] error: cannot find symbol
[ERROR]  package io.jans.model.custom.script.type.spontaneous
/home/jenkins/.jenkins/jobs/_core_master/workspace/core-script/src/main/java/io/jans/model/custom/script/CustomScriptType.java:[44,0] error: package org.gluu.model.custom.script.type.uma does not exist
[ERROR] /home/jenkins/.jenkins/jobs/_core_master/workspace/core-script/src/main/java/io/jans/model/custom/script/CustomScriptType.java:[45,0] error: package org.gluu.model.custom.script.type.user does not exist
[ERROR] /home/jenkins/.jenkins/jobs/_core_master/workspace/core-script/src/main/java/io/jans/model/custom/script/conf/CustomScriptConfiguration.java:[10,40] error: package io.jans.model.custom.script.model does not exist
[ERROR] /home/jenkins/.jenkins/jobs/_core_master/workspace/core-script/src/main/java/io/jans/service/custom/script/CustomScriptManager.java:[211,75] error: cannot find symbol
[ERROR]  class CustomScriptManager
/home/jenkins/.jenkins/jobs/_core_master/workspace/core-script/src/main/java/io/jans/service/custom/script/CustomScriptManager.java:[380,45] error: cannot find symbol
[ERROR]  class CustomScriptManager
/home/jenkins/.jenkins/jobs/_core_master/workspace/core-script/src/main/java/io/jans/service/custom/script/CustomScriptManager.java:[404,73] error: cannot find symbol
[ERROR]  class CustomScriptManager
/home/jenkins/.jenkins/jobs/_core_master/workspace/core-script/src/main/java/io/jans/service/custom/script/CustomScriptManager.java:[464,29] error: cannot find symbol
[ERROR]  class CustomScriptManager
/home/jenkins/.jenkins/jobs/_core_master/workspace/core-script/src/main/java/io/jans/service/custom/script/CustomScriptManager.java:[468,29] error: cannot find symbol
[ERROR]  class CustomScriptManager
/home/jenkins/.jenkins/jobs/_core_master/workspace/core-script/src/main/java/io/jans/service/custom/script/CustomScriptManager.java:[476,36] error: cannot find symbol
[ERROR]  class CustomScriptManager
/home/jenkins/.jenkins/jobs/_core_master/workspace/core-script/src/main/java/io/jans/service/custom/script/CustomScriptManager.java:[500,30] error: cannot find symbol
[ERROR]  class CustomScriptManager
/home/jenkins/.jenkins/jobs/_core_master/workspace/core-script/src/main/java/io/jans/service/custom/script/CustomScriptManager.java:[508,37] error: cannot find symbol
[ERROR]  class CustomScriptManager
/home/jenkins/.jenkins/jobs/_core_master/workspace/core-script/src/main/java/io/jans/service/custom/script/ExternalScriptService.java:[133,32] error: cannot find symbol
[ERROR]  class ExternalScriptService
/home/jenkins/.jenkins/jobs/_core_master/workspace/core-script/src/main/java/io/jans/service/custom/script/ExternalScriptService.java:[137,33] error: cannot find symbol
[ERROR]  class ExternalScriptService
/home/jenkins/.jenkins/jobs/_core_master/workspace/core-script/src/main/java/io/jans/service/PythonService.java:[156,19] error: cannot find symbol
[ERROR]  class PythonService
/home/jenkins/.jenkins/jobs/_core_master/workspace/core-script/src/main/java/io/jans/service/PythonService.java:[175,47] error: cannot find symbol
[ERROR]  class PythonService
/home/jenkins/.jenkins/jobs/_core_master/workspace/core-script/src/main/java/io/jans/service/PythonService.java:[195,19] error: cannot find symbol
[ERROR]  class PythonService
/home/jenkins/.jenkins/jobs/_core_master/workspace/core-script/src/main/java/io/jans/service/custom/script/AbstractCustomScriptService.java:[37,20] error: cannot find symbol
[ERROR]  class AbstractCustomScriptService
/home/jenkins/.jenkins/jobs/_core_master/workspace/core-script/src/main/java/io/jans/service/custom/script/AbstractCustomScriptService.java:[41,23] error: cannot find symbol
[ERROR]  class AbstractCustomScriptService
/home/jenkins/.jenkins/jobs/_core_master/workspace/core-script/src/main/java/io/jans/service/custom/script/AbstractCustomScriptService.java:[45,23] error: cannot find symbol
[ERROR]  class AbstractCustomScriptService
/home/jenkins/.jenkins/jobs/_core_master/workspace/core-script/src/main/java/io/jans/service/custom/script/AbstractCustomScriptService.java:[49,11] error: cannot find symbol
[ERROR]  class AbstractCustomScriptService
/home/jenkins/.jenkins/jobs/_core_master/workspace/core-script/src/main/java/io/jans/service/custom/script/AbstractCustomScriptService.java:[53,11] error: cannot find symbol
[ERROR]  class AbstractCustomScriptService
/home/jenkins/.jenkins/jobs/_core_master/workspace/core-script/src/main/java/io/jans/service/custom/script/AbstractCustomScriptService.java:[57,20] error: cannot find symbol
[ERROR]  class AbstractCustomScriptService
/home/jenkins/.jenkins/jobs/_core_master/workspace/core-script/src/main/java/io/jans/service/custom/script/AbstractCustomScriptService.java:[77,16] error: cannot find symbol
[ERROR]  class AbstractCustomScriptService
/home/jenkins/.jenkins/jobs/_core_master/workspace/core-script/src/main/java/io/jans/service/custom/script/AbstractCustomScriptService.java:[85,16] error: cannot find symbol
[ERROR]  class AbstractCustomScriptService
/home/jenkins/.jenkins/jobs/_core_master/workspace/core-script/src/main/java/io/jans/service/custom/script/AbstractCustomScriptService.java:[105,11] error: cannot find symbol
[ERROR]  class AbstractCustomScriptService
/home/jenkins/.jenkins/jobs/_core_master/workspace/core-script/src/main/java/io/jans/service/custom/script/AbstractCustomScriptService.java:[109,16] error: cannot find symbol
[ERROR]  class AbstractCustomScriptService
/home/jenkins/.jenkins/jobs/_core_master/workspace/core-script/src/main/java/io/jans/service/custom/script/AbstractCustomScriptService.java:[121,16] error: cannot find symbol
[ERROR]  class AbstractCustomScriptService
/home/jenkins/.jenkins/jobs/_core_master/workspace/core-script/src/main/java/io/jans/service/custom/script/AbstractCustomScriptService.java:[130,11] error: cannot find symbol
[ERROR]  class AbstractCustomScriptService
/home/jenkins/.jenkins/jobs/_core_master/workspace/core-script/src/main/java/io/jans/service/custom/script/AbstractCustomScriptService.java:[140,30] error: cannot find symbol
[ERROR]  class AbstractCustomScriptService
/home/jenkins/.jenkins/jobs/_core_master/workspace/core-script/src/main/java/io/jans/service/custom/script/AbstractCustomScriptService.java:[147,16] error: cannot find symbol
[ERROR]  class AbstractCustomScriptService
/home/jenkins/.jenkins/jobs/_core_master/workspace/core-script/src/main/java/io/jans/service/custom/script/AbstractCustomScriptService.java:[159,16] error: cannot find symbol
[ERROR]  class AbstractCustomScriptService
/home/jenkins/.jenkins/jobs/_core_master/workspace/core-script/src/main/java/io/jans/service/custom/script/AbstractCustomScriptService.java:[166,16] error: cannot find symbol
[ERROR]  class AbstractCustomScriptService
/home/jenkins/.jenkins/jobs/_core_master/workspace/core-script/src/main/java/io/jans/service/custom/script/AbstractCustomScriptService.java:[172,16] error: cannot find symbol
[ERROR]  class AbstractCustomScriptService
/home/jenkins/.jenkins/jobs/_core_master/workspace/core-script/src/main/java/io/jans/service/custom/script/AbstractCustomScriptService.java:[183,16] error: cannot find symbol
[ERROR]  class AbstractCustomScriptService
/home/jenkins/.jenkins/jobs/_core_master/workspace/core-script/src/main/java/io/jans/service/custom/script/AbstractCustomScriptService.java:[194,16] error: cannot find symbol
[ERROR]  class AbstractCustomScriptService
/home/jenkins/.jenkins/jobs/_core_master/workspace/core-script/src/main/java/io/jans/model/custom/script/CustomScriptType.java:[94,28] error: cannot find symbol
[ERROR]  class CustomScriptType
/home/jenkins/.jenkins/jobs/_core_master/workspace/core-script/src/main/java/io/jans/model/custom/script/CustomScriptType.java:[107,28] error: cannot find symbol
[ERROR]  class CustomScriptType
/home/jenkins/.jenkins/jobs/_core_master/workspace/core-script/src/main/java/io/jans/model/custom/script/CustomScriptType.java:[132,27] error: cannot find symbol
[ERROR]  class CustomScriptType
/home/jenkins/.jenkins/jobs/_core_master/workspace/core-script/src/main/java/io/jans/model/custom/script/conf/CustomScriptConfiguration.java:[19,12] error: cannot find symbol
[ERROR]  class CustomScriptConfiguration
/home/jenkins/.jenkins/jobs/_core_master/workspace/core-script/src/main/java/io/jans/model/custom/script/conf/CustomScriptConfiguration.java:[23,37] error: cannot find symbol
[ERROR]  class CustomScriptConfiguration
/home/jenkins/.jenkins/jobs/_core_master/workspace/core-script/src/main/java/io/jans/model/custom/script/conf/CustomScriptConfiguration.java:[34,11] error: cannot find symbol
[ERROR]  class CustomScriptConfiguration
/home/jenkins/.jenkins/jobs/_core_master/workspace/core-script/src/main/java/io/jans/model/custom/script/type/ciba/DummyEndUserNotificationType.java:[12,40] error: package io.jans.model.custom.script.model does not exist
[ERROR] /home/jenkins/.jenkins/jobs/_core_master/workspace/core-script/src/main/java/io/jans/model/custom/script/type/ciba/DummyEndUserNotificationType.java:[26,24] error: cannot find symbol
[ERROR]  class DummyEndUserNotificationType
/home/jenkins/.jenkins/jobs/_core_master/workspace/core-script/src/main/java/io/jans/model/custom/script/type/scim/DummyScimType.java:[6,40] error: package io.jans.model.custom.script.model does not exist
[ERROR] /home/jenkins/.jenkins/jobs/_core_master/workspace/core-script/src/main/java/io/jans/model/custom/script/type/scim/DummyScimType.java:[19,24] error: cannot find symbol
[ERROR]  class DummyScimType
/home/jenkins/.jenkins/jobs/_core_master/workspace/core-script/src/main/java/io/jans/model/custom/script/type/scope/DummyDynamicScopeType.java:[11,40] error: package io.jans.model.custom.script.model does not exist
[ERROR] /home/jenkins/.jenkins/jobs/_core_master/workspace/core-script/src/main/java/io/jans/model/custom/script/type/scope/DummyDynamicScopeType.java:[18,46] error: cannot find symbol
[ERROR]  class DynamicScopeType
/home/jenkins/.jenkins/jobs/_core_master/workspace/core-script/src/main/java/io/jans/model/custom/script/type/scope/DummyDynamicScopeType.java:[25,24] error: cannot find symbol
[ERROR]  class DummyDynamicScopeType
/home/jenkins/.jenkins/jobs/_core_master/workspace/core-script/src/main/java/io/jans/model/custom/script/type/user/DummyCacheRefreshType.java:[11,40] error: package io.jans.model.custom.script.model does not exist
[ERROR] /home/jenkins/.jenkins/jobs/_core_master/workspace/core-script/src/main/java/io/jans/model/custom/script/type/user/DummyCacheRefreshType.java:[12,45] error: package io.jans.model.custom.script.model.bind does not exist
[ERROR] /home/jenkins/.jenkins/jobs/_core_master/workspace/core-script/src/main/java/io/jans/model/custom/script/type/user/CacheRefreshType.java:[11,45] error: package io.jans.model.custom.script.model.bind does not exist
[ERROR] /home/jenkins/.jenkins/jobs/_core_master/workspace/core-script/src/main/java/io/jans/model/custom/script/type/user/DummyCacheRefreshType.java:[26,24] error: cannot find symbol
[ERROR]  class DummyCacheRefreshType
/home/jenkins/.jenkins/jobs/_core_master/workspace/core-script/src/main/java/io/jans/model/custom/script/type/user/DummyCacheRefreshType.java:[45,11] error: cannot find symbol
[ERROR]  class DummyCacheRefreshType
/home/jenkins/.jenkins/jobs/_core_master/workspace/core-script/src/main/java/io/jans/model/custom/script/type/user/CacheRefreshType.java:[21,11] error: cannot find symbol
[ERROR]  interface CacheRefreshType
/home/jenkins/.jenkins/jobs/_core_master/workspace/core-script/src/main/java/io/jans/model/custom/script/type/id/DummyIdGeneratorType.java:[10,40] error: package io.jans.model.custom.script.model does not exist
[ERROR] /home/jenkins/.jenkins/jobs/_core_master/workspace/core-script/src/main/java/io/jans/model/custom/script/type/id/DummyIdGeneratorType.java:[24,24] error: cannot find symbol
[ERROR]  class DummyIdGeneratorType
/home/jenkins/.jenkins/jobs/_core_master/workspace/core-script/src/main/java/io/jans/model/custom/script/type/uma/UmaDummyRptPolicyType.java:[8,40] error: package io.jans.model.custom.script.model does not exist
[ERROR] /home/jenkins/.jenkins/jobs/_core_master/workspace/core-script/src/main/java/io/jans/model/custom/script/type/uma/UmaDummyRptPolicyType.java:[21,24] error: cannot find symbol
[ERROR]  class UmaDummyRptPolicyType
/home/jenkins/.jenkins/jobs/_core_master/workspace/core-script/src/main/java/io/jans/model/custom/script/type/session/DummyApplicationSessionType.java:[10,40] error: package io.jans.model.custom.script.model does not exist
[ERROR] /home/jenkins/.jenkins/jobs/_core_master/workspace/core-script/src/main/java/io/jans/model/custom/script/type/session/DummyApplicationSessionType.java:[24,24] error: cannot find symbol
[ERROR]  class DummyApplicationSessionType
/home/jenkins/.jenkins/jobs/_core_master/workspace/core-script/src/main/java/io/jans/model/custom/script/type/auth/DummyPersonAuthenticationType.java:[14,40] error: package io.jans.model.custom.script.model does not exist
[ERROR] /home/jenkins/.jenkins/jobs/_core_master/workspace/core-script/src/main/java/io/jans/model/custom/script/type/auth/DummyPersonAuthenticationType.java:[28,24] error: cannot find symbol
[ERROR]  class DummyPersonAuthenticationType
/home/jenkins/.jenkins/jobs/_core_master/workspace/core-script/src/main/java/io/jans/model/custom/script/type/user/DummyUpdateUserType.java:[11,40] error: package io.jans.model.custom.script.model does not exist
[ERROR] /home/jenkins/.jenkins/jobs/_core_master/workspace/core-script/src/main/java/io/jans/model/custom/script/type/user/DummyUpdateUserType.java:[26,24] error: cannot find symbol
[ERROR]  class DummyUpdateUserType
/home/jenkins/.jenkins/jobs/_core_master/workspace/core-script/src/main/java/io/jans/model/custom/script/type/persistence/DummyPeristenceType.java:[10,40] error: package io.jans.model.custom.script.model does not exist
[ERROR] /home/jenkins/.jenkins/jobs/_core_master/workspace/core-script/src/main/java/io/jans/model/custom/script/type/persistence/DummyPeristenceType.java:[25,21] error: cannot find symbol
[ERROR]  class DummyPeristenceType
/home/jenkins/.jenkins/jobs/_core_master/workspace/core-script/src/main/java/io/jans/model/custom/script/type/postauthn/DummyPostAuthnType.java:[6,40] error: package io.jans.model.custom.script.model does not exist
[ERROR] /home/jenkins/.jenkins/jobs/_core_master/workspace/core-script/src/main/java/io/jans/model/custom/script/type/postauthn/DummyPostAuthnType.java:[28,24] error: cannot find symbol
[ERROR]  class DummyPostAuthnType
/home/jenkins/.jenkins/jobs/_core_master/workspace/core-script/src/main/java/io/jans/model/custom/script/type/user/DummyUserRegistrationType.java:[11,40] error: package io.jans.model.custom.script.model does not exist
[ERROR] /home/jenkins/.jenkins/jobs/_core_master/workspace/core-script/src/main/java/io/jans/model/custom/script/type/user/DummyUserRegistrationType.java:[25,24] error: cannot find symbol
[ERROR]  class DummyUserRegistrationType
/home/jenkins/.jenkins/jobs/_core_master/workspace/core-script/src/main/java/io/jans/model/custom/script/type/logout/DummyEndSessionType.java:[6,40] error: package io.jans.model.custom.script.model does not exist
[ERROR] /home/jenkins/.jenkins/jobs/_core_master/workspace/core-script/src/main/java/io/jans/model/custom/script/type/logout/DummyEndSessionType.java:[17,24] error: cannot find symbol
[ERROR]  class DummyEndSessionType
/home/jenkins/.jenkins/jobs/_core_master/workspace/core-script/src/main/java/io/jans/model/custom/script/type/uma/UmaDummyRptClaimsType.java:[4,40] error: package io.jans.model.custom.script.model does not exist
[ERROR] /home/jenkins/.jenkins/jobs/_core_master/workspace/core-script/src/main/java/io/jans/model/custom/script/type/uma/UmaDummyRptClaimsType.java:[11,46] error: cannot find symbol
[ERROR]  class UmaRptClaimsType
/home/jenkins/.jenkins/jobs/_core_master/workspace/core-script/src/main/java/io/jans/model/custom/script/type/uma/UmaDummyRptClaimsType.java:[24,24] error: cannot find symbol
[ERROR]  class UmaDummyRptClaimsType
/home/jenkins/.jenkins/jobs/_core_master/workspace/core-script/src/main/java/io/jans/model/custom/script/type/idp/DummyIdpType.java:[10,40] error: package io.jans.model.custom.script.model does not exist
[ERROR] /home/jenkins/.jenkins/jobs/_core_master/workspace/core-script/src/main/java/io/jans/model/custom/script/type/idp/DummyIdpType.java:[25,21] error: cannot find symbol
[ERROR]  class DummyIdpType
/home/jenkins/.jenkins/jobs/_core_master/workspace/core-script/src/main/java/io/jans/model/custom/script/type/client/DummyClientRegistrationType.java:[8,40] error: package io.jans.model.custom.script.model does not exist
[ERROR] /home/jenkins/.jenkins/jobs/_core_master/workspace/core-script/src/main/java/io/jans/model/custom/script/type/client/DummyClientRegistrationType.java:[23,24] error: cannot find symbol
[ERROR]  class DummyClientRegistrationType
/home/jenkins/.jenkins/jobs/_core_master/workspace/core-script/src/main/java/io/jans/model/custom/script/type/spontaneous/DummySpontaneousScopeType.java:[6,40] error: package io.jans.model.custom.script.model does not exist
[ERROR] /home/jenkins/.jenkins/jobs/_core_master/workspace/core-script/src/main/java/io/jans/model/custom/script/type/spontaneous/DummySpontaneousScopeType.java:[8,50] error: cannot find symbol
[ERROR]  class SpontaneousScopeType
/home/jenkins/.jenkins/jobs/_core_master/workspace/core-script/src/main/java/io/jans/model/custom/script/type/spontaneous/DummySpontaneousScopeType.java:[15,21] error: cannot find symbol
[INFO] 100 errors 
[INFO] -------------------------------------------------------------
[INFO] ------------------------------------------------------------------------
[INFO] Reactor Summary:
[INFO] 
[INFO] core ............................................... SUCCESS [  0.263 s]
[INFO] oxUtil ............................................. SUCCESS [  3.682 s]
[INFO] core-model ......................................... SUCCESS [  1.411 s]
[INFO] Caches support ..................................... SUCCESS [  2.019 s]
[INFO] Caches support ..................................... SUCCESS [  2.318 s]
[INFO] Configuration factories for standalone applications  SUCCESS [  0.311 s]
[INFO] oxSaml ............................................. SUCCESS [  0.386 s]
[INFO] core-cdi ........................................... SUCCESS [  0.713 s]
[INFO] core-script ........................................ FAILURE [  1.143 s]
[INFO] core-service ....................................... SKIPPED
[INFO] oxJsfUtil .......................................... SKIPPED
[INFO] Java extensions .................................... SKIPPED
[INFO] Weld CDI timer implementation ...................... SKIPPED
[INFO] security-extension-cdi ............................. SKIPPED
[INFO] exception-extension-cdi ............................ SKIPPED
[INFO] Web application specific classes ................... SKIPPED
[INFO] oxRadius ........................................... SKIPPED
[INFO] Demo CDI services .................................. SKIPPED
[INFO] ------------------------------------------------------------------------
[INFO] BUILD FAILURE
[INFO] ------------------------------------------------------------------------
[INFO] Total time: 13.212 s
[INFO] Finished at: 2020-10-06T12:36:24+00:00
[INFO] Final Memory: 81M/778M
[INFO] ------------------------------------------------------------------------
[ERROR] Failed to execute goal org.apache.maven.plugins:maven-compiler-plugin:2.3.2:compile (default-compile) on project core-script: Compilation failure: Compilation failure:
[ERROR] /home/jenkins/.jenkins/jobs/_core_master/workspace/core-script/src/main/java/io/jans/model/custom/script/type/uma/UmaDummyClaimsGatheringType.java:[6,40] error: package io.jans.model.custom.script.model does not exist
[ERROR] /home/jenkins/.jenkins/jobs/_core_master/workspace/core-script/src/main/java/io/jans/model/custom/script/type/BaseExternalType.java:[10,40] error: package io.jans.model.custom.script.model does not exist
[ERROR] /home/jenkins/.jenkins/jobs/_core_master/workspace/core-script/src/main/java/io/jans/model/custom/script/type/uma/UmaDummyClaimsGatheringType.java:[43,24] error: cannot find symbol
[ERROR] class UmaDummyClaimsGatheringType
[ERROR] /home/jenkins/.jenkins/jobs/_core_master/workspace/core-script/src/main/java/io/jans/model/custom/script/type/BaseExternalType.java:[21,17] error: cannot find symbol
[ERROR] interface BaseExternalType
[ERROR] /home/jenkins/.jenkins/jobs/_core_master/workspace/core-script/src/main/java/io/jans/service/custom/script/CustomScriptManager.java:[41,40] error: package io.jans.model.custom.script.model does not exist
[ERROR] /home/jenkins/.jenkins/jobs/_core_master/workspace/core-script/src/main/java/io/jans/service/custom/script/CustomScriptManager.java:[42,40] error: package io.jans.model.custom.script.model does not exist
[ERROR] /home/jenkins/.jenkins/jobs/_core_master/workspace/core-script/src/main/java/io/jans/service/custom/script/ExternalScriptService.java:[21,40] error: package io.jans.model.custom.script.model does not exist
[ERROR] /home/jenkins/.jenkins/jobs/_core_master/workspace/core-script/src/main/java/io/jans/service/PythonService.java:[23,24] error: package io.jans.exception does not exist
[ERROR] /home/jenkins/.jenkins/jobs/_core_master/workspace/core-script/src/main/java/io/jans/service/custom/script/AbstractCustomScriptService.java:[10,40] error: package io.jans.model.custom.script.model does not exist
[ERROR] /home/jenkins/.jenkins/jobs/_core_master/workspace/core-script/src/main/java/io/jans/model/custom/script/CustomScriptType.java:[9,40] error: package io.jans.model.custom.script.model does not exist
[ERROR] /home/jenkins/.jenkins/jobs/_core_master/workspace/core-script/src/main/java/io/jans/model/custom/script/CustomScriptType.java:[10,45] error: package io.jans.model.custom.script.model.auth does not exist
[ERROR] /home/jenkins/.jenkins/jobs/_core_master/workspace/core-script/src/main/java/io/jans/model/custom/script/CustomScriptType.java:[14,45] error: cannot find symbol
[ERROR] package io.jans.model.custom.script.type.authz
[ERROR] /home/jenkins/.jenkins/jobs/_core_master/workspace/core-script/src/main/java/io/jans/model/custom/script/CustomScriptType.java:[23,53] error: package io.jans.model.custom.script.type.introspection does not exist
[ERROR] /home/jenkins/.jenkins/jobs/_core_master/workspace/core-script/src/main/java/io/jans/model/custom/script/CustomScriptType.java:[24,53] error: package io.jans.model.custom.script.type.introspection does not exist
[ERROR] /home/jenkins/.jenkins/jobs/_core_master/workspace/core-script/src/main/java/io/jans/model/custom/script/CustomScriptType.java:[27,45] error: package io.jans.model.custom.script.type.owner does not exist
[ERROR] /home/jenkins/.jenkins/jobs/_core_master/workspace/core-script/src/main/java/io/jans/model/custom/script/CustomScriptType.java:[28,45] error: package io.jans.model.custom.script.type.owner does not exist
[ERROR] /home/jenkins/.jenkins/jobs/_core_master/workspace/core-script/src/main/java/io/jans/model/custom/script/CustomScriptType.java:[36,45] error: cannot find symbol
[ERROR] package io.jans.model.custom.script.type.scope
[ERROR] /home/jenkins/.jenkins/jobs/_core_master/workspace/core-script/src/main/java/io/jans/model/custom/script/CustomScriptType.java:[40,51] error: cannot find symbol
[ERROR] package io.jans.model.custom.script.type.spontaneous
[ERROR] /home/jenkins/.jenkins/jobs/_core_master/workspace/core-script/src/main/java/io/jans/model/custom/script/CustomScriptType.java:[44,0] error: package org.gluu.model.custom.script.type.uma does not exist
[ERROR] /home/jenkins/.jenkins/jobs/_core_master/workspace/core-script/src/main/java/io/jans/model/custom/script/CustomScriptType.java:[45,0] error: package org.gluu.model.custom.script.type.user does not exist
[ERROR] /home/jenkins/.jenkins/jobs/_core_master/workspace/core-script/src/main/java/io/jans/model/custom/script/conf/CustomScriptConfiguration.java:[10,40] error: package io.jans.model.custom.script.model does not exist
[ERROR] /home/jenkins/.jenkins/jobs/_core_master/workspace/core-script/src/main/java/io/jans/service/custom/script/CustomScriptManager.java:[211,75] error: cannot find symbol
[ERROR] class CustomScriptManager
[ERROR] /home/jenkins/.jenkins/jobs/_core_master/workspace/core-script/src/main/java/io/jans/service/custom/script/CustomScriptManager.java:[380,45] error: cannot find symbol
[ERROR] class CustomScriptManager
[ERROR] /home/jenkins/.jenkins/jobs/_core_master/workspace/core-script/src/main/java/io/jans/service/custom/script/CustomScriptManager.java:[404,73] error: cannot find symbol
[ERROR] class CustomScriptManager
[ERROR] /home/jenkins/.jenkins/jobs/_core_master/workspace/core-script/src/main/java/io/jans/service/custom/script/CustomScriptManager.java:[464,29] error: cannot find symbol
[ERROR] class CustomScriptManager
[ERROR] /home/jenkins/.jenkins/jobs/_core_master/workspace/core-script/src/main/java/io/jans/service/custom/script/CustomScriptManager.java:[468,29] error: cannot find symbol
[ERROR] class CustomScriptManager
[ERROR] /home/jenkins/.jenkins/jobs/_core_master/workspace/core-script/src/main/java/io/jans/service/custom/script/CustomScriptManager.java:[476,36] error: cannot find symbol
[ERROR] class CustomScriptManager
[ERROR] /home/jenkins/.jenkins/jobs/_core_master/workspace/core-script/src/main/java/io/jans/service/custom/script/CustomScriptManager.java:[500,30] error: cannot find symbol
[ERROR] class CustomScriptManager
[ERROR] /home/jenkins/.jenkins/jobs/_core_master/workspace/core-script/src/main/java/io/jans/service/custom/script/CustomScriptManager.java:[508,37] error: cannot find symbol
[ERROR] class CustomScriptManager
[ERROR] /home/jenkins/.jenkins/jobs/_core_master/workspace/core-script/src/main/java/io/jans/service/custom/script/ExternalScriptService.java:[133,32] error: cannot find symbol
[ERROR] class ExternalScriptService
[ERROR] /home/jenkins/.jenkins/jobs/_core_master/workspace/core-script/src/main/java/io/jans/service/custom/script/ExternalScriptService.java:[137,33] error: cannot find symbol
[ERROR] class ExternalScriptService
[ERROR] /home/jenkins/.jenkins/jobs/_core_master/workspace/core-script/src/main/java/io/jans/service/PythonService.java:[156,19] error: cannot find symbol
[ERROR] class PythonService
[ERROR] /home/jenkins/.jenkins/jobs/_core_master/workspace/core-script/src/main/java/io/jans/service/PythonService.java:[175,47] error: cannot find symbol
[ERROR] class PythonService
[ERROR] /home/jenkins/.jenkins/jobs/_core_master/workspace/core-script/src/main/java/io/jans/service/PythonService.java:[195,19] error: cannot find symbol
[ERROR] class PythonService
[ERROR] /home/jenkins/.jenkins/jobs/_core_master/workspace/core-script/src/main/java/io/jans/service/custom/script/AbstractCustomScriptService.java:[37,20] error: cannot find symbol
[ERROR] class AbstractCustomScriptService
[ERROR] /home/jenkins/.jenkins/jobs/_core_master/workspace/core-script/src/main/java/io/jans/service/custom/script/AbstractCustomScriptService.java:[41,23] error: cannot find symbol
[ERROR] class AbstractCustomScriptService
[ERROR] /home/jenkins/.jenkins/jobs/_core_master/workspace/core-script/src/main/java/io/jans/service/custom/script/AbstractCustomScriptService.java:[45,23] error: cannot find symbol
[ERROR] class AbstractCustomScriptService
[ERROR] /home/jenkins/.jenkins/jobs/_core_master/workspace/core-script/src/main/java/io/jans/service/custom/script/AbstractCustomScriptService.java:[49,11] error: cannot find symbol
[ERROR] class AbstractCustomScriptService
[ERROR] /home/jenkins/.jenkins/jobs/_core_master/workspace/core-script/src/main/java/io/jans/service/custom/script/AbstractCustomScriptService.java:[53,11] error: cannot find symbol
[ERROR] class AbstractCustomScriptService
[ERROR] /home/jenkins/.jenkins/jobs/_core_master/workspace/core-script/src/main/java/io/jans/service/custom/script/AbstractCustomScriptService.java:[57,20] error: cannot find symbol
[ERROR] class AbstractCustomScriptService
[ERROR] /home/jenkins/.jenkins/jobs/_core_master/workspace/core-script/src/main/java/io/jans/service/custom/script/AbstractCustomScriptService.java:[77,16] error: cannot find symbol
[ERROR] class AbstractCustomScriptService
[ERROR] /home/jenkins/.jenkins/jobs/_core_master/workspace/core-script/src/main/java/io/jans/service/custom/script/AbstractCustomScriptService.java:[85,16] error: cannot find symbol
[ERROR] class AbstractCustomScriptService
[ERROR] /home/jenkins/.jenkins/jobs/_core_master/workspace/core-script/src/main/java/io/jans/service/custom/script/AbstractCustomScriptService.java:[105,11] error: cannot find symbol
[ERROR] class AbstractCustomScriptService
[ERROR] /home/jenkins/.jenkins/jobs/_core_master/workspace/core-script/src/main/java/io/jans/service/custom/script/AbstractCustomScriptService.java:[109,16] error: cannot find symbol
[ERROR] class AbstractCustomScriptService
[ERROR] /home/jenkins/.jenkins/jobs/_core_master/workspace/core-script/src/main/java/io/jans/service/custom/script/AbstractCustomScriptService.java:[121,16] error: cannot find symbol
[ERROR] class AbstractCustomScriptService
[ERROR] /home/jenkins/.jenkins/jobs/_core_master/workspace/core-script/src/main/java/io/jans/service/custom/script/AbstractCustomScriptService.java:[130,11] error: cannot find symbol
[ERROR] class AbstractCustomScriptService
[ERROR] /home/jenkins/.jenkins/jobs/_core_master/workspace/core-script/src/main/java/io/jans/service/custom/script/AbstractCustomScriptService.java:[140,30] error: cannot find symbol
[ERROR] class AbstractCustomScriptService
[ERROR] /home/jenkins/.jenkins/jobs/_core_master/workspace/core-script/src/main/java/io/jans/service/custom/script/AbstractCustomScriptService.java:[147,16] error: cannot find symbol
[ERROR] class AbstractCustomScriptService
[ERROR] /home/jenkins/.jenkins/jobs/_core_master/workspace/core-script/src/main/java/io/jans/service/custom/script/AbstractCustomScriptService.java:[159,16] error: cannot find symbol
[ERROR] class AbstractCustomScriptService
[ERROR] /home/jenkins/.jenkins/jobs/_core_master/workspace/core-script/src/main/java/io/jans/service/custom/script/AbstractCustomScriptService.java:[166,16] error: cannot find symbol
[ERROR] class AbstractCustomScriptService
[ERROR] /home/jenkins/.jenkins/jobs/_core_master/workspace/core-script/src/main/java/io/jans/service/custom/script/AbstractCustomScriptService.java:[172,16] error: cannot find symbol
[ERROR] class AbstractCustomScriptService
[ERROR] /home/jenkins/.jenkins/jobs/_core_master/workspace/core-script/src/main/java/io/jans/service/custom/script/AbstractCustomScriptService.java:[183,16] error: cannot find symbol
[ERROR] class AbstractCustomScriptService
[ERROR] /home/jenkins/.jenkins/jobs/_core_master/workspace/core-script/src/main/java/io/jans/service/custom/script/AbstractCustomScriptService.java:[194,16] error: cannot find symbol
[ERROR] class AbstractCustomScriptService
[ERROR] /home/jenkins/.jenkins/jobs/_core_master/workspace/core-script/src/main/java/io/jans/model/custom/script/CustomScriptType.java:[94,28] error: cannot find symbol
[ERROR] class CustomScriptType
[ERROR] /home/jenkins/.jenkins/jobs/_core_master/workspace/core-script/src/main/java/io/jans/model/custom/script/CustomScriptType.java:[107,28] error: cannot find symbol
[ERROR] class CustomScriptType
[ERROR] /home/jenkins/.jenkins/jobs/_core_master/workspace/core-script/src/main/java/io/jans/model/custom/script/CustomScriptType.java:[132,27] error: cannot find symbol
[ERROR] class CustomScriptType
[ERROR] /home/jenkins/.jenkins/jobs/_core_master/workspace/core-script/src/main/java/io/jans/model/custom/script/conf/CustomScriptConfiguration.java:[19,12] error: cannot find symbol
[ERROR] class CustomScriptConfiguration
[ERROR] /home/jenkins/.jenkins/jobs/_core_master/workspace/core-script/src/main/java/io/jans/model/custom/script/conf/CustomScriptConfiguration.java:[23,37] error: cannot find symbol
[ERROR] class CustomScriptConfiguration
[ERROR] /home/jenkins/.jenkins/jobs/_core_master/workspace/core-script/src/main/java/io/jans/model/custom/script/conf/CustomScriptConfiguration.java:[34,11] error: cannot find symbol
[ERROR] class CustomScriptConfiguration
[ERROR] /home/jenkins/.jenkins/jobs/_core_master/workspace/core-script/src/main/java/io/jans/model/custom/script/type/ciba/DummyEndUserNotificationType.java:[12,40] error: package io.jans.model.custom.script.model does not exist
[ERROR] /home/jenkins/.jenkins/jobs/_core_master/workspace/core-script/src/main/java/io/jans/model/custom/script/type/ciba/DummyEndUserNotificationType.java:[26,24] error: cannot find symbol
[ERROR] class DummyEndUserNotificationType
[ERROR] /home/jenkins/.jenkins/jobs/_core_master/workspace/core-script/src/main/java/io/jans/model/custom/script/type/scim/DummyScimType.java:[6,40] error: package io.jans.model.custom.script.model does not exist
[ERROR] /home/jenkins/.jenkins/jobs/_core_master/workspace/core-script/src/main/java/io/jans/model/custom/script/type/scim/DummyScimType.java:[19,24] error: cannot find symbol
[ERROR] class DummyScimType
[ERROR] /home/jenkins/.jenkins/jobs/_core_master/workspace/core-script/src/main/java/io/jans/model/custom/script/type/scope/DummyDynamicScopeType.java:[11,40] error: package io.jans.model.custom.script.model does not exist
[ERROR] /home/jenkins/.jenkins/jobs/_core_master/workspace/core-script/src/main/java/io/jans/model/custom/script/type/scope/DummyDynamicScopeType.java:[18,46] error: cannot find symbol
[ERROR] class DynamicScopeType
[ERROR] /home/jenkins/.jenkins/jobs/_core_master/workspace/core-script/src/main/java/io/jans/model/custom/script/type/scope/DummyDynamicScopeType.java:[25,24] error: cannot find symbol
[ERROR] class DummyDynamicScopeType
[ERROR] /home/jenkins/.jenkins/jobs/_core_master/workspace/core-script/src/main/java/io/jans/model/custom/script/type/user/DummyCacheRefreshType.java:[11,40] error: package io.jans.model.custom.script.model does not exist
[ERROR] /home/jenkins/.jenkins/jobs/_core_master/workspace/core-script/src/main/java/io/jans/model/custom/script/type/user/DummyCacheRefreshType.java:[12,45] error: package io.jans.model.custom.script.model.bind does not exist
[ERROR] /home/jenkins/.jenkins/jobs/_core_master/workspace/core-script/src/main/java/io/jans/model/custom/script/type/user/CacheRefreshType.java:[11,45] error: package io.jans.model.custom.script.model.bind does not exist
[ERROR] /home/jenkins/.jenkins/jobs/_core_master/workspace/core-script/src/main/java/io/jans/model/custom/script/type/user/DummyCacheRefreshType.java:[26,24] error: cannot find symbol
[ERROR] class DummyCacheRefreshType
[ERROR] /home/jenkins/.jenkins/jobs/_core_master/workspace/core-script/src/main/java/io/jans/model/custom/script/type/user/DummyCacheRefreshType.java:[45,11] error: cannot find symbol
[ERROR] class DummyCacheRefreshType
[ERROR] /home/jenkins/.jenkins/jobs/_core_master/workspace/core-script/src/main/java/io/jans/model/custom/script/type/user/CacheRefreshType.java:[21,11] error: cannot find symbol
[ERROR] interface CacheRefreshType
[ERROR] /home/jenkins/.jenkins/jobs/_core_master/workspace/core-script/src/main/java/io/jans/model/custom/script/type/id/DummyIdGeneratorType.java:[10,40] error: package io.jans.model.custom.script.model does not exist
[ERROR] /home/jenkins/.jenkins/jobs/_core_master/workspace/core-script/src/main/java/io/jans/model/custom/script/type/id/DummyIdGeneratorType.java:[24,24] error: cannot find symbol
[ERROR] class DummyIdGeneratorType
[ERROR] /home/jenkins/.jenkins/jobs/_core_master/workspace/core-script/src/main/java/io/jans/model/custom/script/type/uma/UmaDummyRptPolicyType.java:[8,40] error: package io.jans.model.custom.script.model does not exist
[ERROR] /home/jenkins/.jenkins/jobs/_core_master/workspace/core-script/src/main/java/io/jans/model/custom/script/type/uma/UmaDummyRptPolicyType.java:[21,24] error: cannot find symbol
[ERROR] class UmaDummyRptPolicyType
[ERROR] /home/jenkins/.jenkins/jobs/_core_master/workspace/core-script/src/main/java/io/jans/model/custom/script/type/session/DummyApplicationSessionType.java:[10,40] error: package io.jans.model.custom.script.model does not exist
[ERROR] /home/jenkins/.jenkins/jobs/_core_master/workspace/core-script/src/main/java/io/jans/model/custom/script/type/session/DummyApplicationSessionType.java:[24,24] error: cannot find symbol
[ERROR] class DummyApplicationSessionType
[ERROR] /home/jenkins/.jenkins/jobs/_core_master/workspace/core-script/src/main/java/io/jans/model/custom/script/type/auth/DummyPersonAuthenticationType.java:[14,40] error: package io.jans.model.custom.script.model does not exist
[ERROR] /home/jenkins/.jenkins/jobs/_core_master/workspace/core-script/src/main/java/io/jans/model/custom/script/type/auth/DummyPersonAuthenticationType.java:[28,24] error: cannot find symbol
[ERROR] class DummyPersonAuthenticationType
[ERROR] /home/jenkins/.jenkins/jobs/_core_master/workspace/core-script/src/main/java/io/jans/model/custom/script/type/user/DummyUpdateUserType.java:[11,40] error: package io.jans.model.custom.script.model does not exist
[ERROR] /home/jenkins/.jenkins/jobs/_core_master/workspace/core-script/src/main/java/io/jans/model/custom/script/type/user/DummyUpdateUserType.java:[26,24] error: cannot find symbol
[ERROR] class DummyUpdateUserType
[ERROR] /home/jenkins/.jenkins/jobs/_core_master/workspace/core-script/src/main/java/io/jans/model/custom/script/type/persistence/DummyPeristenceType.java:[10,40] error: package io.jans.model.custom.script.model does not exist
[ERROR] /home/jenkins/.jenkins/jobs/_core_master/workspace/core-script/src/main/java/io/jans/model/custom/script/type/persistence/DummyPeristenceType.java:[25,21] error: cannot find symbol
[ERROR] class DummyPeristenceType
[ERROR] /home/jenkins/.jenkins/jobs/_core_master/workspace/core-script/src/main/java/io/jans/model/custom/script/type/postauthn/DummyPostAuthnType.java:[6,40] error: package io.jans.model.custom.script.model does not exist
[ERROR] /home/jenkins/.jenkins/jobs/_core_master/workspace/core-script/src/main/java/io/jans/model/custom/script/type/postauthn/DummyPostAuthnType.java:[28,24] error: cannot find symbol
[ERROR] class DummyPostAuthnType
[ERROR] /home/jenkins/.jenkins/jobs/_core_master/workspace/core-script/src/main/java/io/jans/model/custom/script/type/user/DummyUserRegistrationType.java:[11,40] error: package io.jans.model.custom.script.model does not exist
[ERROR] /home/jenkins/.jenkins/jobs/_core_master/workspace/core-script/src/main/java/io/jans/model/custom/script/type/user/DummyUserRegistrationType.java:[25,24] error: cannot find symbol
[ERROR] class DummyUserRegistrationType
[ERROR] /home/jenkins/.jenkins/jobs/_core_master/workspace/core-script/src/main/java/io/jans/model/custom/script/type/logout/DummyEndSessionType.java:[6,40] error: package io.jans.model.custom.script.model does not exist
[ERROR] /home/jenkins/.jenkins/jobs/_core_master/workspace/core-script/src/main/java/io/jans/model/custom/script/type/logout/DummyEndSessionType.java:[17,24] error: cannot find symbol
[ERROR] class DummyEndSessionType
[ERROR] /home/jenkins/.jenkins/jobs/_core_master/workspace/core-script/src/main/java/io/jans/model/custom/script/type/uma/UmaDummyRptClaimsType.java:[4,40] error: package io.jans.model.custom.script.model does not exist
[ERROR] /home/jenkins/.jenkins/jobs/_core_master/workspace/core-script/src/main/java/io/jans/model/custom/script/type/uma/UmaDummyRptClaimsType.java:[11,46] error: cannot find symbol
[ERROR] class UmaRptClaimsType
[ERROR] /home/jenkins/.jenkins/jobs/_core_master/workspace/core-script/src/main/java/io/jans/model/custom/script/type/uma/UmaDummyRptClaimsType.java:[24,24] error: cannot find symbol
[ERROR] class UmaDummyRptClaimsType
[ERROR] /home/jenkins/.jenkins/jobs/_core_master/workspace/core-script/src/main/java/io/jans/model/custom/script/type/idp/DummyIdpType.java:[10,40] error: package io.jans.model.custom.script.model does not exist
[ERROR] /home/jenkins/.jenkins/jobs/_core_master/workspace/core-script/src/main/java/io/jans/model/custom/script/type/idp/DummyIdpType.java:[25,21] error: cannot find symbol
[ERROR] class DummyIdpType
[ERROR] /home/jenkins/.jenkins/jobs/_core_master/workspace/core-script/src/main/java/io/jans/model/custom/script/type/client/DummyClientRegistrationType.java:[8,40] error: package io.jans.model.custom.script.model does not exist
[ERROR] /home/jenkins/.jenkins/jobs/_core_master/workspace/core-script/src/main/java/io/jans/model/custom/script/type/client/DummyClientRegistrationType.java:[23,24] error: cannot find symbol
[ERROR] class DummyClientRegistrationType
[ERROR] /home/jenkins/.jenkins/jobs/_core_master/workspace/core-script/src/main/java/io/jans/model/custom/script/type/spontaneous/DummySpontaneousScopeType.java:[6,40] error: package io.jans.model.custom.script.model does not exist
[ERROR] /home/jenkins/.jenkins/jobs/_core_master/workspace/core-script/src/main/java/io/jans/model/custom/script/type/spontaneous/DummySpontaneousScopeType.java:[8,50] error: cannot find symbol
[ERROR] class SpontaneousScopeType
[ERROR] /home/jenkins/.jenkins/jobs/_core_master/workspace/core-script/src/main/java/io/jans/model/custom/script/type/spontaneous/DummySpontaneousScopeType.java:[15,21] error: cannot find symbol
[ERROR] -> [Help 1]
[ERROR] 
[ERROR] To see the full stack trace of the errors, re-run Maven with the -e switch.
[ERROR] Re-run Maven using the -X switch to enable full debug logging.
[ERROR] 
[ERROR] For more information about the errors and possible solutions, please read the following articles:
[ERROR] [Help 1] http://cwiki.apache.org/confluence/display/MAVEN/MojoFailureException
[ERROR] 
[ERROR] After correcting the problems, you can resume the build with the command
[ERROR]   mvn <goals> -rf :core-script
Build step 'Invoke top-level Maven targets' marked build as failure
[FINDBUGS] Skipping publisher since build result is FAILURE
TestNG Reports Processing: START
Looking for TestNG results report in workspace using pattern: **/testng-results.xml
testng-results.xml was last modified before this build started. Ignoring it.
testng-results.xml was last modified before this build started. Ignoring it.
testng-results.xml was last modified before this build started. Ignoring it.
Saving reports...
Processing '/home/jenkins/.jenkins/jobs/_core_master/builds/20/testng/testng-results.xml'
TestNG Reports Processing: FINISH
Not sending mail to unregistered user yzabrovarniy@gmail.com
Sending e-mails to: support@gluu.org
Finished: FAILURE