FailedConsole Output

Started by an SCM change
Running as SYSTEM
Building on master in workspace /home/jenkins/.jenkins/jobs/_core_master/workspace
The recommended git tool is: NONE
No credentials specified
 > git rev-parse --is-inside-work-tree # timeout=10
Fetching changes from the remote Git repository
 > git config remote.origin.url https://github.com/JanssenProject/core # timeout=10
Fetching upstream changes from https://github.com/JanssenProject/core
 > git --version # timeout=10
 > git --version # 'git version 1.8.3.1'
 > git fetch --tags --progress https://github.com/JanssenProject/core +refs/heads/*:refs/remotes/origin/* # timeout=10
 > git rev-parse refs/remotes/origin/master^{commit} # timeout=10
 > git rev-parse refs/remotes/origin/origin/master^{commit} # timeout=10
Checking out Revision c54f0ab05305a9794c8b584c3601714465bcf588 (refs/remotes/origin/master)
 > git config core.sparsecheckout # timeout=10
 > git checkout -f c54f0ab05305a9794c8b584c3601714465bcf588 # timeout=10
Commit message: "Fixed references according to new bom and persistence artifacts."
 > git rev-list --no-walk d0cbadec9f98ebf759055c93d3b9eb759aef15fa # timeout=10
[workspace] $ /home/jenkins/.jenkins/tools/hudson.tasks.Maven_MavenInstallation/maven_3.3.9/bin/mvn -DVERSION_NAME=master -DMAVEN_SKIP_TESTS=false -Dmaven.test.skip=false clean compile install
[INFO] Scanning for projects...
[INFO] ------------------------------------------------------------------------
[INFO] Reactor Build Order:
[INFO] 
[INFO] core
[INFO] oxUtil
[INFO] core-model
[INFO] Caches support
[INFO] Caches support
[INFO] Configuration factories for standalone applications
[INFO] oxSaml
[INFO] core-cdi
[INFO] core-script
[INFO] core-service
[INFO] oxJsfUtil
[INFO] Java extensions
[INFO] Weld CDI timer implementation
[INFO] security-extension-cdi
[INFO] exception-extension-cdi
[INFO] Web application specific classes
[INFO] oxRadius
[INFO] Demo CDI services
[INFO]                                                                         
[INFO] ------------------------------------------------------------------------
[INFO] Building core 5.0.0-SNAPSHOT
[INFO] ------------------------------------------------------------------------
[INFO] 
[INFO] --- maven-clean-plugin:2.4.1:clean (default-clean) @ core ---
[INFO] 
[INFO] --- maven-install-plugin:2.3.1:install (default-install) @ core ---
[INFO] Installing /home/jenkins/.jenkins/jobs/_core_master/workspace/pom.xml to /var/www/html/maven/io/jans/core/5.0.0-SNAPSHOT/core-5.0.0-SNAPSHOT.pom
[INFO]                                                                         
[INFO] ------------------------------------------------------------------------
[INFO] Building oxUtil 5.0.0-SNAPSHOT
[INFO] ------------------------------------------------------------------------
[INFO] 
[INFO] --- maven-clean-plugin:2.4.1:clean (default-clean) @ core-util ---
[INFO] Deleting /home/jenkins/.jenkins/jobs/_core_master/workspace/oxUtil/target
[INFO] 
[INFO] --- maven-resources-plugin:2.4:resources (default-resources) @ core-util ---
[INFO] Using 'UTF-8' encoding to copy filtered resources.
[INFO] skip non existing resourceDirectory /home/jenkins/.jenkins/jobs/_core_master/workspace/oxUtil/src/main/resources
[INFO] 
[INFO] --- maven-compiler-plugin:2.3.2:compile (default-compile) @ core-util ---
[INFO] Compiling 57 source files to /home/jenkins/.jenkins/jobs/_core_master/workspace/oxUtil/target/classes
[INFO] 
[INFO] --- maven-resources-plugin:2.4:resources (default-resources) @ core-util ---
[INFO] Using 'UTF-8' encoding to copy filtered resources.
[INFO] skip non existing resourceDirectory /home/jenkins/.jenkins/jobs/_core_master/workspace/oxUtil/src/main/resources
[INFO] 
[INFO] --- maven-compiler-plugin:2.3.2:compile (default-compile) @ core-util ---
[INFO] Nothing to compile - all classes are up to date
[INFO] 
[INFO] --- maven-resources-plugin:2.4:testResources (default-testResources) @ core-util ---
[INFO] Using 'UTF-8' encoding to copy filtered resources.
[INFO] skip non existing resourceDirectory /home/jenkins/.jenkins/jobs/_core_master/workspace/oxUtil/src/test/resources
[INFO] 
[INFO] --- maven-compiler-plugin:2.3.2:testCompile (default-testCompile) @ core-util ---
[INFO] No sources to compile
[INFO] 
[INFO] --- maven-surefire-plugin:2.7.2:test (default-test) @ core-util ---
[INFO] No tests to run.
[INFO] Surefire report directory: /home/jenkins/.jenkins/jobs/_core_master/workspace/oxUtil/target/surefire-reports

-------------------------------------------------------
 T E S T S
-------------------------------------------------------
There are no tests to run.

Results :

Tests run: 0, Failures: 0, Errors: 0, Skipped: 0

[INFO] 
[INFO] --- maven-jar-plugin:2.4:jar (default-jar) @ core-util ---
[INFO] Building jar: /home/jenkins/.jenkins/jobs/_core_master/workspace/oxUtil/target/core-util-5.0.0-SNAPSHOT.jar
[INFO] 
[INFO] --- maven-install-plugin:2.3.1:install (default-install) @ core-util ---
[INFO] Installing /home/jenkins/.jenkins/jobs/_core_master/workspace/oxUtil/target/core-util-5.0.0-SNAPSHOT.jar to /var/www/html/maven/io/jans/core-util/5.0.0-SNAPSHOT/core-util-5.0.0-SNAPSHOT.jar
[INFO] Installing /home/jenkins/.jenkins/jobs/_core_master/workspace/oxUtil/pom.xml to /var/www/html/maven/io/jans/core-util/5.0.0-SNAPSHOT/core-util-5.0.0-SNAPSHOT.pom
[INFO]                                                                         
[INFO] ------------------------------------------------------------------------
[INFO] Building core-model 5.0.0-SNAPSHOT
[INFO] ------------------------------------------------------------------------
[INFO] 
[INFO] --- maven-clean-plugin:2.4.1:clean (default-clean) @ core-model ---
[INFO] Deleting /home/jenkins/.jenkins/jobs/_core_master/workspace/oxModel/target
[INFO] 
[INFO] --- maven-resources-plugin:2.4:resources (default-resources) @ core-model ---
[INFO] Using 'UTF-8' encoding to copy filtered resources.
[INFO] skip non existing resourceDirectory /home/jenkins/.jenkins/jobs/_core_master/workspace/oxModel/src/main/resources
[INFO] 
[INFO] --- maven-compiler-plugin:2.3.2:compile (default-compile) @ core-model ---
[INFO] Compiling 18 source files to /home/jenkins/.jenkins/jobs/_core_master/workspace/oxModel/target/classes
[INFO] 
[INFO] --- maven-resources-plugin:2.4:resources (default-resources) @ core-model ---
[INFO] Using 'UTF-8' encoding to copy filtered resources.
[INFO] skip non existing resourceDirectory /home/jenkins/.jenkins/jobs/_core_master/workspace/oxModel/src/main/resources
[INFO] 
[INFO] --- maven-compiler-plugin:2.3.2:compile (default-compile) @ core-model ---
[INFO] Nothing to compile - all classes are up to date
[INFO] 
[INFO] --- maven-resources-plugin:2.4:testResources (default-testResources) @ core-model ---
[INFO] Using 'UTF-8' encoding to copy filtered resources.
[INFO] skip non existing resourceDirectory /home/jenkins/.jenkins/jobs/_core_master/workspace/oxModel/src/test/resources
[INFO] 
[INFO] --- maven-compiler-plugin:2.3.2:testCompile (default-testCompile) @ core-model ---
[INFO] No sources to compile
[INFO] 
[INFO] --- maven-surefire-plugin:2.7.2:test (default-test) @ core-model ---
[INFO] No tests to run.
[INFO] Surefire report directory: /home/jenkins/.jenkins/jobs/_core_master/workspace/oxModel/target/surefire-reports

-------------------------------------------------------
 T E S T S
-------------------------------------------------------
There are no tests to run.

Results :

Tests run: 0, Failures: 0, Errors: 0, Skipped: 0

[INFO] 
[INFO] --- maven-jar-plugin:2.4:jar (default-jar) @ core-model ---
[INFO] Building jar: /home/jenkins/.jenkins/jobs/_core_master/workspace/oxModel/target/core-model-5.0.0-SNAPSHOT.jar
[INFO] 
[INFO] --- maven-install-plugin:2.3.1:install (default-install) @ core-model ---
[INFO] Installing /home/jenkins/.jenkins/jobs/_core_master/workspace/oxModel/target/core-model-5.0.0-SNAPSHOT.jar to /var/www/html/maven/io/jans/core-model/5.0.0-SNAPSHOT/core-model-5.0.0-SNAPSHOT.jar
[INFO] Installing /home/jenkins/.jenkins/jobs/_core_master/workspace/oxModel/pom.xml to /var/www/html/maven/io/jans/core-model/5.0.0-SNAPSHOT/core-model-5.0.0-SNAPSHOT.pom
[INFO]                                                                         
[INFO] ------------------------------------------------------------------------
[INFO] Building Caches support 5.0.0-SNAPSHOT
[INFO] ------------------------------------------------------------------------
[INFO] 
[INFO] --- maven-clean-plugin:2.4.1:clean (default-clean) @ core-cache ---
[INFO] Deleting /home/jenkins/.jenkins/jobs/_core_master/workspace/core-cache/target
[INFO] 
[INFO] --- maven-resources-plugin:2.4:resources (default-resources) @ core-cache ---
[INFO] Using 'UTF-8' encoding to copy filtered resources.
[INFO] Copying 1 resource
[INFO] 
[INFO] --- maven-compiler-plugin:2.3.2:compile (default-compile) @ core-cache ---
[INFO] Compiling 28 source files to /home/jenkins/.jenkins/jobs/_core_master/workspace/core-cache/target/classes
[INFO] 
[INFO] --- maven-resources-plugin:2.4:resources (default-resources) @ core-cache ---
[INFO] Using 'UTF-8' encoding to copy filtered resources.
[INFO] Copying 1 resource
[INFO] 
[INFO] --- maven-compiler-plugin:2.3.2:compile (default-compile) @ core-cache ---
[INFO] Nothing to compile - all classes are up to date
[INFO] 
[INFO] --- maven-resources-plugin:2.4:testResources (default-testResources) @ core-cache ---
[INFO] Using 'UTF-8' encoding to copy filtered resources.
[INFO] skip non existing resourceDirectory /home/jenkins/.jenkins/jobs/_core_master/workspace/core-cache/src/test/resources
[INFO] 
[INFO] --- maven-compiler-plugin:2.3.2:testCompile (default-testCompile) @ core-cache ---
[INFO] No sources to compile
[INFO] 
[INFO] --- maven-surefire-plugin:2.7.2:test (default-test) @ core-cache ---
[INFO] No tests to run.
[INFO] Surefire report directory: /home/jenkins/.jenkins/jobs/_core_master/workspace/core-cache/target/surefire-reports
There are no tests to run.
[INFO] 
[INFO] --- maven-jar-plugin:2.4:jar (default-jar) @ core-cache ---
[INFO] Building jar: /home/jenkins/.jenkins/jobs/_core_master/workspace/core-cache/target/core-cache-5.0.0-SNAPSHOT.jar
[INFO] 
[INFO] --- maven-install-plugin:2.3.1:install (default-install) @ core-cache ---
[INFO] Installing /home/jenkins/.jenkins/jobs/_core_master/workspace/core-cache/target/core-cache-5.0.0-SNAPSHOT.jar to /var/www/html/maven/io/jans/core-cache/5.0.0-SNAPSHOT/core-cache-5.0.0-SNAPSHOT.jar
[INFO] Installing /home/jenkins/.jenkins/jobs/_core_master/workspace/core-cache/pom.xml to /var/www/html/maven/io/jans/core-cache/5.0.0-SNAPSHOT/core-cache-5.0.0-SNAPSHOT.pom
[INFO]                                                                         
[INFO] ------------------------------------------------------------------------
[INFO] Building Caches support 5.0.0-SNAPSHOT
[INFO] ------------------------------------------------------------------------
[INFO] 
[INFO] --- maven-clean-plugin:2.4.1:clean (default-clean) @ core-document-store ---
[INFO] Deleting /home/jenkins/.jenkins/jobs/_core_master/workspace/core-document-store/target
[INFO] 
[INFO] --- maven-resources-plugin:2.4:resources (default-resources) @ core-document-store ---
[INFO] Using 'UTF-8' encoding to copy filtered resources.
[INFO] Copying 1 resource
[INFO] 
[INFO] --- maven-compiler-plugin:2.3.2:compile (default-compile) @ core-document-store ---
[INFO] Compiling 16 source files to /home/jenkins/.jenkins/jobs/_core_master/workspace/core-document-store/target/classes
[INFO] 
[INFO] --- maven-resources-plugin:2.4:resources (default-resources) @ core-document-store ---
[INFO] Using 'UTF-8' encoding to copy filtered resources.
[INFO] Copying 1 resource
[INFO] 
[INFO] --- maven-compiler-plugin:2.3.2:compile (default-compile) @ core-document-store ---
[INFO] Nothing to compile - all classes are up to date
[INFO] 
[INFO] --- maven-resources-plugin:2.4:testResources (default-testResources) @ core-document-store ---
[INFO] Using 'UTF-8' encoding to copy filtered resources.
[INFO] skip non existing resourceDirectory /home/jenkins/.jenkins/jobs/_core_master/workspace/core-document-store/src/test/resources
[INFO] 
[INFO] --- maven-compiler-plugin:2.3.2:testCompile (default-testCompile) @ core-document-store ---
[INFO] Compiling 1 source file to /home/jenkins/.jenkins/jobs/_core_master/workspace/core-document-store/target/test-classes
[INFO] 
[INFO] --- maven-surefire-plugin:2.7.2:test (default-test) @ core-document-store ---
[INFO] Surefire report directory: /home/jenkins/.jenkins/jobs/_core_master/workspace/core-document-store/target/surefire-reports

-------------------------------------------------------
 T E S T S
-------------------------------------------------------
Running TestSuite
Tests run: 0, Failures: 0, Errors: 0, Skipped: 0, Time elapsed: 0.255 sec
There are no tests to run.

Results :

Tests run: 0, Failures: 0, Errors: 0, Skipped: 0

[INFO] 
[INFO] --- maven-jar-plugin:2.4:jar (default-jar) @ core-document-store ---
[INFO] Building jar: /home/jenkins/.jenkins/jobs/_core_master/workspace/core-document-store/target/core-document-store-5.0.0-SNAPSHOT.jar
[INFO] 
[INFO] --- maven-install-plugin:2.3.1:install (default-install) @ core-document-store ---
[INFO] Installing /home/jenkins/.jenkins/jobs/_core_master/workspace/core-document-store/target/core-document-store-5.0.0-SNAPSHOT.jar to /var/www/html/maven/io/jans/core-document-store/5.0.0-SNAPSHOT/core-document-store-5.0.0-SNAPSHOT.jar
[INFO] Installing /home/jenkins/.jenkins/jobs/_core_master/workspace/core-document-store/pom.xml to /var/www/html/maven/io/jans/core-document-store/5.0.0-SNAPSHOT/core-document-store-5.0.0-SNAPSHOT.pom
[INFO]                                                                         
[INFO] ------------------------------------------------------------------------
[INFO] Building Configuration factories for standalone applications 5.0.0-SNAPSHOT
[INFO] ------------------------------------------------------------------------
[WARNING] The POM for io.jans:core-utils:jar:5.0.0-SNAPSHOT is missing, no dependency information available
[INFO] ------------------------------------------------------------------------
[INFO] Reactor Summary:
[INFO] 
[INFO] core ............................................... SUCCESS [  0.281 s]
[INFO] oxUtil ............................................. SUCCESS [  3.674 s]
[INFO] core-model ......................................... SUCCESS [  1.544 s]
[INFO] Caches support ..................................... SUCCESS [  2.059 s]
[INFO] Caches support ..................................... SUCCESS [  2.308 s]
[INFO] Configuration factories for standalone applications  FAILURE [  0.041 s]
[INFO] oxSaml ............................................. SKIPPED
[INFO] core-cdi ........................................... SKIPPED
[INFO] core-script ........................................ SKIPPED
[INFO] core-service ....................................... SKIPPED
[INFO] oxJsfUtil .......................................... SKIPPED
[INFO] Java extensions .................................... SKIPPED
[INFO] Weld CDI timer implementation ...................... SKIPPED
[INFO] security-extension-cdi ............................. SKIPPED
[INFO] exception-extension-cdi ............................ SKIPPED
[INFO] Web application specific classes ................... SKIPPED
[INFO] oxRadius ........................................... SKIPPED
[INFO] Demo CDI services .................................. SKIPPED
[INFO] ------------------------------------------------------------------------
[INFO] BUILD FAILURE
[INFO] ------------------------------------------------------------------------
[INFO] Total time: 10.848 s
[INFO] Finished at: 2020-10-05T17:13:21+00:00
[INFO] Final Memory: 65M/600M
[INFO] ------------------------------------------------------------------------
[ERROR] Failed to execute goal on project core-standalone: Could not resolve dependencies for project io.jans:core-standalone:jar:5.0.0-SNAPSHOT: Could not find artifact io.jans:core-utils:jar:5.0.0-SNAPSHOT -> [Help 1]
[ERROR] 
[ERROR] To see the full stack trace of the errors, re-run Maven with the -e switch.
[ERROR] Re-run Maven using the -X switch to enable full debug logging.
[ERROR] 
[ERROR] For more information about the errors and possible solutions, please read the following articles:
[ERROR] [Help 1] http://cwiki.apache.org/confluence/display/MAVEN/DependencyResolutionException
[ERROR] 
[ERROR] After correcting the problems, you can resume the build with the command
[ERROR]   mvn <goals> -rf :core-standalone
Build step 'Invoke top-level Maven targets' marked build as failure
[FINDBUGS] Skipping publisher since build result is FAILURE
TestNG Reports Processing: START
Looking for TestNG results report in workspace using pattern: **/testng-results.xml
testng-results.xml was last modified before this build started. Ignoring it.
testng-results.xml was last modified before this build started. Ignoring it.
testng-results.xml was last modified before this build started. Ignoring it.
testng-results.xml was last modified before this build started. Ignoring it.
Saving reports...
Processing '/home/jenkins/.jenkins/jobs/_core_master/builds/14/testng/testng-results.xml'
TestNG Reports Processing: FINISH
Not sending mail to unregistered user yzabrovarniy@gmail.com
Sending e-mails to: support@gluu.org
Finished: FAILURE