FailedConsole Output

Started by user Yuriy Movchan
Running as SYSTEM
Building on master in workspace /home/jenkins/.jenkins/jobs/Gluu_Radius_4.3.0/workspace
The recommended git tool is: NONE
No credentials specified
 > git rev-parse --is-inside-work-tree # timeout=10
Fetching changes from the remote Git repository
 > git config remote.origin.url https://github.com/GluuFederation/radius # timeout=10
Fetching upstream changes from https://github.com/GluuFederation/radius
 > git --version # timeout=10
 > git --version # 'git version 1.8.3.1'
 > git fetch --tags --progress https://github.com/GluuFederation/radius +refs/heads/*:refs/remotes/origin/* # timeout=10
 > git rev-parse refs/remotes/origin/version_4.3.0^{commit} # timeout=10
 > git rev-parse refs/remotes/origin/origin/version_4.3.0^{commit} # timeout=10
Checking out Revision 84ca072a467f084ac29405aeb708f3c987376e0e (refs/remotes/origin/version_4.3.0)
 > git config core.sparsecheckout # timeout=10
 > git checkout -f 84ca072a467f084ac29405aeb708f3c987376e0e # timeout=10
Commit message: "feat: use new ORM libs"
 > git rev-list --no-walk 2c4445467f5f8e6b68f97f4a5911918fce65a4e2 # timeout=10
[workspace] $ /home/jenkins/.jenkins/tools/hudson.tasks.Maven_MavenInstallation/maven_3.3.9/bin/mvn -DVERSION_NAME=version_4.3.0 -DMAVEN_SKIP_TESTS=true -Dmaven.test.skip=true clean compile install findbugs:findbugs
[INFO] Scanning for projects...
[INFO] ------------------------------------------------------------------------
[INFO] Reactor Build Order:
[INFO] 
[INFO] Super Gluu Radius
[INFO] Super Gluu Authentication Client
[INFO] Super Gluu Radius Server
[WARNING] The POM for org.apache.maven.plugins:surefire-plugin:jar:2.20.1 is missing, no dependency information available
[WARNING] Failed to retrieve plugin descriptor for org.apache.maven.plugins:surefire-plugin:2.20.1: Plugin org.apache.maven.plugins:surefire-plugin:2.20.1 or one of its dependencies could not be resolved: Failure to find org.apache.maven.plugins:surefire-plugin:jar:2.20.1 in https://repo.maven.apache.org/maven2 was cached in the local repository, resolution will not be reattempted until the update interval of central has elapsed or updates are forced
[INFO]                                                                         
[INFO] ------------------------------------------------------------------------
[INFO] Building Super Gluu Radius 4.3.0-SNAPSHOT
[INFO] ------------------------------------------------------------------------
[WARNING] The POM for org.apache.maven.plugins:surefire-plugin:jar:2.20.1 is missing, no dependency information available
[WARNING] Failed to retrieve plugin descriptor for org.apache.maven.plugins:surefire-plugin:2.20.1: Plugin org.apache.maven.plugins:surefire-plugin:2.20.1 or one of its dependencies could not be resolved: Failure to find org.apache.maven.plugins:surefire-plugin:jar:2.20.1 in https://repo.maven.apache.org/maven2 was cached in the local repository, resolution will not be reattempted until the update interval of central has elapsed or updates are forced
[INFO] 
[INFO] --- maven-clean-plugin:3.0.0:clean (default-clean) @ super-gluu-radius ---
[INFO] Deleting /home/jenkins/.jenkins/jobs/Gluu_Radius_4.3.0/workspace/target
[INFO] 
[INFO] --- maven-install-plugin:2.5.2:install (default-install) @ super-gluu-radius ---
[INFO] Installing /home/jenkins/.jenkins/jobs/Gluu_Radius_4.3.0/workspace/pom.xml to /var/www/html/maven/org/gluu/super-gluu-radius/4.3.0-SNAPSHOT/super-gluu-radius-4.3.0-SNAPSHOT.pom
[INFO] 
[INFO] --- findbugs-maven-plugin:3.0.5:findbugs (default-cli) @ super-gluu-radius ---
[INFO]                                                                         
[INFO] ------------------------------------------------------------------------
[INFO] Building Super Gluu Authentication Client 4.3.0-SNAPSHOT
[INFO] ------------------------------------------------------------------------
[WARNING] The POM for org.apache.maven.plugins:surefire-plugin:jar:2.20.1 is missing, no dependency information available
[WARNING] Failed to retrieve plugin descriptor for org.apache.maven.plugins:surefire-plugin:2.20.1: Plugin org.apache.maven.plugins:surefire-plugin:2.20.1 or one of its dependencies could not be resolved: Failure to find org.apache.maven.plugins:surefire-plugin:jar:2.20.1 in https://repo.maven.apache.org/maven2 was cached in the local repository, resolution will not be reattempted until the update interval of central has elapsed or updates are forced
[INFO] 
[INFO] --- maven-clean-plugin:3.0.0:clean (default-clean) @ supergluu-auth-client ---
[INFO] Deleting /home/jenkins/.jenkins/jobs/Gluu_Radius_4.3.0/workspace/SuperGluuAuth/target
[INFO] 
[INFO] --- maven-resources-plugin:3.0.2:resources (default-resources) @ supergluu-auth-client ---
[INFO] Using 'UTF-8' encoding to copy filtered resources.
[INFO] skip non existing resourceDirectory /home/jenkins/.jenkins/jobs/Gluu_Radius_4.3.0/workspace/SuperGluuAuth/src/main/resources
[INFO] 
[INFO] --- maven-compiler-plugin:3.7.0:compile (default-compile) @ supergluu-auth-client ---
[INFO] Changes detected - recompiling the module!
[INFO] Compiling 16 source files to /home/jenkins/.jenkins/jobs/Gluu_Radius_4.3.0/workspace/SuperGluuAuth/target/classes
[WARNING] /home/jenkins/.jenkins/jobs/Gluu_Radius_4.3.0/workspace/SuperGluuAuth/src/main/java/org/gluu/oxauth/client/supergluu/impl/SessionStatusResponse.java:[15,33] org.jboss.resteasy.client.ClientResponse in org.jboss.resteasy.client has been deprecated
[WARNING] /home/jenkins/.jenkins/jobs/Gluu_Radius_4.3.0/workspace/SuperGluuAuth/src/main/java/org/gluu/oxauth/client/supergluu/impl/SessionStatusResponse.java:[15,33] org.jboss.resteasy.client.ClientResponse in org.jboss.resteasy.client has been deprecated
[WARNING] /home/jenkins/.jenkins/jobs/Gluu_Radius_4.3.0/workspace/SuperGluuAuth/src/main/java/org/gluu/oxauth/client/supergluu/impl/SessionStatusResponse.java:[15,33] org.jboss.resteasy.client.ClientResponse in org.jboss.resteasy.client has been deprecated
[WARNING] /home/jenkins/.jenkins/jobs/Gluu_Radius_4.3.0/workspace/SuperGluuAuth/src/main/java/org/gluu/oxauth/client/supergluu/impl/SessionStatusResponse.java:[28,34] org.jboss.resteasy.client.ClientResponse in org.jboss.resteasy.client has been deprecated
[INFO] 
[INFO] --- maven-resources-plugin:3.0.2:resources (default-resources) @ supergluu-auth-client ---
[INFO] Using 'UTF-8' encoding to copy filtered resources.
[INFO] skip non existing resourceDirectory /home/jenkins/.jenkins/jobs/Gluu_Radius_4.3.0/workspace/SuperGluuAuth/src/main/resources
[INFO] 
[INFO] --- maven-compiler-plugin:3.7.0:compile (default-compile) @ supergluu-auth-client ---
[INFO] Nothing to compile - all classes are up to date
[INFO] 
[INFO] --- maven-resources-plugin:3.0.2:testResources (default-testResources) @ supergluu-auth-client ---
[INFO] Not copying test resources
[INFO] 
[INFO] --- maven-compiler-plugin:3.7.0:testCompile (default-testCompile) @ supergluu-auth-client ---
[INFO] Not compiling test sources
[INFO] 
[INFO] --- maven-surefire-plugin:2.12.4:test (default-test) @ supergluu-auth-client ---
[INFO] Tests are skipped.
[INFO] 
[INFO] --- maven-jar-plugin:2.4:jar (default-jar) @ supergluu-auth-client ---
[INFO] Building jar: /home/jenkins/.jenkins/jobs/Gluu_Radius_4.3.0/workspace/SuperGluuAuth/target/supergluu-auth-client-4.3.0-SNAPSHOT.jar
[INFO] 
[INFO] --- maven-install-plugin:2.5.2:install (default-install) @ supergluu-auth-client ---
[INFO] Installing /home/jenkins/.jenkins/jobs/Gluu_Radius_4.3.0/workspace/SuperGluuAuth/target/supergluu-auth-client-4.3.0-SNAPSHOT.jar to /var/www/html/maven/org/gluu/supergluu-auth-client/4.3.0-SNAPSHOT/supergluu-auth-client-4.3.0-SNAPSHOT.jar
[INFO] Installing /home/jenkins/.jenkins/jobs/Gluu_Radius_4.3.0/workspace/SuperGluuAuth/pom.xml to /var/www/html/maven/org/gluu/supergluu-auth-client/4.3.0-SNAPSHOT/supergluu-auth-client-4.3.0-SNAPSHOT.pom
[INFO] 
[INFO] --- findbugs-maven-plugin:3.0.5:findbugs (default-cli) @ supergluu-auth-client ---
[INFO] Fork Value is true
     [java] Warnings generated: 7
[INFO] Done FindBugs Analysis....
[INFO]                                                                         
[INFO] ------------------------------------------------------------------------
[INFO] Building Super Gluu Radius Server 4.3.0-SNAPSHOT
[INFO] ------------------------------------------------------------------------
[WARNING] The POM for org.apache.maven.plugins:surefire-plugin:jar:2.20.1 is missing, no dependency information available
[WARNING] Failed to retrieve plugin descriptor for org.apache.maven.plugins:surefire-plugin:2.20.1: Plugin org.apache.maven.plugins:surefire-plugin:2.20.1 or one of its dependencies could not be resolved: Failure to find org.apache.maven.plugins:surefire-plugin:jar:2.20.1 in https://repo.maven.apache.org/maven2 was cached in the local repository, resolution will not be reattempted until the update interval of central has elapsed or updates are forced
Downloading: https://ox.gluu.org/maven/org/apache/httpcomponents/httpcore/4.4.14/httpcore-4.4.14.pom

Downloading: https://repo.maven.apache.org/maven2/org/apache/httpcomponents/httpcore/4.4.14/httpcore-4.4.14.pom
2/5 KB   
3/5 KB   
5/5 KB   
5/5 KB   
         
Downloaded: https://repo.maven.apache.org/maven2/org/apache/httpcomponents/httpcore/4.4.14/httpcore-4.4.14.pom (5 KB at 40.8 KB/sec)
Downloading: https://ox.gluu.org/maven/org/apache/httpcomponents/httpcomponents-core/4.4.14/httpcomponents-core-4.4.14.pom
         
Downloading: https://repo.maven.apache.org/maven2/org/apache/httpcomponents/httpcomponents-core/4.4.14/httpcomponents-core-4.4.14.pom
2/13 KB   
3/13 KB   
5/13 KB   
6/13 KB   
7/13 KB   
9/13 KB   
10/13 KB   
11/13 KB   
13/13 KB   
13/13 KB   
           
Downloaded: https://repo.maven.apache.org/maven2/org/apache/httpcomponents/httpcomponents-core/4.4.14/httpcomponents-core-4.4.14.pom (13 KB at 476.0 KB/sec)
[INFO] 
[INFO] --- maven-clean-plugin:3.0.0:clean (default-clean) @ super-gluu-radius-server ---
[INFO] Deleting /home/jenkins/.jenkins/jobs/Gluu_Radius_4.3.0/workspace/Server/target
[INFO] 
[INFO] --- maven-resources-plugin:3.0.2:resources (default-resources) @ super-gluu-radius-server ---
[INFO] Using 'UTF-8' encoding to copy filtered resources.
[INFO] skip non existing resourceDirectory /home/jenkins/.jenkins/jobs/Gluu_Radius_4.3.0/workspace/Server/src/main/resources
[INFO] 
[INFO] --- maven-compiler-plugin:3.7.0:compile (default-compile) @ super-gluu-radius-server ---
[INFO] Changes detected - recompiling the module!
[INFO] Compiling 46 source files to /home/jenkins/.jenkins/jobs/Gluu_Radius_4.3.0/workspace/Server/target/classes
[INFO] -------------------------------------------------------------
[WARNING] COMPILATION WARNING : 
[INFO] -------------------------------------------------------------
[WARNING] No processor claimed any of these annotations: org.gluu.persist.annotation.CustomObjectClass,org.gluu.persist.annotation.DN,org.gluu.persist.annotation.AttributesList,org.gluu.persist.annotation.ObjectClass,org.gluu.persist.annotation.AttributeName,org.gluu.persist.annotation.DataEntry
[INFO] 1 warning
[INFO] -------------------------------------------------------------
[INFO] -------------------------------------------------------------
[ERROR] COMPILATION ERROR : 
[INFO] -------------------------------------------------------------
[ERROR] /home/jenkins/.jenkins/jobs/Gluu_Radius_4.3.0/workspace/Server/src/main/java/org/gluu/radius/persist/PersistenceEntryManagerFactory.java:[8,39] package org.gluu.persist.couchbase.impl does not exist
[ERROR] /home/jenkins/.jenkins/jobs/Gluu_Radius_4.3.0/workspace/Server/src/main/java/org/gluu/radius/persist/PersistenceEntryManagerFactory.java:[10,36] package org.gluu.persist.hybrid.impl does not exist
[ERROR] /home/jenkins/.jenkins/jobs/Gluu_Radius_4.3.0/workspace/Server/src/main/java/org/gluu/radius/persist/PersistenceEntryManagerFactory.java:[11,36] package org.gluu.persist.hybrid.impl does not exist
[ERROR] /home/jenkins/.jenkins/jobs/Gluu_Radius_4.3.0/workspace/Server/src/main/java/org/gluu/radius/model/AuthScope.java:[10,21] cannot find symbol
  symbol:   method values()
  location: @interface org.gluu.persist.annotation.ObjectClass
[INFO] 4 errors 
[INFO] -------------------------------------------------------------
[INFO] ------------------------------------------------------------------------
[INFO] Reactor Summary:
[INFO] 
[INFO] Super Gluu Radius .................................. SUCCESS [  3.057 s]
[INFO] Super Gluu Authentication Client ................... SUCCESS [ 15.614 s]
[INFO] Super Gluu Radius Server ........................... FAILURE [  2.656 s]
[INFO] ------------------------------------------------------------------------
[INFO] BUILD FAILURE
[INFO] ------------------------------------------------------------------------
[INFO] Total time: 22.164 s
[INFO] Finished at: 2021-05-20T19:39:38+00:00
[INFO] Final Memory: 49M/444M
[INFO] ------------------------------------------------------------------------
[ERROR] Failed to execute goal org.apache.maven.plugins:maven-compiler-plugin:3.7.0:compile (default-compile) on project super-gluu-radius-server: Compilation failure: Compilation failure:
[ERROR] /home/jenkins/.jenkins/jobs/Gluu_Radius_4.3.0/workspace/Server/src/main/java/org/gluu/radius/persist/PersistenceEntryManagerFactory.java:[8,39] package org.gluu.persist.couchbase.impl does not exist
[ERROR] /home/jenkins/.jenkins/jobs/Gluu_Radius_4.3.0/workspace/Server/src/main/java/org/gluu/radius/persist/PersistenceEntryManagerFactory.java:[10,36] package org.gluu.persist.hybrid.impl does not exist
[ERROR] /home/jenkins/.jenkins/jobs/Gluu_Radius_4.3.0/workspace/Server/src/main/java/org/gluu/radius/persist/PersistenceEntryManagerFactory.java:[11,36] package org.gluu.persist.hybrid.impl does not exist
[ERROR] /home/jenkins/.jenkins/jobs/Gluu_Radius_4.3.0/workspace/Server/src/main/java/org/gluu/radius/model/AuthScope.java:[10,21] cannot find symbol
[ERROR] symbol:   method values()
[ERROR] location: @interface org.gluu.persist.annotation.ObjectClass
[ERROR] -> [Help 1]
[ERROR] 
[ERROR] To see the full stack trace of the errors, re-run Maven with the -e switch.
[ERROR] Re-run Maven using the -X switch to enable full debug logging.
[ERROR] 
[ERROR] For more information about the errors and possible solutions, please read the following articles:
[ERROR] [Help 1] http://cwiki.apache.org/confluence/display/MAVEN/MojoFailureException
[ERROR] 
[ERROR] After correcting the problems, you can resume the build with the command
[ERROR]   mvn <goals> -rf :super-gluu-radius-server
Build step 'Invoke top-level Maven targets' marked build as failure
[FINDBUGS] Skipping publisher since build result is FAILURE
TestNG Reports Processing: START
Looking for TestNG results report in workspace using pattern: **/testng-results.xml
Did not find any matching files.
Not sending mail to unregistered user Yuriy.Movchan@gmail.com
Sending e-mails to: support@gluu.org
Finished: FAILURE