FailedConsole Output

Started by an SCM change
Running as SYSTEM
Building on master in workspace /home/jenkins/.jenkins/jobs/Gluu_Radius_4.2.0/workspace
No credentials specified
 > git rev-parse --is-inside-work-tree # timeout=10
Fetching changes from the remote Git repository
 > git config remote.origin.url https://github.com/GluuFederation/radius # timeout=10
Fetching upstream changes from https://github.com/GluuFederation/radius
 > git --version # timeout=10
 > git fetch --tags --progress https://github.com/GluuFederation/radius +refs/heads/*:refs/remotes/origin/* # timeout=10
 > git rev-parse refs/remotes/origin/master^{commit} # timeout=10
 > git rev-parse refs/remotes/origin/origin/master^{commit} # timeout=10
Checking out Revision d8c7b748315f00ebd77fca0a2991c86343e519b8 (refs/remotes/origin/master)
 > git config core.sparsecheckout # timeout=10
 > git checkout -f d8c7b748315f00ebd77fca0a2991c86343e519b8 # timeout=10
Commit message: "Branch for version 5.0"
 > git rev-list --no-walk 1dd47056a3b92bb33a6fb5295c855e15a210fd0d # timeout=10
[workspace] $ /home/jenkins/.jenkins/tools/hudson.tasks.Maven_MavenInstallation/maven_3.3.9/bin/mvn -DVERSION_NAME=master -DMAVEN_SKIP_TESTS=false -Dmaven.test.skip=false clean compile install findbugs:findbugs
[INFO] Scanning for projects...
[INFO] ------------------------------------------------------------------------
[INFO] Reactor Build Order:
[INFO] 
[INFO] Super Gluu Radius
[INFO] Super Gluu Authentication Client
[INFO] Super Gluu Radius Server
[WARNING] The POM for org.apache.maven.plugins:surefire-plugin:jar:2.20.1 is missing, no dependency information available
[WARNING] Failed to retrieve plugin descriptor for org.apache.maven.plugins:surefire-plugin:2.20.1: Plugin org.apache.maven.plugins:surefire-plugin:2.20.1 or one of its dependencies could not be resolved: Failure to find org.apache.maven.plugins:surefire-plugin:jar:2.20.1 in https://repo.maven.apache.org/maven2 was cached in the local repository, resolution will not be reattempted until the update interval of central has elapsed or updates are forced
[INFO]                                                                         
[INFO] ------------------------------------------------------------------------
[INFO] Building Super Gluu Radius 5.0.0-SNAPSHOT
[INFO] ------------------------------------------------------------------------
[WARNING] The POM for org.apache.maven.plugins:surefire-plugin:jar:2.20.1 is missing, no dependency information available
[WARNING] Failed to retrieve plugin descriptor for org.apache.maven.plugins:surefire-plugin:2.20.1: Plugin org.apache.maven.plugins:surefire-plugin:2.20.1 or one of its dependencies could not be resolved: Failure to find org.apache.maven.plugins:surefire-plugin:jar:2.20.1 in https://repo.maven.apache.org/maven2 was cached in the local repository, resolution will not be reattempted until the update interval of central has elapsed or updates are forced
[INFO] 
[INFO] --- maven-clean-plugin:3.0.0:clean (default-clean) @ super-gluu-radius ---
[INFO] Deleting /home/jenkins/.jenkins/jobs/Gluu_Radius_4.2.0/workspace/target
[INFO] 
[INFO] --- maven-install-plugin:2.5.2:install (default-install) @ super-gluu-radius ---
[INFO] Installing /home/jenkins/.jenkins/jobs/Gluu_Radius_4.2.0/workspace/pom.xml to /var/www/html/maven/org/gluu/super-gluu-radius/5.0.0-SNAPSHOT/super-gluu-radius-5.0.0-SNAPSHOT.pom
[INFO] 
[INFO] --- findbugs-maven-plugin:3.0.5:findbugs (default-cli) @ super-gluu-radius ---
[INFO]                                                                         
[INFO] ------------------------------------------------------------------------
[INFO] Building Super Gluu Authentication Client 5.0.0-SNAPSHOT
[INFO] ------------------------------------------------------------------------
[WARNING] The POM for org.apache.maven.plugins:surefire-plugin:jar:2.20.1 is missing, no dependency information available
[WARNING] Failed to retrieve plugin descriptor for org.apache.maven.plugins:surefire-plugin:2.20.1: Plugin org.apache.maven.plugins:surefire-plugin:2.20.1 or one of its dependencies could not be resolved: Failure to find org.apache.maven.plugins:surefire-plugin:jar:2.20.1 in https://repo.maven.apache.org/maven2 was cached in the local repository, resolution will not be reattempted until the update interval of central has elapsed or updates are forced
Downloading: https://ox.gluu.org/maven/org/gluu/oxauth-client/5.0.0-SNAPSHOT/maven-metadata.xml

Downloading: https://ox.gluu.org/maven/org/gluu/oxauth-client/5.0.0-SNAPSHOT/oxauth-client-5.0.0-SNAPSHOT.pom

[WARNING] The POM for org.gluu:oxauth-client:jar:5.0.0-SNAPSHOT is missing, no dependency information available
Downloading: https://ox.gluu.org/maven/org/gluu/oxauth-client/5.0.0-SNAPSHOT/oxauth-client-5.0.0-SNAPSHOT.jar

[INFO] ------------------------------------------------------------------------
[INFO] Reactor Summary:
[INFO] 
[INFO] Super Gluu Radius .................................. SUCCESS [  4.294 s]
[INFO] Super Gluu Authentication Client ................... FAILURE [  1.577 s]
[INFO] Super Gluu Radius Server ........................... SKIPPED
[INFO] ------------------------------------------------------------------------
[INFO] BUILD FAILURE
[INFO] ------------------------------------------------------------------------
[INFO] Total time: 6.856 s
[INFO] Finished at: 2020-07-14T14:16:38+00:00
[INFO] Final Memory: 23M/304M
[INFO] ------------------------------------------------------------------------
[ERROR] Failed to execute goal on project supergluu-auth-client: Could not resolve dependencies for project org.gluu:supergluu-auth-client:jar:5.0.0-SNAPSHOT: Could not find artifact org.gluu:oxauth-client:jar:5.0.0-SNAPSHOT in gluu (https://ox.gluu.org/maven) -> [Help 1]
[ERROR] 
[ERROR] To see the full stack trace of the errors, re-run Maven with the -e switch.
[ERROR] Re-run Maven using the -X switch to enable full debug logging.
[ERROR] 
[ERROR] For more information about the errors and possible solutions, please read the following articles:
[ERROR] [Help 1] http://cwiki.apache.org/confluence/display/MAVEN/DependencyResolutionException
[ERROR] 
[ERROR] After correcting the problems, you can resume the build with the command
[ERROR]   mvn <goals> -rf :supergluu-auth-client
Build step 'Invoke top-level Maven targets' marked build as failure
[FINDBUGS] Skipping publisher since build result is FAILURE
TestNG Reports Processing: START
Looking for TestNG results report in workspace using pattern: **/testng-results.xml
Did not find any matching files.
Not sending mail to unregistered user Yuriy.Movchan@gmail.com
Sending e-mails to: support@gluu.org
Finished: FAILURE